{"text_format":"1","workbook":"xlsx","n_sheets":22,"sheets":["Planilha1","Planilha","Validação de dados","icones","Tecnicas e Pop´s","Descrição de Pop´s","Integração","Treinamentos","Geral","hplc","Espectro","Karl fischer","Agua","Titulação","Peso Medio","Validação","Teor A.","Perfil","Perda S.","GQ-Descrição de Pop´s ","GQ-Trein.Autorizados ","GQ-Trein.Pops"],"not_rendered":{"charts":0,"images":145,"macros":1,"external_links":0,"defined_names":0,"comments":0,"pivot_tables":0},"unopened":[],"bounds":{"document_bytes":16777216,"sheet_cells":100000,"rows_first":2000,"rows_last":500,"rows_between":2000,"halvings":0,"cell_chars":16384,"cell_head_chars":4096},"cells_cut":0,"cells_raw":0,"read":"whole","date_system":"1900"}

{"sheet":"Planilha1","index":0,"n_rows":32,"n_cols":14,"rows_kept":32,"cut":false,"hidden":false,"merged":[]}
[]
[null,"alterações/ajustes que fiz desde a planilha Geral até a planilha Perda S.:",null,null,null,null,null,null,null,null,null,null,null,"funcionamento da macro, cujo código está no módulo de EstaPasta_de_trabalho"]
[null,"1. excluí uma linha acima do primeiro nome"]
[null,"2. centralizei os retângulos que contém os nomes em relação às linhas verdes",null,null,null,null,null,null,null,null,null,null,null,"Em qualquer das planilhas, da planilha Geral até Perda S., ao ser inserido o texto"]
[null,"3. redimensionei as alturas dos shapes (retângulos) que contém os nomes dos colaboradores (todos com 1,24)",null,null,null,null,null,null,null,null,null,null,null,"\"Trein. Finalizado\", via Validação existente nas células, e se toda aquela linha estiver"]
[null,"4. excluí uma terceira linha entre os shapes com os nomes/entre as linhas verdes, onde havia essa terceira linha",null,null,null,null,null,null,null,null,null,null,null,"preenchida com o citado texto, então a macro irá lançar a data do dia na planilha"]
[null,"5. refiz a Validação de Dados de todas as planilhas com base na planilha Validação de dados!D5:D6",null,null,null,null,null,null,null,null,null,null,null," Treinamentos, na célula correspondente ao colaborador e ao treinamento."]
[null,"6. removi a Validação de células não envolvidas no processo"]
[null,null,null,null,null,null,null,null,null,null,null,null,null,"Ao final da execução da macro será exibida uma Caixa de Mensagem para informar"]
[null,"alterações que fiz na planilha Treinamentos:",null,null,null,null,null,null,null,null,null,null,null,"o endereço da célula em que a data foi inserida."]
[null,"7. nos shapes corrigi o nome de Erika para Éricka (acento e a letra C) conforme está nas demais planilhas"]
[null,"8. ajustei a altura das linhas para a medida 15"]
[null,"9. removi espaço no final do nome Caroline (11 ocorrências)"]
[null,"10. em todas as células correspondentes a cada colaborador, em cada treinamento, no lugar da fórmula abaixo"]
[null,"=SE(Geral!H13<>\"Trein. Finalizado\";\"Em Treinamento\";SE(Geral!J13<>\"Trein. Finalizado\";\"Em Treinamento\";SE(Geral!L13<>\"Trein. Finalizado\";\"Em Treinamento\";SE(Geral!N13<>\"Trein. Finalizado\";\"Em Treinamento\";SE(Geral!P13<>\"Trein. Finalizado\";\"Em Treinamento\";SE(Geral!R13<>\"Trein. Finalizado\";\"Em Treinamento\";SE(Geral!T13<>\"Trein. Finalizado\";\"Em Treinamento\";SE(Geral!V13<>\"Trein. Finalizado\";\"Em Treinamento\";SE(Geral!X13<>\"Trein. Finalizado\";\"Em Treinamento\";SE(Geral!Z13<>\"Trein. Finalizado\";\"Em Treinamento\";SE(Geral!AB13<>\"Trein. Finalizado\";\"Em Treinamento\";SE(Geral!AD13<>\"Trein. Finalizado\";\"Em Treinamento\";SE(Geral!AF13<>\"Trein. Finalizado\";\"Em Treinamento\";SE(Geral!AH13<>\"Trein. Finalizado\";\"Em Treinamento\";SE(Geral!AJ13<>\"Trein. Finalizado\";\"Em Treinamento\";\"Treinamento Finalizado\")))))))))))))))"]
[null,"coloquei essa abaixo"]
[null,"=SE(CONT.SE(Geral!F13:AM13;\"Trein. Finalizado\")=17;\"Treinamento Finalizado\";SE(CONTAR.VAZIO(Geral!F13:AM13)=34;\"* * * * *\";\"Em Treinamento\"))"]
[null,"11. deletei as fórmulas que continham a função HOJE(), essas são as células"]
[null,"que receberão a data inserida pela macro(células com preenchimento na cor preta)"]
[]
[null,"alterações que fiz na planilha Validação"]
[null,"12. removi um espaço no final do nome da planilha"]
[]
[null,"Fórmulas na Planilha Treinamentos"]
[null,"situação das células nas planilhas Geral até Perda por Secagem",null,null,null,null,null,null,"resultado da fórmula",null,">>>","=SE(CONT.SE(Geral!F13:AM13;\"Trein. Finalizado\")=17;\"Treinamento Finalizado\";SE(CONTAR.VAZIO(Geral!F13:AM13)=34;\"* * * * *\";\"Em Treinamento\"))"]
[null,"todas preenchidas com Trein. Finalizado",null,null,null,null,null,null,"Treinamento Finalizado"]
[null,"todas preenchidas com Em Treinamento",null,null,null,null,null,null,"Em Treinamento"]
[null,"todas vazias",null,null,null,null,null,null,"* * * * *"]
[null,"algumas Trein. Finalizado e as demais Em Treinamento",null,null,null,null,null,null,"Em Treinamento"]
[null,"algumas Trein. Finalizado e as demais vazias",null,null,null,null,null,null,"Em Treinamento"]
[null,"algumas Em Treinamento e as demais vazias",null,null,null,null,null,null,"Em Treinamento"]
[null,"algumas Trein. Finalizado, algumas Em Treinamento e as demais vazias",null,null,null,null,null,null,"Em Treinamento"]

{"sheet":"Planilha","index":1,"n_rows":0,"n_cols":0,"rows_kept":0,"cut":false,"hidden":false,"merged":[[0,0,4,0],[0,2,4,19]]}

{"sheet":"Validação de dados","index":2,"n_rows":15,"n_cols":8,"rows_kept":15,"cut":false,"hidden":false,"merged":[[2,0,2,1]]}
[]
[null,null,null,"As duas células abaixo são as fontes"]
["Pop´s Geral",null,null,"para a Validação de Dados aplicada"]
[null,null,null,"nas planilhas Geral até Perda S."]
["POP TEC 002","POP EQ 090",null,"Em Treinamento",null,null,null,"Autorizado(a)"]
["POP TEC 003","POP EQ 099",null,"Trein. Finalizado"]
["POP TEC 010","POP EQ 115"]
["POP TEC 018","xxx"]
["POP TEC 019","xxx"]
["POP TEC 020","xxx"]
["POP TEC 070","xxx"]
["POP TEC 077","xxx"]
["POP TEC 079","xxx"]
["POP TEC 101","xxx"]
[" POP TEC 104                                 ","xxx"]

{"sheet":"icones","index":3,"n_rows":14,"n_cols":14,"rows_kept":14,"cut":false,"hidden":false,"merged":[]}
[]
[]
[]
[]
[]
[]
[null,null,null,null,null,null,null,null,null,null,null,null,null,"titulaç;ao"]
[]
[]
[]
[]
[]
[]
[null,null,null,{"$f":"icones!P2=IF(Geral!F13<>\"Trein. Finalizado\",\"Em treinamento\",IF(Geral!H13<>\"Trein. Finalizado\",\"Em treinamento\",IF(Geral!L13<>\"Trein. Finalizado\",\"Em treinamento\",IF(Geral!P13<>\"Trein. Finalizado\",\"Em Treinamento\",IF(Geral!R13<>\"Trein. Finalizado\",\"Em treinamento\",IF(Geral!T13<>\"Trein. Finalizado\",\"Em Treinamento\",IF(Geral!V13<>\"Trein. Finalizado\",\"Em Treinamento\",IF(Geral!X13<>\"Trein. Finalizado\",\"Em Treinamento\",IF(Geral!Z13<>\"Trein. Finalizado\",\"Em treinamento\",IF(Geral!Z13<>\"Trein. Finalizado\",\"Em Treinamento\",IF(Geral!AB13<>\"Trein. Finalizado\",\"Em treinamento\",IF(Geral!AD13<>\"Trein. Finalizado\",\"Em Treinamento\",IF(Geral!AD13<>\"Trein. Finalizado\",\"Em treinamento\",IF(Geral!AF13<>\"Trein. Finalizado\",\"Em treinamento\",IF(Geral!AJ13<>\"Trein. Finalizado\",\"Em Treinamento\",IF(Geral!AL13<>\"Trein. Finalizado\",\"Em treinamento\",\"Apto\"))))))))))))))))","v":false}]

{"sheet":"Tecnicas e Pop´s","index":4,"n_rows":72,"n_cols":13,"rows_kept":72,"cut":false,"hidden":false,"merged":[[0,0,4,0],[43,11,47,11],[50,11,52,11],[55,11,61,11],[0,2,4,13]]}
[null,null," MATRIZ DE VERSATILIDADE -  F 140 R01"]
[]
[]
[]
[]
[]
[]
[]
[]
[]
[]
[]
[]
[]
[]
[null,null,null,null,null,null,null,null,null,null,null,"POP TEC 001","POP EQ 017"]
[null,null,null,"                                Manual do Sistema de Gestão da Qualidade",null,null,null,null,null,null,null,"POP TEC 065","xxx"]
[null,null,null,"                                Manual do laboratorio"]
[null,null,null,null,null,"PRO 01 Controle de Documentos e Registros"]
[null,null,null,null,null,"PRO 02  Recursos Humanos"]
[null,null,null,null,null,"PRO 03 Manutenção e Infraestrutura"]
[null,null,null,null,null,"PRO 04 Vendas"]
[null,null,null,null,null,"PRO 05 Aquisição",null,null,null,null,null,"POP TEC 001","POP EQ 001"]
[null,null,null,null,null,"PRO 06 Ensaio de Amostras",null,null,null,null,null,"xxx","POP EQ 021"]
[null,null,null,null,null,"PRO 07 Calibração e Qualificação de Equipamentos"]
[null,null,null,null,null,"PRO 08 Auditoria Interna"]
[null,null,null,null,null,"PRO 09 Controle de Saídas Não Conforme"]
[null,null,null,null,null,"PRO 10 Ação Corretiva / Preventiva e Mehorias"]
[null,null,null,null,null,"PRO 11Confidencialidade e Imparcialidade",null,null,null,null,null,"POP TEC 014","POP EQ 016"]
[null,null,null,null,null,"PRO 12 Gestão de Riscos e Oportunidades",null,null,null,null,null,"POP TEC 091","POP EQ 021"]
[null,null,null,null,null,"PRO 13 Garantia da Validade dos Resultados",null,null,null,null,null,"POP TEC 102","POP EQ 098"]
[]
[]
[]
[null,null,null,null,null,"POP TEC 065","POP EQ 115"]
[null,null,null,null,null,"POP TEC 078","xxx"]
[null,null,null,null,null,null,null,null,null,null,null,"POP TEC 001","POP EQ 001"]
[null,null,null,null,null,null,null,null,null,null,null,"xxx","POP EQ 021"]
[]
[]
[]
[]
[null,null,null,null,null,"POP TEC 001","POP EQ 082"]
[null,null,null,null,null,"POP TEC 111","xxx",null,null,null,null,"POP TEC 112","POP EQ 001"]
[null,null,null,null,null,null,null,null,null,null,null,null,"POP EQ 004"]
[null,null,null,null,null,null,null,null,null,null,null,null,"POP EQ 021"]
[null,null,null,null,null,null,null,null,null,null,null,null,"POP EQ 076"]
[]
[]
[null,null,null,null,null,"  POP TEC 113","POP EQ 008"]
[null,null,null,null,null,"POP TEC 132","POP EQ 083",null,null,null,null,"XXX","POP EQ 001"]
[null,null,null,null,null,null,null,null,null,null,null,null,"POP EQ 007"]
[null,null,null,null,null,null,null,null,null,null,null,null,"POP EQ 021"]
[]
[]
[null,null,null,null,null,null,null,null,null,null,null,"POP TEC 131"]
[null,null,null,null,null," POP TEC 066","POP EQ 001"]
[null,null,null,null,null,"POP TEC 080","POP EQ 021",null,null,null,null,null,"POP EQ 116"]
[null,null,null,null,null,null,null,null,null,null,null,null,"POP EQ 117"]
[]
[]
[null,null,null,null,null,"POP TEC 002","POP EQ 090"]
[null,null,null,null,null,"POP TEC 003","POP EQ 099"]
[null,null,null,null,null,"POP TEC 010","POP EQ 115"]
[null,null,null,null,null,"POP TEC 018","xxx"]
[null,null,null,null,null,"POP TEC 019","xxx"]
[null,null,null,null,null,"POP TEC 020","xxx"]
[null,null,null,null,null,"POP TEC 070","xxx"]
[null,null,null,null,null,"POP TEC 077","xxx"]
[null,null,null,null,null,"POP TEC 079","xxx"]
[null,null,null,null,null,"POP TEC 101","xxx"]
[null,null,null,null,null,"POP TEC 104                                 ","xxx"]

{"sheet":"Descrição de Pop´s","index":5,"n_rows":40,"n_cols":18,"rows_kept":40,"cut":false,"hidden":false,"merged":[[14,17,14,27],[15,17,15,27],[13,3,13,13],[14,3,14,13],[15,3,15,13],[0,0,4,0],[6,2,11,11],[6,16,11,28],[13,17,13,27],[0,2,4,28],[39,3,39,13],[38,3,38,13],[16,3,16,13],[17,3,17,13],[18,3,18,13],[19,3,19,13],[20,3,20,13],[21,3,21,13],[22,3,22,13],[23,3,23,13],[24,3,24,13],[25,3,25,13],[26,3,26,13],[27,3,27,13],[28,3,28,13],[29,3,29,13],[35,3,35,13],[36,3,36,13],[37,3,37,13],[30,3,30,13],[31,3,31,13],[32,3,32,13],[33,3,33,13],[34,3,34,13]]}
[null,null," MATRIZ DE VERSATILIDADE - F 140  R01"]
[]
[]
[]
[]
[]
[null,null,"                  Pop´s Técnicos ",null,null,null,null,null,null,null,null,null,null,null,null,null,"     Pop´s Equipamentos "]
[]
[]
[]
[]
[]
[]
[null,null,"POP TEC - 001","Preparação e Controle de Soluções Reagente e Fases-Móveis do Laboratório.",null,null,null,null,null,null,null,null,null,null,null,null,"POP EQ - 001","Utilização e Limpeza da Balança Analítica Prix Série AS"]
[null,null,"POP TEC - 002","Recepção, armazenamento controle e utilização de Reagentes analiticos ",null,null,null,null,null,null,null,null,null,null,null,null,"POP EQ - 004","Utilização e Limpeza do Aparelho de Dissolução"]
[null,null,"POP TEC - 003","Registro de Dados Analíticos pelo Controle de Qualidade",null,null,null,null,null,null,null,null,null,null,null,null,"POP EQ - 007","Utilização e Limpeza Estufa de Secagem e Esterilização "]
[null,null,"POP TEC - 010","Verificação e Registros Diários de Temperatura e Umidade Relativa do Ar",null,null,null,null,null,null,null,null,null,null,null,null,"POP EQ - 008","Utilização e Limpeza do PHMETRO Quimis Q400A / Q400AS"]
[null,null,"POP TEC - 013","Preparação, Padronização e Controle de Materiais de Referência ",null,null,null,null,null,null,null,null,null,null,null,null,"POP EQ - 016","Utilização e Limpeza HPLC MERCK (DAD e UV)"]
[null,null,"POP TEC - 014","Procedimento para Validação de Métodos Analíticos",null,null,null,null,null,null,null,null,null,null,null,null,"POP EQ - 016","Utilização e Limpeza HPLC MERCK (DAD e UV)"]
[null,null,"POP TEC - 018","Métodos Analíticos",null,null,null,null,null,null,null,null,null,null,null,null,"POP EQ - 017","Utilização e Limpeza Espectrofotômetro "]
[null,null,"POP TEC - 019","Preenchimento de Log Book",null,null,null,null,null,null,null,null,null,null,null,null,"POP EQ - 021","Utilização e Limpeza da Balança Analítica Shimadzu Modelo AX 200 e AY 220"]
[null,null,"POP TEC - 020","Descarte de Resíduos",null,null,null,null,null,null,null,null,null,null,null,null,"POP EQ - 076 ","Utilização e Limpeza do Aparelho de Dissolução Quimis"]
[null,null,"POP TEC - 065","Método Geral para Uniformidade de Conteúdo",null,null,null,null,null,null,null,null,null,null,null,null,"POP EQ - 082","Utilização e Limpeza do Karl Fisher"]
[null,null,"POP TEC - 066","Método Geral para Determinação de Peso Médio",null,null,null,null,null,null,null,null,null,null,null,null,"POP EQ - 083","Utilização e Limpeza do Condutivímetro Hanna HI 98192"]
[null,null,"POP TEC - 070","Método Geral para Resultado Fora de Especificação",null,null,null,null,null,null,null,null,null,null,null,null,"POP EQ - 084","Utilização e Limpeza do Condutivímetro INOLAB COND 7110"]
[null,null,"POP TEC - 077","Liberação de Água do Ultrapurificador GEHAKA MS 2000",null,null,null,null,null,null,null,null,null,null,null,null,"POP EQ - 090","Utilização e Limpeza  do Dessecador DRY Box"]
[null,null,"POP TEC - 078","Manutenção Coluna HPLC.",null,null,null,null,null,null,null,null,null,null,null,null,"POP EQ - 098","Utilização e Limpeza do HPLC MERCK CHROMASTER"]
[null,null,"POP TEC - 079","Verificação e Registro de Temperatura da Geladeira",null,null,null,null,null,null,null,null,null,null,null,null,"POP EQ - 099","Utilização e Limpeza do Ultrapurificador GEHAKA MS 2000"]
[null,null,"POP TEC - 080","Critérios de Aceitação e Verificação Diárias das Balanças Analiticas",null,null,null,null,null,null,null,null,null,null,null,null,"POP EQ - 115","Utilização e Limpeza da Lavadora Ultrasom SONITOP 425-A"]
[null,null,"POP TEC - 091","Cálculo de Incerteza de Medição",null,null,null,null,null,null,null,null,null,null,null,null,"POP EQ - 116","Utilização e Limpeza do Friabilometro"]
[null,null,"POP TEC - 100","Limpeza do Laboratório",null,null,null,null,null,null,null,null,null,null,null,null,"POP EQ - 117","Utilização e Limpeza do Durômetro"]
[null,null,"POP TEC - 101","Método de Arredondamento",null,null,null,null,null,null,null,null,null,null,null,null,"POP EQ - 118","Utilização e Limpeza do Condutivimetro  HANNA HI 98309"]
[null,null,"POP TEC - 102","Planejamento e Execusão para Pesquisa e Desenvolvimento "]
[null,null,"POP TEC - 104","Utilização de Pipetas de Vidro, Volumétrica e Graduada"]
[null,null,"POP TEC - 111","Método Geral de Karl Fisher"]
[null,null,"POP TEC - 112","Método Geral de Teste de Dissolução"]
[null,null,"POP TEC - 113","Método Geral de Condutividade da Água"]
[null,null,"POP TEC - 131","Método Geral de Determinação de Resistencia Mecânica em comprimidos"]
[null,null,"POP TEC - 132","Método Geral de Medição de pH"]
[null,null,"POP TEC - 133","Coletas de amostras - Veterinárias"]

{"sheet":"Integração","index":6,"n_rows":30,"n_cols":19,"rows_kept":30,"cut":false,"hidden":false,"merged":[[0,2,4,24],[21,18,22,21],[21,8,22,11],[21,13,22,16],[21,3,22,6],[29,18,30,21],[29,3,30,6],[25,8,26,11],[29,8,30,11],[25,13,26,16],[29,13,30,16],[25,18,26,21],[25,3,26,6],[10,18,11,21],[14,18,15,21],[17,18,18,21],[0,0,4,0],[10,13,11,16],[14,13,15,16],[17,13,18,16],[10,3,11,6],[14,3,15,6],[17,3,18,6],[10,8,11,11],[14,8,15,11],[17,8,18,11]]}
[null,null," MATRIZ DE VERSATILIDADE - F 140  R01"]
[]
[]
[]
[]
[]
[]
[]
[]
[]
[null,null,null,"Treinamento Finalizado",null,null,null,null,"Treinamento Finalizado",null,null,null,null,"Treinamento Finalizado",null,null,null,null,"Treinamento Finalizado"]
[]
[]
[]
[null,null,null,"Treinamento Finalizado",null,null,null,null,"Treinamento Finalizado",null,null,null,null,"Treinamento Finalizado",null,null,null,null,"Treinamento Finalizado"]
[]
[]
[null,null,null,"Treinamento Finalizado",null,null,null,null,"Treinamento Finalizado",null,null,null,null,"Treinamento Finalizado",null,null,null,null,"Treinamento Finalizado"]
[]
[null,null,null,null,null,null,null,"Treinamento Finalizado"]
[]
[null,null,null,"Treinamento Finalizado",null,null,null,null,"Treinamento Finalizado",null,null,null,null,"Treinamento Finalizado",null,null,null,null,"Treinamento Finalizado"]
[]
[]
[]
[null,null,null,null,null,null,null,null,"Treinamento Finalizado",null,null,null,null,"Treinamento Finalizado",null,null,null,null,"Treinamento Finalizado"]
[]
[]
[]
[null,null,null,null,null,null,null,null,"Treinamento Finalizado",null,null,null,null,"Treinamento Finalizado"]

{"sheet":"Treinamentos","index":7,"n_rows":60,"n_cols":73,"rows_kept":60,"cut":false,"hidden":false,"merged":[[73,63,73,64],[73,66,73,67],[73,69,73,70],[73,72,73,73],[73,36,73,37],[73,39,73,40],[73,42,73,43],[73,45,73,46],[73,48,73,49],[73,51,73,52],[73,54,73,55],[73,57,73,58],[73,60,73,61],[73,9,73,10],[73,12,73,13],[73,15,73,16],[73,18,73,19],[73,21,73,22],[73,24,73,25],[73,27,73,28],[73,30,73,31],[73,33,73,34],[66,48,66,49],[66,51,66,52],[66,54,66,55],[66,57,66,58],[66,60,66,61],[66,63,66,64],[66,66,66,67],[66,69,66,70],[66,72,66,73],[66,21,66,22],[66,24,66,25],[66,27,66,28],[66,30,66,31],[66,33,66,34],[66,36,66,37],[66,39,66,40],[66,42,66,43],[66,45,66,46],[59,33,59,34],[59,36,59,37],[59,39,59,40],[59,42,59,43],[59,45,59,46],[59,48,59,49],[59,51,59,52],[59,54,59,55],[59,57,59,58],[45,63,45,64],[45,66,45,67],[45,69,45,70],[45,72,45,73],[52,9,52,10],[52,12,52,13],[52,15,52,16],[52,18,52,19],[52,21,52,22],[52,24,52,25],[52,27,52,28],[52,30,52,31],[52,33,52,34],[52,36,52,37],[52,39,52,40],[52,42,52,43],[52,45,52,46],[52,48,52,49],[52,51,52,52],[52,54,52,55],[52,57,52,58],[52,60,52,61],[52,63,52,64],[52,66,52,67],[45,36,45,37],[45,39,45,40],[45,42,45,43],[45,45,45,46],[45,48,45,49],[45,51,45,52],[45,54,45,55],[45,57,45,58],[45,60,45,61],[45,9,45,10],[45,12,45,13],[45,15,45,16],[45,18,45,19],[45,21,45,22],[45,24,45,25],[45,27,45,28],[45,30,45,31],[45,33,45,34],[37,36,37,37],[37,39,37,40],[37,42,37,43],[37,45,37,46],[37,48,37,49],[37,51,37,52],[37,54,37,55],[37,57,37,58],[37,60,37,61],[37,9,37,10],[37,12,37,13],[37,15,37,16],[37,18,37,19],[37,21,37,22],[37,24,37,25],[37,27,37,28],[37,30,37,31],[37,33,37,34],[30,36,30,37],[30,39,30,40],[30,42,30,43],[30,45,30,46],[30,48,30,49],[30,51,30,52],[30,54,30,55],[30,57,30,58],[30,60,30,61],[30,9,30,10],[30,12,30,13],[30,15,30,16],[30,18,30,19],[30,21,30,22],[30,24,30,25],[30,27,30,28],[30,30,30,31],[30,33,30,34],[17,54,17,55],[17,57,17,58],[17,60,17,61],[17,63,17,64],[17,66,17,67],[17,69,17,70],[17,72,17,73],[23,9,23,10],[23,12,23,13],[23,15,23,16],[23,18,23,19],[23,21,23,22],[23,24,23,25],[23,27,23,28],[23,30,23,31],[23,33,23,34],[23,36,23,37],[23,39,23,40],[23,42,23,43],[23,45,23,46],[23,48,23,49],[23,51,23,52],[23,54,23,55],[23,57,23,58],[17,27,17,28],[17,30,17,31],[17,33,17,34],[17,36,17,37],[17,39,17,40],[17,42,17,43],[17,45,17,46],[17,48,17,49],[17,51,17,52],[0,3,4,75],[72,69,72,70],[72,72,72,73],[65,72,65,73],[65,69,65,70],[58,69,58,70],[58,72,58,73],[58,66,58,67],[58,57,58,58],[58,60,58,61],[65,60,65,61],[65,57,65,58],[72,57,72,58],[72,60,72,61],[58,63,58,64],[65,63,65,64],[65,66,65,67],[72,63,72,64],[72,66,72,67],[64,69,64,70],[64,72,64,73],[69,69,70,70],[69,72,70,73],[71,69,71,70],[71,72,71,73],[58,45,58,46],[65,45,65,46],[72,45,72,46],[72,48,72,49],[65,48,65,49],[58,48,58,49],[58,51,58,52],[58,54,58,55],[65,51,65,52],[65,54,65,55],[72,51,72,52],[72,54,72,55],[71,63,71,64],[71,66,71,67],[71,57,71,58],[71,60,71,61],[71,51,71,52],[71,54,71,55],[71,45,71,46],[71,48,71,49],[59,60,59,61],[59,63,59,64],[59,66,59,67],[72,36,72,37],[65,36,65,37],[58,36,58,37],[58,39,58,40],[58,42,58,43],[65,39,65,40],[65,42,65,43],[72,39,72,40],[72,42,72,43],[71,36,71,37],[71,39,71,40],[71,42,71,43],[72,21,72,22],[72,24,72,25],[72,27,72,28],[72,30,72,31],[65,27,65,28],[65,30,65,31],[58,27,58,28],[58,30,58,31],[58,33,58,34],[65,33,65,34],[72,33,72,34],[71,33,71,34],[71,27,71,28],[71,30,71,31],[69,27,70,28],[69,30,70,31],[71,21,71,22],[71,24,71,25],[65,21,65,22],[65,24,65,25],[59,21,59,22],[59,24,59,25],[59,27,59,28],[59,30,59,31],[58,9,58,10],[58,12,58,13],[65,12,65,13],[65,9,65,10],[72,9,72,10],[72,12,72,13],[72,15,72,16],[72,18,72,19],[65,15,65,16],[58,15,58,16],[58,18,58,19],[65,18,65,19],[62,9,63,10],[62,12,63,13],[69,9,70,10],[69,12,70,13],[59,9,59,10],[59,12,59,13],[59,15,59,16],[59,18,59,19],[66,9,66,10],[66,12,66,13],[66,15,66,16],[66,18,66,19],[44,66,44,67],[44,69,44,70],[44,72,44,73],[51,9,51,10],[51,12,51,13],[51,15,51,16],[51,18,51,19],[51,21,51,22],[51,24,51,25],[51,27,51,28],[51,30,51,31],[51,33,51,34],[51,36,51,37],[51,39,51,40],[51,42,51,43],[51,45,51,46],[51,48,51,49],[51,51,51,52],[51,54,51,55],[51,57,51,58],[51,60,51,61],[51,63,51,64],[51,66,51,67],[51,69,51,70],[44,39,44,40],[44,42,44,43],[44,45,44,46],[44,48,44,49],[44,51,44,52],[44,54,44,55],[44,57,44,58],[44,60,44,61],[44,63,44,64],[44,9,44,10],[44,12,44,13],[44,15,44,16],[44,18,44,19],[44,21,44,22],[44,24,44,25],[44,27,44,28],[44,30,44,31],[44,33,44,34],[36,15,36,16],[36,18,36,19],[36,21,36,22],[36,24,36,25],[36,27,36,28],[36,30,36,31],[36,33,36,34],[36,36,36,37],[36,39,36,40],[29,9,29,10],[29,12,29,13],[29,15,29,16],[29,18,29,19],[29,21,29,22],[29,24,29,25],[29,27,29,28],[29,30,29,31],[29,33,29,34],[29,36,29,37],[29,39,29,40],[29,42,29,43],[29,45,29,46],[29,48,29,49],[29,51,29,52],[29,54,29,55],[29,57,29,58],[29,60,29,61],[29,63,29,64],[29,66,29,67],[29,69,29,70],[29,72,29,73],[28,27,28,28],[16,57,16,58],[16,60,16,61],[16,63,16,64],[16,66,16,67],[16,69,16,70],[16,72,16,73],[22,9,22,10],[22,12,22,13],[22,15,22,16],[22,18,22,19],[22,21,22,22],[22,24,22,25],[22,27,22,28],[22,30,22,31],[22,33,22,34],[22,36,22,37],[22,39,22,40],[22,42,22,43],[22,45,22,46],[22,48,22,49],[22,51,22,52],[22,54,22,55],[22,57,22,58],[22,60,22,61],[16,27,16,28],[16,30,16,31],[16,33,16,34],[16,39,16,40],[16,42,16,43],[16,45,16,46],[16,48,16,49],[16,51,16,52],[16,54,16,55],[55,69,56,70],[57,69,57,70],[57,72,57,73],[62,69,63,70],[62,72,63,73],[43,69,43,70],[43,72,43,73],[48,69,49,70],[48,72,49,73],[50,69,50,70],[50,72,50,73],[51,72,51,73],[52,69,52,70],[52,72,52,73],[59,69,59,70],[59,72,59,73],[33,69,34,70],[33,72,34,73],[35,69,35,70],[35,72,35,73],[41,69,42,70],[41,72,42,73],[21,69,21,70],[21,72,21,73],[26,69,27,70],[26,72,27,73],[28,69,28,70],[28,72,28,73],[22,72,22,73],[36,69,36,70],[36,72,36,73],[22,69,22,70],[23,69,23,70],[23,72,23,73],[30,69,30,70],[30,72,30,73],[37,69,37,70],[37,72,37,73],[13,69,14,70],[13,72,14,73],[15,69,15,70],[15,72,15,73],[19,69,20,70],[19,72,20,73],[64,63,64,64],[64,66,64,67],[69,63,70,64],[69,66,70,67],[55,63,56,64],[55,66,56,67],[57,63,57,64],[57,66,57,67],[62,63,63,64],[62,66,63,67],[43,63,43,64],[43,66,43,67],[48,63,49,64],[48,66,49,67],[50,63,50,64],[50,66,50,67],[33,63,34,64],[33,66,34,67],[35,63,35,64],[35,66,35,67],[41,63,42,64],[41,66,42,67],[21,63,21,64],[21,66,21,67],[26,63,27,64],[26,66,27,67],[28,63,28,64],[28,66,28,67],[36,63,36,64],[36,66,36,67],[22,63,22,64],[22,66,22,67],[23,63,23,64],[23,66,23,67],[30,63,30,64],[30,66,30,67],[37,63,37,64],[37,66,37,67],[13,63,14,64],[13,66,14,67],[15,63,15,64],[15,66,15,67],[19,63,20,64],[19,66,20,67],[64,57,64,58],[64,60,64,61],[69,57,70,58],[69,60,70,61],[55,57,56,58],[55,60,56,61],[57,57,57,58],[57,60,57,61],[62,57,63,58],[62,60,63,61],[43,57,43,58],[43,60,43,61],[48,57,49,58],[48,60,49,61],[50,57,50,58],[50,60,50,61],[33,57,34,58],[33,60,34,61],[35,57,35,58],[35,60,35,61],[41,57,42,58],[41,60,42,61],[21,57,21,58],[21,60,21,61],[26,57,27,58],[26,60,27,61],[28,57,28,58],[28,60,28,61],[36,57,36,58],[36,60,36,61],[23,60,23,61],[13,57,14,58],[13,60,14,61],[15,57,15,58],[15,60,15,61],[19,57,20,58],[19,60,20,61],[64,51,64,52],[64,54,64,55],[69,51,70,52],[69,54,70,55],[55,51,56,52],[55,54,56,55],[57,51,57,52],[57,54,57,55],[62,51,63,52],[62,54,63,55],[43,51,43,52],[43,54,43,55],[48,51,49,52],[48,54,49,55],[50,51,50,52],[50,54,50,55],[33,51,34,52],[33,54,34,55],[35,51,35,52],[35,54,35,55],[41,51,42,52],[41,54,42,55],[21,51,21,52],[21,54,21,55],[26,51,27,52],[26,54,27,55],[28,51,28,52],[28,54,28,55],[36,51,36,52],[36,54,36,55],[13,51,14,52],[13,54,14,55],[15,51,15,52],[15,54,15,55],[19,51,20,52],[19,54,20,55],[64,45,64,46],[64,48,64,49],[69,45,70,46],[69,48,70,49],[55,45,56,46],[55,48,56,49],[57,45,57,46],[57,48,57,49],[62,45,63,46],[62,48,63,49],[43,45,43,46],[43,48,43,49],[48,45,49,46],[48,48,49,49],[50,45,50,46],[50,48,50,49],[33,45,34,46],[33,48,34,49],[35,45,35,46],[35,48,35,49],[41,45,42,46],[41,48,42,49],[21,45,21,46],[21,48,21,49],[26,45,27,46],[26,48,27,49],[28,45,28,46],[28,48,28,49],[36,45,36,46],[36,48,36,49],[13,45,14,46],[13,48,14,49],[15,45,15,46],[15,48,15,49],[19,45,20,46],[19,48,20,49],[64,39,64,40],[64,42,64,43],[69,39,70,40],[69,42,70,43],[55,39,56,40],[55,42,56,43],[57,39,57,40],[57,42,57,43],[62,39,63,40],[62,42,63,43],[43,39,43,40],[43,42,43,43],[48,39,49,40],[48,42,49,43],[50,39,50,40],[50,42,50,43],[33,39,34,40],[33,42,34,43],[35,39,35,40],[35,42,35,43],[41,39,42,40],[41,42,42,43],[21,39,21,40],[21,42,21,43],[26,39,27,40],[26,42,27,43],[28,39,28,40],[28,42,28,43],[36,42,36,43],[13,39,14,40],[13,42,14,43],[15,39,15,40],[15,42,15,43],[19,39,20,40],[19,42,20,43],[64,33,64,34],[64,36,64,37],[69,33,70,34],[69,36,70,37],[55,33,56,34],[55,36,56,37],[57,33,57,34],[57,36,57,37],[62,33,63,34],[62,36,63,37],[43,33,43,34],[43,36,43,37],[48,33,49,34],[48,36,49,37],[50,33,50,34],[50,36,50,37],[33,33,34,34],[33,36,34,37],[55,27,56,28],[55,30,56,31],[57,27,57,28],[57,30,57,31],[62,27,63,28],[62,30,63,31],[43,27,43,28],[43,30,43,31],[48,27,49,28],[48,30,49,31],[50,27,50,28],[50,30,50,31],[28,30,28,31],[13,33,14,34],[13,36,14,37],[15,33,15,34],[15,36,15,37],[19,33,20,34],[19,36,20,37],[64,27,64,28],[64,30,64,31],[33,27,34,28],[33,30,34,31],[35,33,35,34],[35,36,35,37],[41,33,42,34],[41,36,42,37],[21,33,21,34],[21,36,21,37],[26,33,27,34],[26,36,27,37],[28,33,28,34],[28,36,28,37],[16,36,16,37],[44,36,44,37],[13,27,14,28],[13,30,14,31],[15,27,15,28],[15,30,15,31],[19,27,20,28],[19,30,20,31],[64,21,64,22],[64,24,64,25],[69,21,70,22],[69,24,70,25],[33,21,34,22],[33,24,34,25],[35,21,35,22],[35,24,35,25],[41,21,42,22],[41,24,42,25],[35,27,35,28],[35,30,35,31],[41,27,42,28],[41,30,42,31],[21,27,21,28],[21,30,21,31],[26,27,27,28],[26,30,27,31],[55,21,56,22],[55,24,56,25],[57,21,57,22],[57,24,57,25],[62,21,63,22],[62,24,63,25],[43,21,43,22],[43,24,43,25],[48,21,49,22],[48,24,49,25],[50,21,50,22],[50,24,50,25],[58,21,58,22],[58,24,58,25],[21,21,21,22],[21,24,21,25],[26,21,27,22],[26,24,27,25],[28,21,28,22],[28,24,28,25],[13,24,14,25],[15,21,15,22],[15,24,15,25],[19,21,20,22],[19,24,20,25],[16,21,16,22],[16,24,16,25],[17,21,17,22],[17,24,17,25],[26,9,27,10],[28,9,28,10],[26,12,27,13],[28,12,28,13],[26,15,27,16],[28,15,28,16],[26,18,27,19],[28,18,28,19],[21,9,21,10],[21,12,21,13],[21,15,21,16],[21,18,21,19],[19,9,20,10],[19,12,20,13],[19,15,20,16],[13,15,14,16],[15,15,15,16],[13,18,14,19],[15,18,15,19],[13,21,14,22],[13,9,14,10],[15,9,15,10],[13,12,14,13],[15,12,15,13],[19,18,20,19],[16,9,16,10],[16,12,16,13],[16,15,16,16],[16,18,16,19],[17,9,17,10],[17,12,17,13],[17,15,17,16],[17,18,17,19],[48,9,49,10],[50,9,50,10],[48,12,49,13],[50,12,50,13],[48,15,49,16],[50,15,50,16],[33,18,34,19],[35,18,35,19],[41,9,42,10],[43,9,43,10],[41,12,42,13],[43,12,43,13],[41,15,42,16],[43,15,43,16],[41,18,42,19],[43,18,43,19],[33,9,34,10],[35,9,35,10],[33,12,34,13],[35,12,35,13],[33,15,34,16],[35,15,35,16],[36,9,36,10],[36,12,36,13],[0,0,4,0],[55,72,56,73],[62,18,63,19],[64,18,64,19],[71,9,71,10],[71,12,71,13],[69,15,70,16],[71,15,71,16],[69,18,70,19],[71,18,71,19],[64,9,64,10],[64,12,64,13],[62,15,63,16],[64,15,64,16],[48,18,49,19],[50,18,50,19],[55,9,56,10],[57,9,57,10],[55,12,56,13],[57,12,57,13],[55,15,56,16],[57,15,57,16],[55,18,56,19],[57,18,57,19]]}
[null,null,null," MATRIZ DE VERSATILIDADE - F 140  R01                                                                                                                              MATRIZ DE VERSATILIDADE -  F 140  R01                                                                                        MATRIZ DE VERSATILIDADE - F 140   R01 "]
[]
[]
[]
[]
[]
[]
[]
[]
[]
[]
[]
[]
[null,null,null,null,null,null,null,null,null,{"$f":"IF(COUNTIF(Geral!F13:AM13,\"Trein. Finalizado\")=17,\"Treinamento Finalizado\",IF(COUNTBLANK(Geral!F13:AM13)=34,\"* * * * *\",\"Em Treinamento\"))","v":"Treinamento Finalizado"},null,null,{"$f":"IF(COUNTIF(Geral!F16:AM16,\"Trein. Finalizado\")=17,\"Treinamento Finalizado\",IF(COUNTBLANK(Geral!F16:AM16)=34,\"* * * * *\",\"Em Treinamento\"))","v":"* * * * *"},null,null,{"$f":"IF(COUNTIF(hplc!F13:U13,\"Trein. Finalizado\")=8,\"Treinamento Finalizado\",IF(COUNTBLANK(hplc!F13:U13)=16,\"* * * * *\",\"Em Treinamento\"))","v":"Treinamento Finalizado"},null,null,{"$f":"IF(COUNTIF(hplc!F16:U16,\"Trein. Finalizado\")=8,\"Treinamento Finalizado\",IF(COUNTBLANK(hplc!F16:U16)=16,\"* * * * *\",\"Em Treinamento\"))","v":"Em Treinamento"},null,null,{"$f":"IF(COUNTIF(Espectro!F13:M13,\"Trein. Finalizado\")=4,\"Treinamento Finalizado\",IF(COUNTBLANK(Espectro!F13:M13)=8,\"* * * * *\",\"Em Treinamento\"))","v":"Treinamento Finalizado"},null,null,{"$f":"IF(COUNTIF(Espectro!F16:M16,\"Trein. Finalizado\")=4,\"Treinamento Finalizado\",IF(COUNTBLANK(Espectro!F16:M16)=8,\"* * * * *\",\"Em Treinamento\"))","v":"Em Treinamento"},null,null,{"$f":"IF(COUNTIF('Karl fischer'!F13:M13,\"Trein. Finalizado\")=4,\"Treinamento Finalizado\",IF(COUNTBLANK('Karl fischer'!F13:M13)=8,\"* * * * *\",\"Em Treinamento\"))","v":"Treinamento Finalizado"},null,null,{"$f":"IF(COUNTIF('Karl fischer'!F16:M16,\"Trein. Finalizado\")=4,\"Treinamento Finalizado\",IF(COUNTBLANK('Karl fischer'!F16:M16)=8,\"* * * * *\",\"Em Treinamento\"))","v":"Treinamento Finalizado"},null,null,{"$f":"IF(COUNTIF(Agua!F13:M13,\"Trein. Finalizado\")=4,\"Treinamento Finalizado\",IF(COUNTBLANK(Agua!F13:M13)=8,\"* * * * *\",\"Em Treinamento\"))","v":"Treinamento Finalizado"},null,null,{"$f":"IF(COUNTIF(Agua!F16:M16,\"Trein. Finalizado\")=4,\"Treinamento Finalizado\",IF(COUNTBLANK(Agua!F16:M16)=8,\"* * * * *\",\"Em Treinamento\"))","v":"Em Treinamento"},null,null,{"$f":"IF(COUNTIF(Titulação!F13:M13,\"Trein. Finalizado\")=4,\"Treinamento Finalizado\",IF(COUNTBLANK(Titulação!F13:M13)=8,\"* * * * *\",\"Em Treinamento\"))","v":"Treinamento Finalizado"},null,null,{"$f":"IF(COUNTIF(Titulação!F16:M16,\"Trein. Finalizado\")=4,\"Treinamento Finalizado\",IF(COUNTBLANK(Titulação!F16:M16)=8,\"* * * * *\",\"Em Treinamento\"))","v":"Treinamento Finalizado"},null,null,{"$f":"IF(COUNTIF('Peso Medio'!F13:M13,\"Trein. Finalizado\")=4,\"Treinamento Finalizado\",IF(COUNTBLANK('Peso Medio'!F13:M13)=8,\"* * * * *\",\"Em Treinamento\"))","v":"Treinamento Finalizado"},null,null,{"$f":"IF(COUNTIF('Peso Medio'!F16:M16,\"Trein. Finalizado\")=4,\"Treinamento Finalizado\",IF(COUNTBLANK('Peso Medio'!F16:M16)=8,\"* * * * *\",\"Em Treinamento\"))","v":"Treinamento Finalizado"},null,null,{"$f":"IF(COUNTIF(Validação!F13:Q13,\"Trein. Finalizado\")=6,\"Treinamento Finalizado\",IF(COUNTBLANK(Validação!F13:Q13)=12,\"* * * * *\",\"Em Treinamento\"))","v":"Treinamento Finalizado"},null,null,{"$f":"IF(COUNTIF(Validação!F16:Q16,\"Trein. Finalizado\")=6,\"Treinamento Finalizado\",IF(COUNTBLANK(Validação!F16:Q16)=12,\"* * * * *\",\"Em Treinamento\"))","v":"Em Treinamento"},null,null,{"$f":"IF(COUNTIF('Teor A.'!F13:K13,\"Trein. Finalizado\")=3,\"Treinamento Finalizado\",IF(COUNTBLANK('Teor A.'!F13:K13)=6,\"* * * * *\",\"Em Treinamento\"))","v":"Treinamento Finalizado"},null,null,{"$f":"IF(COUNTIF('Teor A.'!F16:K16,\"Trein. Finalizado\")=3,\"Treinamento Finalizado\",IF(COUNTBLANK('Teor A.'!F16:K16)=6,\"* * * * *\",\"Em Treinamento\"))","v":"Em Treinamento"},null,null,{"$f":"IF(COUNTIF(Perfil!F13:O13,\"Trein. Finalizado\")=5,\"Treinamento Finalizado\",IF(COUNTBLANK(Perfil!F13:O13)=10,\"* * * * *\",\"Em Treinamento\"))","v":"Treinamento Finalizado"},null,null,{"$f":"IF(COUNTIF(Perfil!F16:O16,\"Trein. Finalizado\")=5,\"Treinamento Finalizado\",IF(COUNTBLANK(Perfil!F16:O16)=10,\"* * * * *\",\"Em Treinamento\"))","v":"Em Treinamento"},null,null,{"$f":"IF(COUNTIF('Perda S.'!F13:O13,\"Trein. Finalizado\")=5,\"Treinamento Finalizado\",IF(COUNTBLANK('Perda S.'!F13:O13)=10,\"* * * * *\",\"Em Treinamento\"))","v":"* * * * *"},null,null,{"$f":"IF(COUNTIF('Perda S.'!F16:O16,\"Trein. Finalizado\")=5,\"Treinamento Finalizado\",IF(COUNTBLANK('Perda S.'!F16:O16)=10,\"* * * * *\",\"Em Treinamento\"))","v":"* * * * *"}]
[]
[null,null,null,null,null,null,null,null,null,"2023-07-16",null,null,"2023-08-13",null,null,null,null,null,null,null,null,null,null,null,null,null,null,"2023-07-16",null,null,"2023-07-16",null,null,"2023-07-16",null,null,null,null,null,"2023-07-16",null,null,"2023-07-16",null,null,"2023-07-16",null,null,"2023-07-16",null,null,null,null,null,null,null,null,null,null,null,null,null,null,"2023-07-16"]
[null,null,null,null,null,null,null,null,null,{"$f":"Geral!AN13","v":"Autorizado(a)"},null,null,{"$f":"Geral!AN16","v":0}]
[]
[]
[null,null,null,null,null,null,null,null,null,{"$f":"IF(COUNTIF(Geral!F19:AM19,\"Trein. Finalizado\")=17,\"Treinamento Finalizado\",IF(COUNTBLANK(Geral!F19:AM19)=34,\"* * * * *\",\"Em Treinamento\"))","v":"Treinamento Finalizado"},null,null,{"$f":"IF(COUNTIF(Geral!F22:AM22,\"Trein. Finalizado\")=17,\"Treinamento Finalizado\",IF(COUNTBLANK(Geral!F22:AM22)=34,\"* * * * *\",\"Em Treinamento\"))","v":"Treinamento Finalizado"},null,null,{"$f":"IF(COUNTIF(hplc!F19:U19,\"Trein. Finalizado\")=8,\"Treinamento Finalizado\",IF(COUNTBLANK(hplc!F19:U19)=16,\"* * * * *\",\"Em Treinamento\"))","v":"Em Treinamento"},null,null,{"$f":"IF(COUNTIF(hplc!F22:U22,\"Trein. Finalizado\")=8,\"Treinamento Finalizado\",IF(COUNTBLANK(hplc!F22:U22)=16,\"* * * * *\",\"Em Treinamento\"))","v":"Em Treinamento"},null,null,{"$f":"IF(COUNTIF(Espectro!F19:M19,\"Trein. Finalizado\")=4,\"Treinamento Finalizado\",IF(COUNTBLANK(Espectro!F19:M19)=8,\"* * * * *\",\"Em Treinamento\"))","v":"Em Treinamento"},null,null,{"$f":"IF(COUNTIF(Espectro!F22:M22,\"Trein. Finalizado\")=4,\"Treinamento Finalizado\",IF(COUNTBLANK(Espectro!F22:M22)=8,\"* * * * *\",\"Em Treinamento\"))","v":"Em Treinamento"},null,null,{"$f":"IF(COUNTIF('Karl fischer'!F19:M19,\"Trein. Finalizado\")=4,\"Treinamento Finalizado\",IF(COUNTBLANK('Karl fischer'!F19:M19)=8,\"* * * * *\",\"Em Treinamento\"))","v":"Treinamento Finalizado"},null,null,{"$f":"IF(COUNTIF('Karl fischer'!F22:M22,\"Trein. Finalizado\")=4,\"Treinamento Finalizado\",IF(COUNTBLANK('Karl fischer'!F22:M22)=8,\"* * * * *\",\"Em Treinamento\"))","v":"Treinamento Finalizado"},null,null,{"$f":"IF(COUNTIF(Agua!F19:M19,\"Trein. Finalizado\")=4,\"Treinamento Finalizado\",IF(COUNTBLANK(Agua!F19:M19)=8,\"* * * * *\",\"Em Treinamento\"))","v":"Treinamento Finalizado"},null,null,{"$f":"IF(COUNTIF(Agua!F22:M22,\"Trein. Finalizado\")=4,\"Treinamento Finalizado\",IF(COUNTBLANK(Agua!F22:M22)=8,\"* * * * *\",\"Em Treinamento\"))","v":"Em Treinamento"},null,null,{"$f":"IF(COUNTIF(Titulação!F19:M19,\"Trein. Finalizado\")=4,\"Treinamento Finalizado\",IF(COUNTBLANK(Titulação!F19:M19)=8,\"* * * * *\",\"Em Treinamento\"))","v":"Treinamento Finalizado"},null,null,{"$f":"IF(COUNTIF(Titulação!F22:M22,\"Trein. Finalizado\")=4,\"Treinamento Finalizado\",IF(COUNTBLANK(Titulação!F22:M22)=8,\"* * * * *\",\"Em Treinamento\"))","v":"Treinamento Finalizado"},null,null,{"$f":"IF(COUNTIF('Peso Medio'!F19:M19,\"Trein. Finalizado\")=4,\"Treinamento Finalizado\",IF(COUNTBLANK('Peso Medio'!F19:M19)=8,\"* * * * *\",\"Em Treinamento\"))","v":"Treinamento Finalizado"},null,null,{"$f":"IF(COUNTIF('Peso Medio'!F22:M22,\"Trein. Finalizado\")=4,\"Treinamento Finalizado\",IF(COUNTBLANK('Peso Medio'!F22:M22)=8,\"* * * * *\",\"Em Treinamento\"))","v":"Em Treinamento"},null,null,{"$f":"IF(COUNTIF(Validação!F19:Q19,\"Trein. Finalizado\")=6,\"Treinamento Finalizado\",IF(COUNTBLANK(Validação!F19:Q19)=12,\"* * * * *\",\"Em Treinamento\"))","v":"Treinamento Finalizado"},null,null,{"$f":"IF(COUNTIF(Validação!F22:Q22,\"Trein. Finalizado\")=6,\"Treinamento Finalizado\",IF(COUNTBLANK(Validação!F22:Q22)=12,\"* * * * *\",\"Em Treinamento\"))","v":"Em Treinamento"},null,null,{"$f":"IF(COUNTIF('Teor A.'!F19:K19,\"Trein. Finalizado\")=3,\"Treinamento Finalizado\",IF(COUNTBLANK('Teor A.'!F19:K19)=6,\"* * * * *\",\"Em Treinamento\"))","v":"Treinamento Finalizado"},null,null,{"$f":"IF(COUNTIF('Teor A.'!F22:K22,\"Trein. Finalizado\")=3,\"Treinamento Finalizado\",IF(COUNTBLANK('Teor A.'!F22:K22)=6,\"* * * * *\",\"Em Treinamento\"))","v":"Treinamento Finalizado"},null,null,{"$f":"IF(COUNTIF(Perfil!F19:O19,\"Trein. Finalizado\")=5,\"Treinamento Finalizado\",IF(COUNTBLANK(Perfil!F19:O19)=10,\"* * * * *\",\"Em Treinamento\"))","v":"Treinamento Finalizado"},null,null,{"$f":"IF(COUNTIF(Perfil!F22:O22,\"Trein. Finalizado\")=5,\"Treinamento Finalizado\",IF(COUNTBLANK(Perfil!F22:O22)=10,\"* * * * *\",\"Em Treinamento\"))","v":"Em Treinamento"},null,null,{"$f":"IF(COUNTIF('Perda S.'!F19:O19,\"Trein. Finalizado\")=5,\"Treinamento Finalizado\",IF(COUNTBLANK('Perda S.'!F19:O19)=10,\"* * * * *\",\"Em Treinamento\"))","v":"* * * * *"},null,null,{"$f":"IF(COUNTIF('Perda S.'!F22:O22,\"Trein. Finalizado\")=5,\"Treinamento Finalizado\",IF(COUNTBLANK('Perda S.'!F22:O22)=10,\"* * * * *\",\"Em Treinamento\"))","v":"* * * * *"}]
[]
[null,null,null,null,null,null,null,null,null,"2023-08-13",null,null,"2023-08-13",null,null,null,null,null,null,null,null,null,null,null,null,null,null,"2023-07-16",null,null,"2023-07-16",null,null,null,null,null,null,null,null,"2023-07-16",null,null,"2023-07-16"]
[null,null,null,null,null,null,null,null,null,{"$f":"Geral!AN19","v":0},null,null,{"$f":"Geral!AN22","v":0}]
[]
[]
[]
[null,null,null,null,null,null,null,null,null,{"$f":"IF(COUNTIF(Geral!F25:AM25,\"Trein. Finalizado\")=17,\"Treinamento Finalizado\",IF(COUNTBLANK(Geral!F25:AL25)=34,\"* * * * *\",\"Em Treinamento\"))","v":"Em Treinamento"},null,null,{"$f":"IF(COUNTIF(Geral!F28:AM28,\"Trein. Finalizado\")=17,\"Treinamento Finalizado\",IF(COUNTBLANK(Geral!F28:AM28)=34,\"* * * * *\",\"Em Treinamento\"))","v":"Em Treinamento"},null,null,{"$f":"IF(COUNTIF(hplc!F25:U25,\"Trein. Finalizado\")=8,\"Treinamento Finalizado\",IF(COUNTBLANK(hplc!F25:U25)=16,\"* * * * *\",\"Em Treinamento\"))","v":"Treinamento Finalizado"},null,null,{"$f":"IF(COUNTIF(hplc!F28:U28,\"Trein. Finalizado\")=8,\"Treinamento Finalizado\",IF(COUNTBLANK(hplc!F28:U28)=16,\"* * * * *\",\"Em Treinamento\"))","v":"* * * * *"},null,null,{"$f":"IF(COUNTIF(Espectro!F25:M25,\"Trein. Finalizado\")=4,\"Treinamento Finalizado\",IF(COUNTBLANK(Espectro!F25:M25)=8,\"* * * * *\",\"Em Treinamento\"))","v":"Em Treinamento"},null,null,{"$f":"IF(COUNTIF(Espectro!F28:M28,\"Trein. Finalizado\")=4,\"Treinamento Finalizado\",IF(COUNTBLANK(Espectro!F28:M28)=8,\"* * * * *\",\"Em Treinamento\"))","v":"* * * * *"},null,null,{"$f":"IF(COUNTIF('Karl fischer'!F25:M25,\"Trein. Finalizado\")=4,\"Treinamento Finalizado\",IF(COUNTBLANK('Karl fischer'!F25:M25)=8,\"* * * * *\",\"Em Treinamento\"))","v":"Treinamento Finalizado"},null,null,{"$f":"IF(COUNTIF('Karl fischer'!F28:M28,\"Trein. Finalizado\")=4,\"Treinamento Finalizado\",IF(COUNTBLANK('Karl fischer'!F28:M28)=8,\"* * * * *\",\"Em Treinamento\"))","v":"Treinamento Finalizado"},null,null,{"$f":"IF(COUNTIF(Agua!F25:M25,\"Trein. Finalizado\")=4,\"Treinamento Finalizado\",IF(COUNTBLANK(Agua!F25:M25)=8,\"* * * * *\",\"Em Treinamento\"))","v":"Em Treinamento"},null,null,{"$f":"IF(COUNTIF(Agua!F28:M28,\"Trein. Finalizado\")=4,\"Treinamento Finalizado\",IF(COUNTBLANK(Agua!F28:M28)=8,\"* * * * *\",\"Em Treinamento\"))","v":"Em Treinamento"},null,null,{"$f":"IF(COUNTIF(Titulação!F25:M25,\"Trein. Finalizado\")=4,\"Treinamento Finalizado\",IF(COUNTBLANK(Titulação!F25:M25)=8,\"* * * * *\",\"Em Treinamento\"))","v":"Treinamento Finalizado"},null,null,{"$f":"IF(COUNTIF(Titulação!F28:M28,\"Trein. Finalizado\")=4,\"Treinamento Finalizado\",IF(COUNTBLANK(Titulação!F28:M28)=8,\"* * * * *\",\"Em Treinamento\"))","v":"Treinamento Finalizado"},null,null,{"$f":"IF(COUNTIF('Peso Medio'!F25:M25,\"Trein. Finalizado\")=4,\"Treinamento Finalizado\",IF(COUNTBLANK('Peso Medio'!F25:M25)=8,\"* * * * *\",\"Em Treinamento\"))","v":"Em Treinamento"},null,null,{"$f":"IF(COUNTIF('Peso Medio'!F28:M28,\"Trein. Finalizado\")=4,\"Treinamento Finalizado\",IF(COUNTBLANK('Peso Medio'!F28:M28)=8,\"* * * * *\",\"Em Treinamento\"))","v":"Em Treinamento"},null,null,{"$f":"IF(COUNTIF(Validação!F25:Q25,\"Trein. Finalizado\")=6,\"Treinamento Finalizado\",IF(COUNTBLANK(Validação!F25:Q25)=12,\"* * * * *\",\"Em Treinamento\"))","v":"Em Treinamento"},null,null,{"$f":"IF(COUNTIF(Validação!F28:Q28,\"Trein. Finalizado\")=6,\"Treinamento Finalizado\",IF(COUNTBLANK(Validação!F28:Q28)=12,\"* * * * *\",\"Em Treinamento\"))","v":"Em Treinamento"},null,null,{"$f":"IF(COUNTIF('Teor A.'!F25:K25,\"Trein. Finalizado\")=3,\"Treinamento Finalizado\",IF(COUNTBLANK('Teor A.'!F25:K25)=6,\"* * * * *\",\"Em Treinamento\"))","v":"Em Treinamento"},null,null,{"$f":"IF(COUNTIF('Teor A.'!F28:K28,\"Trein. Finalizado\")=3,\"Treinamento Finalizado\",IF(COUNTBLANK('Teor A.'!F28:K28)=6,\"* * * * *\",\"Em Treinamento\"))","v":"Em Treinamento"},null,null,{"$f":"IF(COUNTIF(Perfil!F25:O25,\"Trein. Finalizado\")=5,\"Treinamento Finalizado\",IF(COUNTBLANK(Perfil!F25:O25)=10,\"* * * * *\",\"Em Treinamento\"))","v":"Treinamento Finalizado"},null,null,{"$f":"IF(COUNTIF(Perfil!F28:O28,\"Trein. Finalizado\")=5,\"Treinamento Finalizado\",IF(COUNTBLANK(Perfil!F28:O28)=10,\"* * * * *\",\"Em Treinamento\"))","v":"Em Treinamento"},null,null,{"$f":"IF(COUNTIF('Perda S.'!F25:O25,\"Trein. Finalizado\")=5,\"Treinamento Finalizado\",IF(COUNTBLANK('Perda S.'!F25:O25)=10,\"* * * * *\",\"Em Treinamento\"))","v":"* * * * *"},null,null,{"$f":"IF(COUNTIF('Perda S.'!F28:O28,\"Trein. Finalizado\")=5,\"Treinamento Finalizado\",IF(COUNTBLANK('Perda S.'!F28:O28)=10,\"* * * * *\",\"Em Treinamento\"))","v":"* * * * *"}]
[]
[null,null,null,null,null,null,null,null,null,null,null,null,null,null,null,"2023-07-16",null,null,null,null,null,null,null,null,null,null,null,"2023-07-16",null,null,"2023-07-16",null,null,null,null,null,null,null,null,"2023-07-16",null,null,"2023-07-16"]
[null,null,null,null,null,null,null,null,null,{"$f":"Geral!AN25","v":0},null,null,{"$f":"Geral!AN28","v":0}]
[]
[]
[]
[null,null,null,null,null,null,null,null,null,{"$f":"IF(COUNTIF(Geral!F31:AM31,\"Trein. Finalizado\")=17,\"Treinamento Finalizado\",IF(COUNTBLANK(Geral!F31:AM31)=34,\"* * * * *\",\"Em Treinamento\"))","v":"Em Treinamento"},null,null,{"$f":"IF(COUNTIF(Geral!F34:AM34,\"Trein. Finalizado\")=17,\"Treinamento Finalizado\",IF(COUNTBLANK(Geral!F34:AM34)=34,\"* * * * *\",\"Em Treinamento\"))","v":"Em Treinamento"},null,null,{"$f":"IF(COUNTIF(hplc!F31:U31,\"Trein. Finalizado\")=8,\"Treinamento Finalizado\",IF(COUNTBLANK(hplc!F31:U31)=16,\"* * * * *\",\"Em Treinamento\"))","v":"Treinamento Finalizado"},null,null,{"$f":"IF(COUNTIF(hplc!F34:U34,\"Trein. Finalizado\")=8,\"Treinamento Finalizado\",IF(COUNTBLANK(hplc!F34:U34)=16,\"* * * * *\",\"Em Treinamento\"))","v":"* * * * *"},null,null,{"$f":"IF(COUNTIF(Espectro!F31:M31,\"Trein. Finalizado\")=4,\"Treinamento Finalizado\",IF(COUNTBLANK(Espectro!F31:M31)=8,\"* * * * *\",\"Em Treinamento\"))","v":"Treinamento Finalizado"},null,null,{"$f":"IF(COUNTIF(Espectro!F34:M34,\"Trein. Finalizado\")=4,\"Treinamento Finalizado\",IF(COUNTBLANK(Espectro!F34:M34)=8,\"* * * * *\",\"Em Treinamento\"))","v":"* * * * *"},null,null,{"$f":"IF(COUNTIF('Karl fischer'!F31:M31,\"Trein. Finalizado\")=4,\"Treinamento Finalizado\",IF(COUNTBLANK('Karl fischer'!F31:M31)=8,\"* * * * *\",\"Em Treinamento\"))","v":"Treinamento Finalizado"},null,null,{"$f":"IF(COUNTIF('Karl fischer'!F34:M34,\"Trein. Finalizado\")=4,\"Treinamento Finalizado\",IF(COUNTBLANK('Karl fischer'!F34:M34)=8,\"* * * * *\",\"Em Treinamento\"))","v":"* * * * *"},null,null,{"$f":"IF(COUNTIF(Agua!F31:M31,\"Trein. Finalizado\")=4,\"Treinamento Finalizado\",IF(COUNTBLANK(Agua!F31:M31)=8,\"* * * * *\",\"Em Treinamento\"))","v":"Em Treinamento"},null,null,{"$f":"IF(COUNTIF(Agua!F34:M34,\"Trein. Finalizado\")=4,\"Treinamento Finalizado\",IF(COUNTBLANK(Agua!F34:M34)=8,\"* * * * *\",\"Em Treinamento\"))","v":"Em Treinamento"},null,null,{"$f":"IF(COUNTIF(Titulação!F31:M31,\"Trein. Finalizado\")=4,\"Treinamento Finalizado\",IF(COUNTBLANK(Titulação!F31:M31)=8,\"* * * * *\",\"Em Treinamento\"))","v":"Treinamento Finalizado"},null,null,{"$f":"IF(COUNTIF(Titulação!F34:M34,\"Trein. Finalizado\")=4,\"Treinamento Finalizado\",IF(COUNTBLANK(Titulação!F34:M34)=8,\"* * * * *\",\"Em Treinamento\"))","v":"* * * * *"},null,null,{"$f":"IF(COUNTIF('Peso Medio'!F31:M31,\"Trein. Finalizado\")=4,\"Treinamento Finalizado\",IF(COUNTBLANK('Peso Medio'!F31:M31)=8,\"* * * * *\",\"Em Treinamento\"))","v":"Em Treinamento"},null,null,{"$f":"IF(COUNTIF('Peso Medio'!F34:M34,\"Trein. Finalizado\")=4,\"Treinamento Finalizado\",IF(COUNTBLANK('Peso Medio'!F34:M34)=8,\"* * * * *\",\"Em Treinamento\"))","v":"Em Treinamento"},null,null,{"$f":"IF(COUNTIF(Validação!F31:Q31,\"Trein. Finalizado\")=6,\"Treinamento Finalizado\",IF(COUNTBLANK(Validação!F31:Q31)=12,\"* * * * *\",\"Em Treinamento\"))","v":"Em Treinamento"},null,null,{"$f":"IF(COUNTIF(Validação!F34:Q34,\"Trein. Finalizado\")=6,\"Treinamento Finalizado\",IF(COUNTBLANK(Validação!F34:Q34)=12,\"* * * * *\",\"Em Treinamento\"))","v":"Em Treinamento"},null,null,{"$f":"IF(COUNTIF('Teor A.'!F31:K31,\"Trein. Finalizado\")=3,\"Treinamento Finalizado\",IF(COUNTBLANK('Teor A.'!F31:K31)=6,\"* * * * *\",\"Em Treinamento\"))","v":"Em Treinamento"},null,null,{"$f":"IF(COUNTIF('Teor A.'!F34:K34,\"Trein. Finalizado\")=3,\"Treinamento Finalizado\",IF(COUNTBLANK('Teor A.'!F34:K34)=6,\"* * * * *\",\"Em Treinamento\"))","v":"Em Treinamento"},null,null,{"$f":"IF(COUNTIF(Perfil!F31:O31,\"Trein. Finalizado\")=5,\"Treinamento Finalizado\",IF(COUNTBLANK(Perfil!F31:O31)=10,\"* * * * *\",\"Em Treinamento\"))","v":"Em Treinamento"},null,null,{"$f":"IF(COUNTIF(Perfil!F34:O34,\"Trein. Finalizado\")=5,\"Treinamento Finalizado\",IF(COUNTBLANK(Perfil!F34:O34)=10,\"* * * * *\",\"Em Treinamento\"))","v":"Em Treinamento"},null,null,{"$f":"IF(COUNTIF('Perda S.'!F31:O31,\"Trein. Finalizado\")=5,\"Treinamento Finalizado\",IF(COUNTBLANK('Perda S.'!F31:O31)=10,\"* * * * *\",\"Em Treinamento\"))","v":"* * * * *"},null,null,{"$f":"IF(COUNTIF('Perda S.'!F34:O34,\"Trein. Finalizado\")=5,\"Treinamento Finalizado\",IF(COUNTBLANK('Perda S.'!F34:O34)=10,\"* * * * *\",\"Em Treinamento\"))","v":"* * * * *"}]
[]
[null,null,null,null,null,null,null,null,null,null,null,null,null,null,null,"2023-07-16",null,null,null,null,null,"2023-07-16",null,null,null,null,null,"2023-07-16",null,null,null,null,null,null,null,null,null,null,null,"2023-07-16"]
[null,null,null,null,null,null,null,null,null,{"$f":"Geral!AN31","v":0},null,null,{"$f":"Geral!AN34","v":0}]
[]
[]
[]
[]
[null,null,null,null,null,null,null,null,null,{"$f":"IF(COUNTIF(Geral!F37:AM37,\"Trein. Finalizado\")=17,\"Treinamento Finalizado\",IF(COUNTBLANK(Geral!F37:AM37)=34,\"* * * * *\",\"Em Treinamento\"))","v":"Em Treinamento"},null,null,{"$f":"IF(COUNTIF(Geral!F40:AM40,\"Trein. Finalizado\")=17,\"Treinamento Finalizado\",IF(COUNTBLANK(Geral!F40:AM40)=34,\"* * * * *\",\"Em Treinamento\"))","v":"Em Treinamento"},null,null,{"$f":"IF(COUNTIF(hplc!F37:U37,\"Trein. Finalizado\")=8,\"Treinamento Finalizado\",IF(COUNTBLANK(hplc!F37:U37)=16,\"* * * * *\",\"Em Treinamento\"))","v":"Em Treinamento"},null,null,{"$f":"IF(COUNTIF(hplc!F40:U40,\"Trein. Finalizado\")=8,\"Treinamento Finalizado\",IF(COUNTBLANK(hplc!F40:U40)=16,\"* * * * *\",\"Em Treinamento\"))","v":"Treinamento Finalizado"},null,null,{"$f":"IF(COUNTIF(Espectro!F37:M37,\"Trein. Finalizado\")=4,\"Treinamento Finalizado\",IF(COUNTBLANK(Espectro!F37:M37)=8,\"* * * * *\",\"Em Treinamento\"))","v":"Em Treinamento"},null,null,{"$f":"IF(COUNTIF(Espectro!F40:M40,\"Trein. Finalizado\")=4,\"Treinamento Finalizado\",IF(COUNTBLANK(Espectro!F40:M40)=8,\"* * * * *\",\"Em Treinamento\"))","v":"Treinamento Finalizado"},null,null,{"$f":"IF(COUNTIF('Karl fischer'!F37:M37,\"Trein. Finalizado\")=4,\"Treinamento Finalizado\",IF(COUNTBLANK('Karl fischer'!F37:M37)=8,\"* * * * *\",\"Em Treinamento\"))","v":"Treinamento Finalizado"},null,null,{"$f":"IF(COUNTIF('Karl fischer'!F40:M40,\"Trein. Finalizado\")=4,\"Treinamento Finalizado\",IF(COUNTBLANK('Karl fischer'!F40:M40)=8,\"* * * * *\",\"Em Treinamento\"))","v":"Treinamento Finalizado"},null,null,{"$f":"IF(COUNTIF(Agua!F37:M37,\"Trein. Finalizado\")=4,\"Treinamento Finalizado\",IF(COUNTBLANK(Agua!F37:M37)=8,\"* * * * *\",\"Em Treinamento\"))","v":"Em Treinamento"},null,null,{"$f":"IF(COUNTIF(Agua!F40:M40,\"Trein. Finalizado\")=4,\"Treinamento Finalizado\",IF(COUNTBLANK(Agua!F40:M40)=8,\"* * * * *\",\"Em Treinamento\"))","v":"Em Treinamento"},null,null,{"$f":"IF(COUNTIF(Titulação!F37:M37,\"Trein. Finalizado\")=4,\"Treinamento Finalizado\",IF(COUNTBLANK(Titulação!F37:M37)=8,\"* * * * *\",\"Em Treinamento\"))","v":"Treinamento Finalizado"},null,null,{"$f":"IF(COUNTIF(Titulação!F40:M40,\"Trein. Finalizado\")=4,\"Treinamento Finalizado\",IF(COUNTBLANK(Titulação!F40:M40)=8,\"* * * * *\",\"Em Treinamento\"))","v":"Treinamento Finalizado"},null,null,{"$f":"IF(COUNTIF('Peso Medio'!F37:M37,\"Trein. Finalizado\")=4,\"Treinamento Finalizado\",IF(COUNTBLANK('Peso Medio'!F37:M37)=8,\"* * * * *\",\"Em Treinamento\"))","v":"Em Treinamento"},null,null,{"$f":"IF(COUNTIF('Peso Medio'!F40:M40,\"Trein. Finalizado\")=4,\"Treinamento Finalizado\",IF(COUNTBLANK('Peso Medio'!F40:M40)=8,\"* * * * *\",\"Em Treinamento\"))","v":"Em Treinamento"},null,null,{"$f":"IF(COUNTIF(Validação!F37:Q37,\"Trein. Finalizado\")=6,\"Treinamento Finalizado\",IF(COUNTBLANK(Validação!F37:Q37)=12,\"* * * * *\",\"Em Treinamento\"))","v":"Em Treinamento"},null,null,{"$f":"IF(COUNTIF(Validação!F40:Q40,\"Trein. Finalizado\")=6,\"Treinamento Finalizado\",IF(COUNTBLANK(Validação!F40:Q40)=12,\"* * * * *\",\"Em Treinamento\"))","v":"Em Treinamento"},null,null,{"$f":"IF(COUNTIF('Teor A.'!F37:K37,\"Trein. Finalizado\")=3,\"Treinamento Finalizado\",IF(COUNTBLANK('Teor A.'!F37:K37)=6,\"* * * * *\",\"Em Treinamento\"))","v":"Em Treinamento"},null,null,{"$f":"IF(COUNTIF('Teor A.'!F40:K40,\"Trein. Finalizado\")=3,\"Treinamento Finalizado\",IF(COUNTBLANK('Teor A.'!F40:K40)=6,\"* * * * *\",\"Em Treinamento\"))","v":"Em Treinamento"},null,null,{"$f":"IF(COUNTIF(Perfil!F37:O37,\"Trein. Finalizado\")=5,\"Treinamento Finalizado\",IF(COUNTBLANK(Perfil!F37:O37)=10,\"* * * * *\",\"Em Treinamento\"))","v":"Em Treinamento"},null,null,{"$f":"IF(COUNTIF(Perfil!F40:O40,\"Trein. Finalizado\")=5,\"Treinamento Finalizado\",IF(COUNTBLANK(Perfil!F40:O40)=10,\"* * * * *\",\"Em Treinamento\"))","v":"Em Treinamento"},null,null,{"$f":"IF(COUNTIF('Perda S.'!F37:O37,\"Trein. Finalizado\")=5,\"Treinamento Finalizado\",IF(COUNTBLANK('Perda S.'!F37:O37)=10,\"* * * * *\",\"Em Treinamento\"))","v":"* * * * *"},null,null,{"$f":"IF(COUNTIF('Perda S.'!F40:O40,\"Trein. Finalizado\")=5,\"Treinamento Finalizado\",IF(COUNTBLANK('Perda S.'!F40:O40)=10,\"* * * * *\",\"Em Treinamento\"))","v":"* * * * *"}]
[]
[null,null,null,null,null,null,null,null,null,null,null,null,null,null,null,null,null,null,null,null,null,null,null,null,"2023-07-16",null,null,"2023-07-16",null,null,"2023-07-16",null,null,null,null,null,null,null,null,"2023-07-16",null,null,"2023-07-16"]
[null,null,null,null,null,null,null,null,null,{"$f":"Geral!AN37","v":0},null,null,{"$f":"Geral!AN40","v":0}]
[null,null,null,null,null,null,null,null,null,null,null,null,null,null,null,null,null,null,null,null,null,null,null,null,"2023-07-16",null,null,"2023-07-16",null,null,"2023-07-16",null,null,null,null,null,null,null,null,"2023-07-16",null,null,"2023-07-16"]
[]
[]
[null,null,null,null,null,null,null,null,null,{"$f":"IF(COUNTIF(Geral!F43:AM43,\"Trein. Finalizado\")=17,\"Treinamento Finalizado\",IF(COUNTBLANK(Geral!F43:AM43)=34,\"* * * * *\",\"Em Treinamento\"))","v":"Em Treinamento"},null,null,{"$f":"IF(COUNTIF(Geral!F46:AM46,\"Trein. Finalizado\")=17,\"Treinamento Finalizado\",IF(COUNTBLANK(Geral!F46:AM46)=34,\"* * * * *\",\"Em Treinamento\"))","v":"Em Treinamento"},null,null,{"$f":"IF(COUNTIF(hplc!F43:U43,\"Trein. Finalizado\")=8,\"Treinamento Finalizado\",IF(COUNTBLANK(hplc!F43:U43)=16,\"* * * * *\",\"Em Treinamento\"))","v":"Em Treinamento"},null,null,{"$f":"IF(COUNTIF(hplc!F46:U46,\"Trein. Finalizado\")=8,\"Treinamento Finalizado\",IF(COUNTBLANK(hplc!F46:U46)=16,\"* * * * *\",\"Em Treinamento\"))","v":"* * * * *"},null,null,{"$f":"IF(COUNTIF(Espectro!F43:M43,\"Trein. Finalizado\")=4,\"Treinamento Finalizado\",IF(COUNTBLANK(Espectro!F43:M43)=8,\"* * * * *\",\"Em Treinamento\"))","v":"Em Treinamento"},null,null,{"$f":"IF(COUNTIF(Espectro!F46:M46,\"Trein. Finalizado\")=4,\"Treinamento Finalizado\",IF(COUNTBLANK(Espectro!F46:M46)=8,\"* * * * *\",\"Em Treinamento\"))","v":"* * * * *"},null,null,{"$f":"IF(COUNTIF('Karl fischer'!F43:M43,\"Trein. Finalizado\")=4,\"Treinamento Finalizado\",IF(COUNTBLANK('Karl fischer'!F43:M43)=8,\"* * * * *\",\"Em Treinamento\"))","v":"Treinamento Finalizado"},null,null,{"$f":"IF(COUNTIF('Karl fischer'!F46:M46,\"Trein. Finalizado\")=4,\"Treinamento Finalizado\",IF(COUNTBLANK('Karl fischer'!F46:M46)=8,\"* * * * *\",\"Em Treinamento\"))","v":"* * * * *"},null,null,{"$f":"IF(COUNTIF(Agua!F43:M43,\"Trein. Finalizado\")=4,\"Treinamento Finalizado\",IF(COUNTBLANK(Agua!F43:M43)=8,\"* * * * *\",\"Em Treinamento\"))","v":"Em Treinamento"},null,null,{"$f":"IF(COUNTIF(Agua!F46:M46,\"Trein. Finalizado\")=4,\"Treinamento Finalizado\",IF(COUNTBLANK(Agua!F46:M46)=8,\"* * * * *\",\"Em Treinamento\"))","v":"* * * * *"},null,null,{"$f":"IF(COUNTIF(Titulação!F43:M43,\"Trein. Finalizado\")=4,\"Treinamento Finalizado\",IF(COUNTBLANK(Titulação!F43:M43)=8,\"* * * * *\",\"Em Treinamento\"))","v":"Treinamento Finalizado"},null,null,{"$f":"IF(COUNTIF(Titulação!F46:M46,\"Trein. Finalizado\")=4,\"Treinamento Finalizado\",IF(COUNTBLANK(Titulação!F46:M46)=8,\"* * * * *\",\"Em Treinamento\"))","v":"Treinamento Finalizado"},null,null,{"$f":"IF(COUNTIF('Peso Medio'!F43:M43,\"Trein. Finalizado\")=4,\"Treinamento Finalizado\",IF(COUNTBLANK('Peso Medio'!F43:M43)=8,\"* * * * *\",\"Em Treinamento\"))","v":"Em Treinamento"},null,null,{"$f":"IF(COUNTIF('Peso Medio'!F46:M46,\"Trein. Finalizado\")=4,\"Treinamento Finalizado\",IF(COUNTBLANK('Peso Medio'!F46:M46)=8,\"* * * * *\",\"Em Treinamento\"))","v":"Em Treinamento"},null,null,{"$f":"IF(COUNTIF(Validação!F43:Q43,\"Trein. Finalizado\")=6,\"Treinamento Finalizado\",IF(COUNTBLANK(Validação!F43:Q43)=12,\"* * * * *\",\"Em Treinamento\"))","v":"Em Treinamento"},null,null,{"$f":"IF(COUNTIF(Validação!F46:Q46,\"Trein. Finalizado\")=6,\"Treinamento Finalizado\",IF(COUNTBLANK(Validação!F46:Q46)=12,\"* * * * *\",\"Em Treinamento\"))","v":"Em Treinamento"},null,null,{"$f":"IF(COUNTIF('Teor A.'!F43:K43,\"Trein. Finalizado\")=3,\"Treinamento Finalizado\",IF(COUNTBLANK('Teor A.'!F43:K43)=6,\"* * * * *\",\"Em Treinamento\"))","v":"Em Treinamento"},null,null,{"$f":"IF(COUNTIF('Teor A.'!F46:K46,\"Trein. Finalizado\")=3,\"Treinamento Finalizado\",IF(COUNTBLANK('Teor A.'!F46:K46)=6,\"* * * * *\",\"Em Treinamento\"))","v":"Em Treinamento"},null,null,{"$f":"IF(COUNTIF(Perfil!F43:O43,\"Trein. Finalizado\")=5,\"Treinamento Finalizado\",IF(COUNTBLANK(Perfil!F43:O43)=10,\"* * * * *\",\"Em Treinamento\"))","v":"Em Treinamento"},null,null,{"$f":"IF(COUNTIF(Perfil!F46:O46,\"Trein. Finalizado\")=5,\"Treinamento Finalizado\",IF(COUNTBLANK(Perfil!F46:O46)=10,\"* * * * *\",\"Em Treinamento\"))","v":"Em Treinamento"},null,null,{"$f":"IF(COUNTIF('Perda S.'!F43:O43,\"Trein. Finalizado\")=5,\"Treinamento Finalizado\",IF(COUNTBLANK('Perda S.'!F43:O43)=10,\"* * * * *\",\"Em Treinamento\"))","v":"* * * * *"},null,null,{"$f":"IF(COUNTIF('Perda S.'!F46:O46,\"Trein. Finalizado\")=5,\"Treinamento Finalizado\",IF(COUNTBLANK('Perda S.'!F46:O46)=10,\"* * * * *\",\"Em Treinamento\"))","v":"* * * * *"}]
[]
[null,null,null,null,null,null,null,null,null,null,null,null,null,null,null,null,null,null,null,null,null,null,null,null,null,null,null,"2023-07-16",null,null,"2023-07-16",null,null,null,null,null,null,null,null,"2023-07-16",null,null,"2023-07-16"]
[null,null,null,null,null,null,null,null,null,{"$f":"Geral!AN43","v":0},null,null,{"$f":"Geral!AN46","v":0}]
[null,null,null,null,null,null,null,null,null,null,null,null,null,null,null,null,null,null,null,null,null,null,null,null,null,null,null,"2023-07-16",null,null,"2023-07-16",null,null,null,null,null,null,null,null,"2023-07-16",null,null,"2023-07-16"]
[]
[]
[null,null,null,null,null,null,null,null,null,{"$f":"IF(COUNTIF(Geral!F49:AM49,\"Trein. Finalizado\")=17,\"Treinamento Finalizado\",IF(COUNTBLANK(Geral!F49:AM49)=34,\"* * * * *\",\"Em Treinamento\"))","v":"Em Treinamento"},null,null,{"$f":"IF(COUNTIF(Geral!F52:AM52,\"Trein. Finalizado\")=17,\"Treinamento Finalizado\",IF(COUNTBLANK(Geral!F52:AM52)=34,\"* * * * *\",\"Em Treinamento\"))","v":"Em Treinamento"},null,null,{"$f":"IF(COUNTIF(hplc!F49:U49,\"Trein. Finalizado\")=8,\"Treinamento Finalizado\",IF(COUNTBLANK(hplc!F49:U49)=16,\"* * * * *\",\"Em Treinamento\"))","v":"Em Treinamento"},null,null,{"$f":"IF(COUNTIF(hplc!F52:U52,\"Trein. Finalizado\")=8,\"Treinamento Finalizado\",IF(COUNTBLANK(hplc!F52:U52)=16,\"* * * * *\",\"Em Treinamento\"))","v":"* * * * *"},null,null,{"$f":"IF(COUNTIF(Espectro!F49:M49,\"Trein. Finalizado\")=4,\"Treinamento Finalizado\",IF(COUNTBLANK(Espectro!F49:M49)=8,\"* * * * *\",\"Em Treinamento\"))","v":"* * * * *"},null,null,{"$f":"IF(COUNTIF(Espectro!F52:M52,\"Trein. Finalizado\")=4,\"Treinamento Finalizado\",IF(COUNTBLANK(Espectro!F52:M52)=8,\"* * * * *\",\"Em Treinamento\"))","v":"* * * * *"},null,null,{"$f":"IF(COUNTIF('Karl fischer'!F49:M49,\"Trein. Finalizado\")=4,\"Treinamento Finalizado\",IF(COUNTBLANK('Karl fischer'!F49:M49)=8,\"* * * * *\",\"Em Treinamento\"))","v":"* * * * *"},null,null,{"$f":"IF(COUNTIF('Karl fischer'!F52:M52,\"Trein. Finalizado\")=4,\"Treinamento Finalizado\",IF(COUNTBLANK('Karl fischer'!F52:M52)=8,\"* * * * *\",\"Em Treinamento\"))","v":"* * * * *"},null,null,{"$f":"IF(COUNTIF(Agua!F49:M49,\"Trein. Finalizado\")=4,\"Treinamento Finalizado\",IF(COUNTBLANK(Agua!F49:M49)=8,\"* * * * *\",\"Em Treinamento\"))","v":"* * * * *"},null,null,{"$f":"IF(COUNTIF(Agua!F52:M52,\"Trein. Finalizado\")=4,\"Treinamento Finalizado\",IF(COUNTBLANK(Agua!F52:M52)=8,\"* * * * *\",\"Em Treinamento\"))","v":"* * * * *"},null,null,{"$f":"IF(COUNTIF(Titulação!F49:M49,\"Trein. Finalizado\")=4,\"Treinamento Finalizado\",IF(COUNTBLANK(Titulação!F49:M49)=8,\"* * * * *\",\"Em Treinamento\"))","v":"* * * * *"},null,null,{"$f":"IF(COUNTIF(Titulação!F52:M52,\"Trein. Finalizado\")=4,\"Treinamento Finalizado\",IF(COUNTBLANK(Titulação!F52:M52)=8,\"* * * * *\",\"Em Treinamento\"))","v":"* * * * *"},null,null,{"$f":"IF(COUNTIF('Peso Medio'!F49:M49,\"Trein. Finalizado\")=4,\"Treinamento Finalizado\",IF(COUNTBLANK('Peso Medio'!F49:M49)=8,\"* * * * *\",\"Em Treinamento\"))","v":"* * * * *"},null,null,{"$f":"IF(COUNTIF('Peso Medio'!F52:M52,\"Trein. Finalizado\")=4,\"Treinamento Finalizado\",IF(COUNTBLANK('Peso Medio'!F52:M52)=8,\"* * * * *\",\"Em Treinamento\"))","v":"* * * * *"},null,null,{"$f":"IF(COUNTIF(Validação!F49:Q49,\"Trein. Finalizado\")=6,\"Treinamento Finalizado\",IF(COUNTBLANK(Validação!F49:Q49)=12,\"* * * * *\",\"Em Treinamento\"))","v":"* * * * *"},null,null,{"$f":"IF(COUNTIF(Validação!F52:Q52,\"Trein. Finalizado\")=6,\"Treinamento Finalizado\",IF(COUNTBLANK(Validação!F52:Q52)=12,\"* * * * *\",\"Em Treinamento\"))","v":"* * * * *"},null,null,{"$f":"IF(COUNTIF('Teor A.'!F49:K49,\"Trein. Finalizado\")=3,\"Treinamento Finalizado\",IF(COUNTBLANK('Teor A.'!F49:K49)=6,\"* * * * *\",\"Em Treinamento\"))","v":"* * * * *"},null,null,{"$f":"IF(COUNTIF('Teor A.'!F52:K52,\"Trein. Finalizado\")=3,\"Treinamento Finalizado\",IF(COUNTBLANK('Teor A.'!F52:K52)=6,\"* * * * *\",\"Em Treinamento\"))","v":"* * * * *"},null,null,{"$f":"IF(COUNTIF(Perfil!F49:O49,\"Trein. Finalizado\")=5,\"Treinamento Finalizado\",IF(COUNTBLANK(Perfil!F49:O49)=10,\"* * * * *\",\"Em Treinamento\"))","v":"* * * * *"},null,null,{"$f":"IF(COUNTIF(Perfil!F52:O52,\"Trein. Finalizado\")=5,\"Treinamento Finalizado\",IF(COUNTBLANK(Perfil!F52:O52)=10,\"* * * * *\",\"Em Treinamento\"))","v":"* * * * *"},null,null,{"$f":"IF(COUNTIF('Perda S.'!F49:O49,\"Trein. Finalizado\")=5,\"Treinamento Finalizado\",IF(COUNTBLANK('Perda S.'!F49:O49)=10,\"* * * * *\",\"Em Treinamento\"))","v":"* * * * *"},null,null,{"$f":"IF(COUNTIF('Perda S.'!F52:O52,\"Trein. Finalizado\")=5,\"Treinamento Finalizado\",IF(COUNTBLANK('Perda S.'!F52:O52)=10,\"* * * * *\",\"Em Treinamento\"))","v":"* * * * *"}]
[]
[null,null,null,null,null,null,null,null,null,null,null,null,null,null,null,null,null,null,null,null,null,null,null,null,null,null,null,"2023-07-16",null,null,"2023-07-16",null,null,null,null,null,null,null,null,"2023-07-16",null,null,"2023-07-16"]
[null,null,null,null,null,null,null,null,null,{"$f":"Geral!AN49","v":0},null,null,{"$f":"Geral!AN52","v":0}]
[null,null,null,null,null,null,null,null,null,null,null,null,null,null,null,null,null,null,null,null,null,null,null,null,null,null,null,"2023-07-16",null,null,"2023-07-16",null,null,null,null,null,null,null,null,"2023-07-16",null,null,"2023-07-16"]

{"sheet":"Geral","index":8,"n_rows":56,"n_cols":47,"rows_kept":56,"cut":false,"hidden":false,"merged":[[57,39,57,40],[60,39,60,40],[12,39,12,40],[15,39,15,40],[18,39,18,40],[21,39,21,40],[24,39,24,40],[27,39,27,40],[30,39,30,40],[33,39,33,40],[36,39,36,40],[30,11,30,12],[30,13,30,14],[0,2,4,43],[39,39,39,40],[42,39,42,40],[45,39,45,40],[48,39,48,40],[51,39,51,40],[54,39,54,40],[39,9,39,10],[42,9,42,10],[45,9,45,10],[48,9,48,10],[51,9,51,10],[54,9,54,10],[48,31,48,32],[48,33,48,34],[57,9,57,10],[60,9,60,10],[18,33,18,34],[21,33,21,34],[24,33,24,34],[27,33,27,34],[30,33,30,34],[33,33,33,34],[60,11,60,12],[60,13,60,14],[54,11,54,12],[54,13,54,14],[48,11,48,12],[48,13,48,14],[51,11,51,12],[51,13,51,14],[45,11,45,12],[45,13,45,14],[42,11,42,12],[42,13,42,14],[36,11,36,12],[36,13,36,14],[60,37,60,38],[57,37,57,38],[60,5,60,6],[60,7,60,8],[60,15,60,16],[60,17,60,18],[60,19,60,20],[60,21,60,22],[60,23,60,24],[60,25,60,26],[57,23,57,24],[57,25,57,26],[57,27,57,28],[57,29,57,30],[57,35,57,36],[57,11,57,12],[57,13,57,14],[60,31,60,32],[60,33,60,34],[60,27,60,28],[60,29,60,30],[60,35,60,36],[54,5,54,6],[54,7,54,8],[54,15,54,16],[54,17,54,18],[54,35,54,36],[54,37,54,38],[57,5,57,6],[57,7,57,8],[57,15,57,16],[57,17,57,18],[57,19,57,20],[57,21,57,22],[54,19,54,20],[54,21,54,22],[54,23,54,24],[54,25,54,26],[54,27,54,28],[54,29,54,30],[54,31,54,32],[54,33,54,34],[57,31,57,32],[57,33,57,34],[51,37,51,38],[51,5,51,6],[51,7,51,8],[51,15,51,16],[51,17,51,18],[51,19,51,20],[51,21,51,22],[51,23,51,24],[51,25,51,26],[51,31,51,32],[51,33,51,34],[51,27,51,28],[51,29,51,30],[51,35,51,36],[45,5,45,6],[45,7,45,8],[45,15,45,16],[45,17,45,18],[45,35,45,36],[45,37,45,38],[48,5,48,6],[48,7,48,8],[48,15,48,16],[48,17,48,18],[48,19,48,20],[48,21,48,22],[45,19,45,20],[45,21,45,22],[45,23,45,24],[45,25,45,26],[45,27,45,28],[45,29,45,30],[48,37,48,38],[48,23,48,24],[48,25,48,26],[48,27,48,28],[48,29,48,30],[48,35,48,36],[39,37,39,38],[42,5,42,6],[42,7,42,8],[42,15,42,16],[42,17,42,18],[42,19,42,20],[42,21,42,22],[42,23,42,24],[42,25,42,26],[39,23,39,24],[39,25,39,26],[39,27,39,28],[39,29,39,30],[39,31,39,32],[39,35,39,36],[42,27,42,28],[42,29,42,30],[42,31,42,32],[42,35,42,36],[42,37,42,38],[39,11,39,12],[39,13,39,14],[39,5,39,6],[39,7,39,8],[33,37,33,38],[36,5,36,6],[36,7,36,8],[36,15,36,16],[36,17,36,18],[36,31,36,32],[36,35,36,36],[36,37,36,38],[36,23,36,24],[36,25,36,26],[36,27,36,28],[36,29,36,30],[33,11,33,12],[33,13,33,14],[33,5,33,6],[33,7,33,8],[33,15,33,16],[33,17,33,18],[33,19,33,20],[33,21,33,22],[33,23,33,24],[33,25,33,26],[33,9,33,10],[33,35,33,36],[27,35,27,36],[27,37,27,38],[30,5,30,6],[30,7,30,8],[30,15,30,16],[30,17,30,18],[30,19,30,20],[30,21,30,22],[27,19,27,20],[27,21,27,22],[27,23,27,24],[27,25,27,26],[27,27,27,28],[27,29,27,30],[30,37,30,38],[30,23,30,24],[30,25,30,26],[30,27,30,28],[30,29,30,30],[30,31,30,32],[30,35,30,36],[27,11,27,12],[27,5,27,6],[27,7,27,8],[24,5,24,6],[24,7,24,8],[24,15,24,16],[27,13,27,14],[21,27,21,28],[21,29,21,30],[21,5,21,6],[21,7,21,8],[21,15,21,16],[24,9,24,10],[24,11,24,12],[24,13,24,14],[21,11,21,12],[21,13,21,14],[21,9,21,10],[21,35,21,36],[21,37,21,38],[24,17,24,18],[24,19,24,20],[24,21,24,22],[24,23,24,24],[24,25,24,26],[21,17,21,18],[21,19,21,20],[24,27,24,28],[24,29,24,30],[24,31,24,32],[24,35,24,36],[24,37,24,38],[21,21,21,22],[21,23,21,24],[21,25,21,26],[15,35,15,36],[15,37,15,38],[18,5,18,6],[18,7,18,8],[18,15,18,16],[18,17,18,18],[18,31,18,32],[18,35,18,36],[18,37,18,38],[18,27,18,28],[18,29,18,30],[18,9,18,10],[15,11,15,12],[15,13,15,14],[18,11,18,12],[18,13,18,14],[15,9,15,10],[15,33,15,34],[27,15,27,16],[27,17,27,18],[12,13,12,14],[12,33,12,34],[15,17,15,18],[15,19,15,20],[15,21,15,22],[15,23,15,24],[15,25,15,26],[12,25,12,26],[12,27,12,28],[12,29,12,30],[12,31,12,32],[18,19,18,20],[18,21,18,22],[18,23,18,24],[18,25,18,26],[15,29,15,30],[15,31,15,32],[21,31,21,32],[39,15,39,16],[39,17,39,18],[39,19,39,20],[39,21,39,22],[36,19,36,20],[36,21,36,22],[33,27,33,28],[33,29,33,30],[33,31,33,32],[0,0,4,0],[30,9,30,10],[27,9,27,10],[36,33,36,34],[39,33,39,34],[42,33,42,34],[45,31,45,32],[45,33,45,34],[12,37,12,38],[15,5,15,6],[15,7,15,8],[15,15,15,16],[12,35,12,36],[12,5,12,6],[12,7,12,8],[12,15,12,16],[12,17,12,18],[12,19,12,20],[12,21,12,22],[12,23,12,24],[15,27,15,28],[12,9,12,10],[12,11,12,12],[27,31,27,32]]}
[null,null," MATRIZ DE VERSATILIDADE - F 140  R01     MATRIZ DE VERSATILIDADE - F 140  R01"]
[]
[]
[]
[]
[]
[]
[]
[]
[]
[]
[]
[null,null,null,null,null,"Trein. Finalizado",null,"Trein. Finalizado",null,"Trein. Finalizado",null,"Trein. Finalizado",null,"Trein. Finalizado",null,"Trein. Finalizado",null,"Trein. Finalizado",null,"Trein. Finalizado",null,"Trein. Finalizado",null,"Trein. Finalizado",null,"Trein. Finalizado",null,"Trein. Finalizado",null,"Trein. Finalizado",null,"Trein. Finalizado",null,"Trein. Finalizado",null,"Trein. Finalizado",null,"Trein. Finalizado",null,"Autorizado(a)"]
[]
[]
[]
[]
[]
[null,null,null,null,null,"Trein. Finalizado",null,"Trein. Finalizado",null,"Trein. Finalizado",null,"Trein. Finalizado",null,"Trein. Finalizado",null,"Trein. Finalizado",null,"Trein. Finalizado",null,"Trein. Finalizado",null,"Trein. Finalizado",null,"Trein. Finalizado",null,"Trein. Finalizado",null,"Trein. Finalizado",null,"Trein. Finalizado",null,"Trein. Finalizado",null,"Trein. Finalizado",null,"Trein. Finalizado",null,"Trein. Finalizado"]
[]
[]
[null,null,null,null,null,"Trein. Finalizado",null,"Trein. Finalizado",null,"Trein. Finalizado",null,"Trein. Finalizado",null,"Trein. Finalizado",null,"Trein. Finalizado",null,"Trein. Finalizado",null,"Trein. Finalizado",null,"Trein. Finalizado",null,"Trein. Finalizado",null,"Trein. Finalizado",null,"Trein. Finalizado",null,"Trein. Finalizado",null,"Trein. Finalizado",null,"Trein. Finalizado",null,"Trein. Finalizado",null,"Trein. Finalizado"]
[]
[]
[null,null,null,null,null,"Trein. Finalizado",null,"Trein. Finalizado",null,"Trein. Finalizado",null,"Trein. Finalizado",null,"Trein. Finalizado",null,"Trein. Finalizado",null,"Trein. Finalizado",null,"Trein. Finalizado",null,"Trein. Finalizado",null,"Trein. Finalizado",null,"Trein. Finalizado",null,"Trein. Finalizado",null,"Trein. Finalizado",null,"Trein. Finalizado",null,"Trein. Finalizado",null,"Em Treinamento",null,"Trein. Finalizado"]
[]
[]
[null,null,null,null,null,"Trein. Finalizado",null,"Trein. Finalizado",null,null,null,"Trein. Finalizado",null,null,null,"Trein. Finalizado",null,"Trein. Finalizado",null,"Trein. Finalizado",null,"Trein. Finalizado",null,"Trein. Finalizado",null,"Trein. Finalizado",null,"Trein. Finalizado",null,"Trein. Finalizado",null,"Trein. Finalizado",null,null,null,"Trein. Finalizado",null,"Trein. Finalizado"]
[]
[]
[null,null,null,null,null,"Trein. Finalizado",null,"Trein. Finalizado",null,null,null,"Trein. Finalizado",null,null,null,"Trein. Finalizado",null,"Trein. Finalizado",null,"Trein. Finalizado",null,"Trein. Finalizado",null,"Trein. Finalizado",null,"Trein. Finalizado",null,"Trein. Finalizado",null,"Trein. Finalizado",null,"Em Treinamento",null,null,null,"Trein. Finalizado",null,"Trein. Finalizado"]
[]
[]
[null,null,null,null,null,null,null,"Trein. Finalizado",null,null,null,"Trein. Finalizado",null,null,null,"Trein. Finalizado",null,"Trein. Finalizado",null,"Trein. Finalizado",null,"Trein. Finalizado",null,"Trein. Finalizado",null,"Trein. Finalizado",null,"Trein. Finalizado",null,"Trein. Finalizado",null,"Trein. Finalizado",null,null,null,"Trein. Finalizado",null,"Trein. Finalizado"]
[]
[]
[null,null,null,null,null,"Trein. Finalizado",null,"Trein. Finalizado",null,null,null,"Trein. Finalizado",null,null,null,"Trein. Finalizado",null,"Trein. Finalizado",null,"Trein. Finalizado",null,"Trein. Finalizado",null,"Trein. Finalizado",null,"Trein. Finalizado",null,"Trein. Finalizado",null,"Trein. Finalizado",null,"Trein. Finalizado",null,null,null,"Trein. Finalizado",null,"Trein. Finalizado"]
[]
[]
[null,null,null,null,null,"Trein. Finalizado",null,"Trein. Finalizado",null,null,null,"Trein. Finalizado",null,null,null,"Trein. Finalizado",null,"Trein. Finalizado",null,"Trein. Finalizado",null,"Trein. Finalizado",null,"Trein. Finalizado",null,"Trein. Finalizado",null,"Trein. Finalizado",null,"Trein. Finalizado",null,"Trein. Finalizado",null,null,null,"Trein. Finalizado",null,"Trein. Finalizado"]
[]
[]
[null,null,null,null,null,"Em Treinamento",null,"Em Treinamento",null,null,null,"Em Treinamento",null,null,null,"Em Treinamento",null,"Em Treinamento",null,"Em Treinamento",null,"Em Treinamento",null,"Em Treinamento",null,null,null,"Trein. Finalizado",null,"Em Treinamento",null,"Em Treinamento",null,null,null,"Em Treinamento",null,"Em Treinamento"]
[]
[]
[null,null,null,null,null,"Trein. Finalizado",null,"Trein. Finalizado",null,null,null,"Trein. Finalizado",null,null,null,"Trein. Finalizado",null,"Trein. Finalizado",null,"Trein. Finalizado",null,"Trein. Finalizado",null,"Trein. Finalizado",null,"Trein. Finalizado",null,"Trein. Finalizado",null,"Trein. Finalizado",null,"Trein. Finalizado",null,null,null,"Trein. Finalizado",null,"Trein. Finalizado"]
[]
[]
[null,null,null,null,null,"Em Treinamento",null,"Em Treinamento",null,null,null,"Em Treinamento",null,null,null,"Em Treinamento",null,"Em Treinamento",null,"Em Treinamento",null,"Em Treinamento",null,"Em Treinamento",null,"Em Treinamento",null,"Em Treinamento",null,"Em Treinamento",null,"Em Treinamento",null,null,null,"Em Treinamento",null,"Em Treinamento"]
[]
[]
[null,null,null,null,null,"Trein. Finalizado",null,"Trein. Finalizado",null,null,null,"Em Treinamento",null,null,null,"Em Treinamento",null,"Em Treinamento",null,"Trein. Finalizado",null,null,null,"Trein. Finalizado",null,"Em Treinamento",null,"Trein. Finalizado",null,"Em Treinamento",null,"Trein. Finalizado",null,null,null,"Trein. Finalizado",null,"Trein. Finalizado"]
[]
[]
[null,null,null,null,null,"Em Treinamento",null,"Em Treinamento",null,null,null,"Em Treinamento",null,null,null,"Em Treinamento",null,"Em Treinamento",null,"Em Treinamento",null,"Em Treinamento",null,"Em Treinamento",null,"Em Treinamento",null,"Em Treinamento",null,"Em Treinamento",null,"Em Treinamento",null,null,null,"Em Treinamento",null,"Em Treinamento",null,null,null,null,null,null,null,null,"Trein. Finalizado"]
[null,null,null,null,null,null,null,null,null,null,null,null,null,null,null,null,null,null,null,null,null,null,null,null,null,null,null,null,null,null,null,null,null,null,null,null,null,null,null,null,null,null,null,null,null,null,"Em Treinamento"]

{"sheet":"hplc","index":9,"n_rows":49,"n_cols":20,"rows_kept":49,"cut":false,"hidden":false,"merged":[[45,21,45,22],[48,21,48,22],[51,21,51,22],[54,21,54,22],[57,21,57,22],[60,21,60,22],[18,21,18,22],[21,21,21,22],[24,21,24,22],[27,21,27,22],[30,21,30,22],[33,21,33,22],[36,21,36,22],[39,21,39,22],[42,21,42,22],[60,5,60,6],[60,7,60,8],[60,11,60,12],[60,13,60,14],[54,15,54,16],[54,17,54,18],[54,19,54,20],[57,5,57,6],[57,7,57,8],[57,11,57,12],[57,13,57,14],[54,5,54,6],[54,7,54,8],[54,11,54,12],[54,13,54,14],[54,9,54,10],[57,9,57,10],[60,9,60,10],[60,15,60,16],[60,17,60,18],[60,19,60,20],[57,15,57,16],[57,17,57,18],[57,19,57,20],[51,5,51,6],[51,7,51,8],[51,11,51,12],[51,13,51,14],[45,15,45,16],[45,17,45,18],[45,19,45,20],[48,5,48,6],[48,7,48,8],[48,11,48,12],[48,13,48,14],[45,5,45,6],[45,7,45,8],[45,11,45,12],[45,13,45,14],[45,9,45,10],[48,9,48,10],[51,9,51,10],[51,15,51,16],[51,17,51,18],[51,19,51,20],[48,15,48,16],[48,17,48,18],[48,19,48,20],[39,15,39,16],[39,17,39,18],[39,19,39,20],[42,5,42,6],[42,7,42,8],[42,11,42,12],[42,13,42,14],[36,15,36,16],[36,17,36,18],[36,19,36,20],[39,5,39,6],[39,7,39,8],[39,11,39,12],[39,13,39,14],[36,5,36,6],[36,7,36,8],[36,11,36,12],[36,13,36,14],[36,9,36,10],[39,9,39,10],[42,9,42,10],[42,15,42,16],[42,17,42,18],[42,19,42,20],[33,15,33,16],[33,17,33,18],[33,19,33,20],[30,15,30,16],[30,17,30,18],[30,19,30,20],[33,5,33,6],[33,7,33,8],[33,9,33,10],[33,11,33,12],[33,13,33,14],[30,5,30,6],[30,7,30,8],[30,9,30,10],[30,11,30,12],[30,13,30,14],[27,15,27,16],[27,17,27,18],[27,19,27,20],[24,15,24,16],[24,17,24,18],[24,19,24,20],[27,5,27,6],[27,7,27,8],[27,9,27,10],[27,11,27,12],[27,13,27,14],[24,5,24,6],[24,7,24,8],[24,9,24,10],[24,11,24,12],[24,13,24,14],[21,15,21,16],[21,17,21,18],[21,19,21,20],[18,15,18,16],[18,17,18,18],[18,19,18,20],[21,5,21,6],[21,7,21,8],[21,9,21,10],[21,11,21,12],[21,13,21,14],[18,5,18,6],[18,7,18,8],[18,9,18,10],[18,11,18,12],[18,13,18,14],[0,0,3,0],[15,7,15,8],[15,9,15,10],[15,11,15,12],[15,13,15,14],[12,5,12,6],[12,7,12,8],[12,9,12,10],[12,11,12,12],[12,13,12,14],[0,2,4,25],[15,15,15,16],[15,17,15,18],[15,19,15,20],[12,15,12,16],[12,17,12,18],[12,19,12,20],[15,5,15,6],[12,21,12,22],[15,21,15,22]]}
[null,null," MATRIZ DE VERSATILIDADE - F 140  R01         "]
[]
[]
[]
[]
[]
[]
[]
[]
[]
[]
[]
[null,null,null,null,null,"Trein. Finalizado",null,"Trein. Finalizado",null,"Trein. Finalizado",null,"Trein. Finalizado",null,"Trein. Finalizado",null,"Trein. Finalizado",null,"Trein. Finalizado",null,"Trein. Finalizado"]
[]
[]
[null,null,null,null,null,"Trein. Finalizado",null,"Em Treinamento",null,"Em Treinamento",null,"Trein. Finalizado",null,"Em Treinamento",null,"Em Treinamento",null,"Em Treinamento",null,"Trein. Finalizado"]
[]
[]
[null,null,null,null,null,"Em Treinamento",null,"Em Treinamento",null,"Em Treinamento",null,"Em Treinamento",null,null,null,"Em Treinamento",null,"Em Treinamento",null,"Em Treinamento"]
[]
[]
[null,null,null,null,null,"Trein. Finalizado",null,"Trein. Finalizado",null,"Trein. Finalizado",null,"Trein. Finalizado",null,"Em Treinamento",null,"Em Treinamento",null,"Trein. Finalizado"]
[]
[]
[null,null,null,null,null,"Trein. Finalizado",null,"Trein. Finalizado",null,"Trein. Finalizado",null,"Trein. Finalizado",null,"Trein. Finalizado",null,"Trein. Finalizado",null,"Trein. Finalizado",null,"Trein. Finalizado"]
[]
[]
[]
[]
[]
[null,null,null,null,null,"Trein. Finalizado",null,"Trein. Finalizado",null,"Trein. Finalizado",null,"Trein. Finalizado",null,"Trein. Finalizado",null,"Trein. Finalizado",null,"Trein. Finalizado",null,"Trein. Finalizado"]
[]
[]
[]
[]
[]
[null,null,null,null,null,"Em Treinamento",null,null,null,null,null,"Em Treinamento"]
[]
[]
[null,null,null,null,null,"Trein. Finalizado",null,"Trein. Finalizado",null,"Trein. Finalizado",null,"Trein. Finalizado",null,"Trein. Finalizado",null,"Trein. Finalizado",null,"Trein. Finalizado",null,"Trein. Finalizado"]
[]
[]
[null,null,null,null,null,"Em Treinamento",null,"Em Treinamento",null,null,null,"Em Treinamento",null,null,null,"Em Treinamento",null,null,null,"Em Treinamento"]
[]
[]
[]
[]
[]
[null,null,null,null,null,"Em Treinamento",null,"Em Treinamento",null,"Em Treinamento",null,"Em Treinamento",null,null,null,null,null,null,null,"Em Treinamento"]

{"sheet":"Espectro","index":10,"n_rows":43,"n_cols":12,"rows_kept":43,"cut":false,"hidden":false,"merged":[[60,13,60,14],[45,13,45,14],[48,13,48,14],[51,13,51,14],[54,13,54,14],[57,13,57,14],[33,13,33,14],[36,13,36,14],[39,13,39,14],[42,13,42,14],[44,13,44,14],[18,13,18,14],[21,13,21,14],[24,13,24,14],[27,13,27,14],[30,13,30,14],[60,11,60,12],[60,5,60,6],[60,7,60,8],[60,9,60,10],[54,11,54,12],[57,5,57,6],[57,7,57,8],[57,9,57,10],[57,11,57,12],[54,5,54,6],[54,7,54,8],[54,9,54,10],[48,11,48,12],[51,5,51,6],[51,7,51,8],[51,9,51,10],[51,11,51,12],[48,5,48,6],[48,7,48,8],[48,9,48,10],[42,11,42,12],[45,5,45,6],[45,7,45,8],[45,9,45,10],[45,11,45,12],[42,5,42,6],[42,7,42,8],[42,9,42,10],[36,11,36,12],[39,5,39,6],[39,7,39,8],[39,9,39,10],[39,11,39,12],[36,5,36,6],[36,7,36,8],[36,9,36,10],[30,11,30,12],[33,5,33,6],[33,7,33,8],[33,9,33,10],[33,11,33,12],[30,5,30,6],[30,7,30,8],[30,9,30,10],[24,11,24,12],[27,5,27,6],[27,7,27,8],[27,9,27,10],[27,11,27,12],[24,5,24,6],[24,7,24,8],[24,9,24,10],[18,11,18,12],[21,5,21,6],[21,7,21,8],[21,9,21,10],[21,11,21,12],[18,5,18,6],[18,7,18,8],[18,9,18,10],[0,0,3,0],[12,11,12,12],[15,5,15,6],[15,7,15,8],[15,9,15,10],[15,11,15,12],[12,5,12,6],[12,7,12,8],[12,9,12,10],[12,13,12,14],[15,13,15,14],[0,2,3,16]]}
[null,null," MATRIZ DE VERSATILIDADE - F 140  R01         "]
[]
[]
[]
[]
[]
[]
[]
[]
[]
[]
[]
[null,null,null,null,null,"Trein. Finalizado",null,"Trein. Finalizado",null,"Trein. Finalizado",null,"Trein. Finalizado"]
[]
[]
[null,null,null,null,null,"Trein. Finalizado",null,"Trein. Finalizado",null,"Trein. Finalizado"]
[]
[]
[null,null,null,null,null,"Em Treinamento",null,"Em Treinamento",null,"Em Treinamento",null,"Em Treinamento"]
[]
[]
[null,null,null,null,null,"Trein. Finalizado",null,"Trein. Finalizado",null,"Trein. Finalizado",null,"Em Treinamento"]
[]
[]
[null,null,null,null,null,"Trein. Finalizado",null,"Trein. Finalizado",null,"Trein. Finalizado",null,"Em Treinamento"]
[]
[]
[]
[]
[]
[null,null,null,null,null,"Trein. Finalizado",null,"Trein. Finalizado",null,"Trein. Finalizado",null,"Trein. Finalizado"]
[]
[]
[]
[]
[]
[null,null,null,null,null,"Trein. Finalizado",null,"Trein. Finalizado",null,"Em Treinamento",null,"Trein. Finalizado"]
[]
[]
[null,null,null,null,null,"Trein. Finalizado",null,"Trein. Finalizado",null,"Trein. Finalizado",null,"Trein. Finalizado"]
[]
[]
[null,null,null,null,null,"Em Treinamento",null,null,null,null,null,"Em Treinamento"]

{"sheet":"Karl fischer","index":11,"n_rows":43,"n_cols":12,"rows_kept":43,"cut":false,"hidden":false,"merged":[[0,2,3,17],[53,13,53,14],[54,13,54,14],[57,13,57,14],[60,13,60,14],[41,13,41,14],[42,13,42,14],[45,13,45,14],[48,13,48,14],[51,13,51,14],[27,13,27,14],[30,13,30,14],[33,13,33,14],[36,13,36,14],[39,13,39,14],[12,13,12,14],[15,13,15,14],[18,13,18,14],[21,13,21,14],[24,13,24,14],[60,5,60,6],[60,7,60,8],[60,9,60,10],[60,11,60,12],[57,5,57,6],[57,7,57,8],[57,9,57,10],[57,11,57,12],[48,5,48,6],[48,7,48,8],[48,9,48,10],[48,11,48,12],[42,5,42,6],[42,7,42,8],[42,9,42,10],[42,11,42,12],[45,5,45,6],[45,7,45,8],[45,9,45,10],[45,11,45,12],[36,5,36,6],[36,7,36,8],[36,9,36,10],[36,11,36,12],[39,5,39,6],[39,7,39,8],[39,9,39,10],[39,11,39,12],[30,5,30,6],[30,7,30,8],[30,9,30,10],[30,11,30,12],[33,5,33,6],[33,7,33,8],[33,9,33,10],[33,11,33,12],[24,5,24,6],[24,7,24,8],[24,9,24,10],[24,11,24,12],[27,5,27,6],[27,7,27,8],[27,9,27,10],[27,11,27,12],[18,9,18,10],[18,11,18,12],[21,5,21,6],[21,7,21,8],[21,9,21,10],[21,11,21,12],[0,0,3,0],[51,5,51,6],[51,7,51,8],[51,9,51,10],[51,11,51,12],[12,5,12,6],[12,7,12,8],[12,9,12,10],[12,11,12,12],[15,5,15,6],[15,7,15,8],[15,9,15,10],[15,11,15,12],[18,5,18,6],[18,7,18,8]]}
[null,null," MATRIZ DE VERSATILIDADE - F 140  R01         "]
[]
[]
[]
[]
[]
[]
[]
[]
[]
[]
[]
[null,null,null,null,null,"Trein. Finalizado",null,"Trein. Finalizado",null,"Trein. Finalizado",null,"Trein. Finalizado"]
[]
[]
[null,null,null,null,null,"Trein. Finalizado",null,"Trein. Finalizado",null,"Trein. Finalizado",null,"Trein. Finalizado"]
[]
[]
[null,null,null,null,null,"Trein. Finalizado",null,"Trein. Finalizado",null,"Trein. Finalizado",null,"Trein. Finalizado"]
[]
[]
[null,null,null,null,null,"Trein. Finalizado",null,"Trein. Finalizado",null,"Trein. Finalizado",null,"Trein. Finalizado"]
[]
[]
[null,null,null,null,null,"Trein. Finalizado",null,"Trein. Finalizado",null,"Trein. Finalizado",null,"Trein. Finalizado"]
[]
[]
[null,null,null,null,null,"Trein. Finalizado",null,"Trein. Finalizado",null,"Trein. Finalizado",null,"Trein. Finalizado"]
[]
[]
[null,null,null,null,null,"Trein. Finalizado",null,"Trein. Finalizado",null,"Trein. Finalizado",null,"Trein. Finalizado"]
[]
[]
[]
[]
[]
[null,null,null,null,null,"Trein. Finalizado",null,"Trein. Finalizado",null,"Trein. Finalizado",null,"Trein. Finalizado"]
[]
[]
[null,null,null,null,null,"Trein. Finalizado",null,"Trein. Finalizado",null,"Trein. Finalizado",null,"Trein. Finalizado"]
[]
[]
[null,null,null,null,null,"Trein. Finalizado",null,"Trein. Finalizado",null,"Trein. Finalizado",null,"Trein. Finalizado"]

{"sheet":"Agua","index":12,"n_rows":43,"n_cols":12,"rows_kept":43,"cut":false,"hidden":false,"merged":[[0,2,3,17],[57,13,57,14],[60,13,60,14],[42,13,42,14],[45,13,45,14],[48,13,48,14],[51,13,51,14],[54,13,54,14],[27,13,27,14],[30,13,30,14],[33,13,33,14],[36,13,36,14],[39,13,39,14],[12,13,12,14],[15,13,15,14],[18,13,18,14],[21,13,21,14],[24,13,24,14],[45,5,45,6],[45,7,45,8],[45,9,45,10],[45,11,45,12],[60,5,60,6],[60,7,60,8],[60,9,60,10],[60,11,60,12],[48,5,48,6],[48,7,48,8],[48,9,48,10],[48,11,48,12],[57,5,57,6],[57,7,57,8],[57,9,57,10],[57,11,57,12],[39,5,39,6],[39,7,39,8],[39,9,39,10],[39,11,39,12],[42,5,42,6],[42,7,42,8],[42,9,42,10],[42,11,42,12],[33,5,33,6],[33,7,33,8],[33,9,33,10],[33,11,33,12],[36,5,36,6],[36,7,36,8],[36,9,36,10],[36,11,36,12],[27,9,27,10],[27,11,27,12],[30,5,30,6],[30,7,30,8],[30,9,30,10],[30,11,30,12],[54,5,54,6],[54,7,54,8],[54,9,54,10],[54,11,54,12],[12,5,12,6],[12,7,12,8],[12,9,12,10],[12,11,12,12],[15,5,15,6],[15,7,15,8],[15,9,15,10],[15,11,15,12],[18,5,18,6],[18,7,18,8],[18,9,18,10],[0,0,3,0],[51,5,51,6],[51,7,51,8],[51,9,51,10],[51,11,51,12],[18,11,18,12],[21,5,21,6],[21,7,21,8],[21,9,21,10],[21,11,21,12],[24,5,24,6],[24,7,24,8],[24,9,24,10],[24,11,24,12],[27,5,27,6],[27,7,27,8]]}
[null,null," MATRIZ DE VERSATILIDADE - F 140  R01         "]
[]
[]
[]
[]
[]
[]
[]
[]
[]
[]
[]
[null,null,null,null,null,"Trein. Finalizado",null,"Trein. Finalizado",null,"Trein. Finalizado",null,"Trein. Finalizado"]
[]
[]
[null,null,null,null,null,"Trein. Finalizado",null,"Trein. Finalizado",null,"Em Treinamento",null,"Trein. Finalizado"]
[]
[]
[null,null,null,null,null,"Trein. Finalizado",null,"Trein. Finalizado",null,"Trein. Finalizado",null,"Trein. Finalizado"]
[]
[]
[null,null,null,null,null,"Trein. Finalizado",null,"Em Treinamento",null,"Trein. Finalizado",null,"Trein. Finalizado"]
[]
[]
[null,null,null,null,null,"Trein. Finalizado",null,"Trein. Finalizado",null,"Trein. Finalizado",null,"Em Treinamento"]
[]
[]
[null,null,null,null,null,"Trein. Finalizado",null,"Trein. Finalizado",null,null,null,"Trein. Finalizado"]
[]
[]
[null,null,null,null,null,"Trein. Finalizado",null,"Trein. Finalizado",null,null,null,"Trein. Finalizado"]
[]
[]
[null,null,null,null,null,"Trein. Finalizado",null,"Trein. Finalizado",null,null,null,"Trein. Finalizado"]
[]
[]
[null,null,null,null,null,"Trein. Finalizado",null,"Trein. Finalizado",null,null,null,"Trein. Finalizado"]
[]
[]
[null,null,null,null,null,"Trein. Finalizado",null,"Trein. Finalizado",null,null,null,"Trein. Finalizado"]
[]
[]
[null,null,null,null,null,"Em Treinamento",null,"Em Treinamento",null,null,null,"Em Treinamento"]

{"sheet":"Titulação","index":13,"n_rows":46,"n_cols":12,"rows_kept":46,"cut":false,"hidden":false,"merged":[[57,13,57,14],[60,13,60,14],[0,2,3,17],[42,13,42,14],[45,13,45,14],[48,13,48,14],[51,13,51,14],[54,13,54,14],[27,13,27,14],[30,13,30,14],[33,13,33,14],[36,13,36,14],[39,13,39,14],[12,13,12,14],[15,13,15,14],[18,13,18,14],[21,13,21,14],[24,13,24,14],[45,5,45,6],[45,7,45,8],[45,9,45,10],[45,11,45,12],[60,5,60,6],[60,7,60,8],[60,9,60,10],[60,11,60,12],[48,5,48,6],[48,7,48,8],[48,9,48,10],[48,11,48,12],[57,5,57,6],[57,7,57,8],[57,9,57,10],[57,11,57,12],[39,5,39,6],[39,7,39,8],[39,9,39,10],[39,11,39,12],[42,5,42,6],[42,7,42,8],[42,9,42,10],[42,11,42,12],[33,5,33,6],[33,7,33,8],[33,9,33,10],[33,11,33,12],[36,5,36,6],[36,7,36,8],[36,9,36,10],[36,11,36,12],[27,9,27,10],[27,11,27,12],[30,5,30,6],[30,7,30,8],[30,9,30,10],[30,11,30,12],[54,5,54,6],[54,7,54,8],[54,9,54,10],[54,11,54,12],[12,5,12,6],[12,7,12,8],[12,9,12,10],[12,11,12,12],[15,5,15,6],[15,7,15,8],[15,9,15,10],[15,11,15,12],[18,5,18,6],[18,7,18,8],[18,9,18,10],[0,0,3,0],[51,5,51,6],[51,7,51,8],[51,9,51,10],[51,11,51,12],[18,11,18,12],[21,5,21,6],[21,7,21,8],[21,9,21,10],[21,11,21,12],[24,5,24,6],[24,7,24,8],[24,9,24,10],[24,11,24,12],[27,5,27,6],[27,7,27,8]]}
[null,null," MATRIZ DE VERSATILIDADE - F 140  R01         "]
[]
[]
[]
[]
[]
[]
[]
[]
[]
[]
[]
[null,null,null,null,null,"Trein. Finalizado",null,"Trein. Finalizado",null,"Trein. Finalizado",null,"Trein. Finalizado"]
[]
[]
[null,null,null,null,null,"Trein. Finalizado",null,"Trein. Finalizado",null,"Trein. Finalizado",null,"Trein. Finalizado"]
[]
[]
[null,null,null,null,null,"Trein. Finalizado",null,"Trein. Finalizado",null,"Trein. Finalizado",null,"Trein. Finalizado"]
[]
[]
[null,null,null,null,null,"Trein. Finalizado",null,"Trein. Finalizado",null,"Trein. Finalizado",null,"Trein. Finalizado"]
[]
[]
[null,null,null,null,null,"Trein. Finalizado",null,"Trein. Finalizado",null,"Trein. Finalizado",null,"Trein. Finalizado"]
[]
[]
[null,null,null,null,null,"Trein. Finalizado",null,"Trein. Finalizado",null,"Trein. Finalizado",null,"Trein. Finalizado"]
[]
[]
[null,null,null,null,null,"Trein. Finalizado",null,"Trein. Finalizado",null,"Trein. Finalizado",null,"Trein. Finalizado"]
[]
[]
[]
[]
[]
[null,null,null,null,null,"Trein. Finalizado",null,"Trein. Finalizado",null,"Trein. Finalizado",null,"Trein. Finalizado"]
[]
[]
[null,null,null,null,null,"Trein. Finalizado",null,"Trein. Finalizado",null,"Trein. Finalizado",null,"Trein. Finalizado"]
[]
[]
[null,null,null,null,null,"Trein. Finalizado",null,"Trein. Finalizado",null,"Trein. Finalizado",null,"Trein. Finalizado"]
[]
[]
[null,null,null,null,null,"Trein. Finalizado",null,"Trein. Finalizado",null,"Trein. Finalizado",null,"Trein. Finalizado"]

{"sheet":"Peso Medio","index":14,"n_rows":46,"n_cols":12,"rows_kept":46,"cut":false,"hidden":false,"merged":[[15,13,15,14],[12,13,12,14],[0,2,3,18],[30,13,30,14],[27,13,27,14],[24,13,24,14],[21,13,21,14],[18,13,18,14],[60,13,60,14],[36,13,36,14],[39,13,39,14],[42,13,42,14],[33,13,33,14],[45,13,45,14],[48,13,48,14],[51,13,51,14],[54,13,54,14],[57,13,57,14],[45,5,45,6],[45,7,45,8],[45,9,45,10],[45,11,45,12],[60,5,60,6],[60,7,60,8],[60,9,60,10],[60,11,60,12],[48,5,48,6],[48,7,48,8],[48,9,48,10],[48,11,48,12],[57,5,57,6],[57,7,57,8],[57,9,57,10],[57,11,57,12],[39,5,39,6],[39,7,39,8],[39,9,39,10],[39,11,39,12],[42,5,42,6],[42,7,42,8],[42,9,42,10],[42,11,42,12],[33,5,33,6],[33,7,33,8],[33,9,33,10],[33,11,33,12],[36,5,36,6],[36,7,36,8],[36,9,36,10],[36,11,36,12],[27,9,27,10],[27,11,27,12],[30,5,30,6],[30,7,30,8],[30,9,30,10],[30,11,30,12],[54,5,54,6],[54,7,54,8],[54,9,54,10],[54,11,54,12],[12,5,12,6],[12,7,12,8],[12,9,12,10],[12,11,12,12],[15,5,15,6],[15,7,15,8],[15,9,15,10],[15,11,15,12],[18,5,18,6],[18,7,18,8],[18,9,18,10],[0,0,3,0],[51,5,51,6],[51,7,51,8],[51,9,51,10],[51,11,51,12],[18,11,18,12],[21,5,21,6],[21,7,21,8],[21,9,21,10],[21,11,21,12],[24,5,24,6],[24,7,24,8],[24,9,24,10],[24,11,24,12],[27,5,27,6],[27,7,27,8]]}
[null,null," MATRIZ DE VERSATILIDADE - F 140  R01         "]
[]
[]
[]
[]
[]
[]
[]
[]
[]
[]
[]
[null,null,null,null,null,"Trein. Finalizado",null,"Trein. Finalizado",null,"Trein. Finalizado",null,"Trein. Finalizado"]
[]
[]
[null,null,null,null,null,"Trein. Finalizado",null,"Trein. Finalizado",null,"Trein. Finalizado",null,"Trein. Finalizado"]
[]
[]
[null,null,null,null,null,"Trein. Finalizado",null,"Trein. Finalizado",null,"Trein. Finalizado",null,"Trein. Finalizado"]
[]
[]
[null,null,null,null,null,"Trein. Finalizado",null,"Em Treinamento",null,"Trein. Finalizado",null,"Trein. Finalizado"]
[]
[]
[null,null,null,null,null,"Trein. Finalizado",null,"Trein. Finalizado",null,"Trein. Finalizado",null,"Em Treinamento"]
[]
[]
[null,null,null,null,null,"Trein. Finalizado",null,"Trein. Finalizado",null,null,null,"Trein. Finalizado"]
[]
[]
[null,null,null,null,null,"Trein. Finalizado",null,"Trein. Finalizado",null,null,null,"Trein. Finalizado"]
[]
[]
[null,null,null,null,null,"Trein. Finalizado",null,"Trein. Finalizado",null,null,null,"Trein. Finalizado"]
[]
[]
[null,null,null,null,null,"Trein. Finalizado",null,"Trein. Finalizado",null,null,null,"Trein. Finalizado"]
[]
[]
[null,null,null,null,null,"Trein. Finalizado",null,"Trein. Finalizado",null,null,null,"Trein. Finalizado"]
[]
[]
[null,null,null,null,null,"Em Treinamento",null,"Em Treinamento",null,null,null,"Em Treinamento"]
[]
[]
[null,null,null,null,null,"Trein. Finalizado",null,"Trein. Finalizado",null,null,null,"Trein. Finalizado"]

{"sheet":"Validação","index":15,"n_rows":46,"n_cols":16,"rows_kept":46,"cut":false,"hidden":false,"merged":[[39,17,39,18],[42,17,42,18],[45,17,45,18],[48,17,48,18],[51,17,51,18],[54,17,54,18],[57,17,57,18],[60,17,60,18],[12,17,12,18],[15,17,15,18],[18,17,18,18],[21,17,21,18],[24,17,24,18],[27,17,27,18],[30,17,30,18],[33,17,33,18],[36,17,36,18],[60,5,60,6],[60,7,60,8],[60,9,60,10],[60,11,60,12],[60,13,60,14],[60,15,60,16],[57,5,57,6],[57,7,57,8],[57,9,57,10],[57,11,57,12],[57,13,57,14],[57,15,57,16],[54,5,54,6],[54,7,54,8],[54,9,54,10],[54,11,54,12],[54,13,54,14],[54,15,54,16],[51,5,51,6],[51,7,51,8],[51,9,51,10],[51,11,51,12],[51,13,51,14],[51,15,51,16],[48,5,48,6],[48,7,48,8],[48,9,48,10],[48,11,48,12],[48,13,48,14],[48,15,48,16],[45,5,45,6],[45,7,45,8],[45,9,45,10],[45,11,45,12],[45,13,45,14],[45,15,45,16],[42,5,42,6],[42,7,42,8],[42,9,42,10],[42,11,42,12],[42,13,42,14],[42,15,42,16],[39,5,39,6],[39,7,39,8],[39,9,39,10],[39,11,39,12],[39,13,39,14],[39,15,39,16],[36,5,36,6],[36,7,36,8],[36,9,36,10],[36,11,36,12],[36,13,36,14],[36,15,36,16],[33,5,33,6],[33,7,33,8],[33,9,33,10],[33,11,33,12],[33,13,33,14],[33,15,33,16],[30,5,30,6],[30,7,30,8],[30,9,30,10],[30,11,30,12],[30,13,30,14],[30,15,30,16],[27,5,27,6],[27,7,27,8],[27,9,27,10],[27,11,27,12],[27,13,27,14],[27,15,27,16],[24,5,24,6],[24,7,24,8],[24,9,24,10],[24,11,24,12],[24,13,24,14],[24,15,24,16],[21,5,21,6],[21,7,21,8],[21,9,21,10],[21,11,21,12],[21,13,21,14],[21,15,21,16],[0,0,3,0],[12,5,12,6],[12,7,12,8],[12,9,12,10],[12,11,12,12],[12,13,12,14],[12,15,12,16],[18,5,18,6],[18,7,18,8],[18,9,18,10],[18,11,18,12],[18,13,18,14],[18,15,18,16],[15,5,15,6],[15,7,15,8],[15,9,15,10],[15,11,15,12],[15,13,15,14],[15,15,15,16],[0,2,3,22]]}
[null,null," MATRIZ DE VERSATILIDADE - F 140  R01         "]
[]
[]
[]
[]
[]
[]
[]
[]
[]
[]
[]
[null,null,null,null,null,"Trein. Finalizado",null,"Trein. Finalizado",null,"Trein. Finalizado",null,"Trein. Finalizado",null,"Trein. Finalizado",null,"Trein. Finalizado"]
[]
[]
[null,null,null,null,null,"Trein. Finalizado",null,"Trein. Finalizado",null,"Em Treinamento",null,"Trein. Finalizado",null,"Em Treinamento",null,"Trein. Finalizado"]
[]
[]
[null,null,null,null,null,"Trein. Finalizado",null,"Trein. Finalizado",null,"Trein. Finalizado",null,"Trein. Finalizado",null,"Trein. Finalizado",null,"Trein. Finalizado"]
[]
[]
[null,null,null,null,null,"Trein. Finalizado",null,"Em Treinamento",null,"Trein. Finalizado",null,"Trein. Finalizado",null,"Trein. Finalizado",null,"Trein. Finalizado"]
[]
[]
[null,null,null,null,null,"Trein. Finalizado",null,"Trein. Finalizado",null,"Trein. Finalizado",null,"Trein. Finalizado",null,"Trein. Finalizado",null,"Em Treinamento"]
[]
[]
[null,null,null,null,null,"Trein. Finalizado",null,"Trein. Finalizado",null,null,null,"Trein. Finalizado",null,null,null,"Trein. Finalizado"]
[]
[]
[null,null,null,null,null,"Trein. Finalizado",null,"Trein. Finalizado",null,null,null,"Em Treinamento",null,null,null,"Trein. Finalizado"]
[]
[]
[null,null,null,null,null,"Trein. Finalizado",null,"Trein. Finalizado",null,null,null,"Trein. Finalizado",null,null,null,"Trein. Finalizado"]
[]
[]
[null,null,null,null,null,"Trein. Finalizado",null,"Trein. Finalizado",null,null,null,"Trein. Finalizado",null,null,null,"Trein. Finalizado"]
[]
[]
[null,null,null,null,null,"Trein. Finalizado",null,"Trein. Finalizado",null,null,null,"Trein. Finalizado",null,null,null,"Trein. Finalizado"]
[]
[]
[null,null,null,null,null,"Em Treinamento",null,"Em Treinamento",null,null,null,"Em Treinamento",null,null,null,"Em Treinamento"]
[]
[]
[null,null,null,null,null,"Trein. Finalizado",null,"Trein. Finalizado",null,null,null,"Trein. Finalizado",null,null,null,"Trein. Finalizado"]

{"sheet":"Teor A.","index":16,"n_rows":46,"n_cols":48,"rows_kept":46,"cut":false,"hidden":false,"merged":[[51,11,51,12],[54,11,54,12],[57,11,57,12],[60,11,60,12],[0,2,3,15],[48,11,48,12],[12,11,12,12],[15,11,15,12],[18,11,18,12],[21,11,21,12],[24,11,24,12],[27,11,27,12],[30,11,30,12],[33,11,33,12],[36,11,36,12],[39,11,39,12],[42,11,42,12],[45,11,45,12],[60,5,60,6],[60,7,60,8],[60,9,60,10],[48,5,48,6],[48,7,48,8],[48,9,48,10],[57,5,57,6],[57,7,57,8],[57,9,57,10],[51,5,51,6],[51,7,51,8],[51,9,51,10],[54,5,54,6],[54,7,54,8],[54,9,54,10],[45,5,45,6],[45,7,45,8],[45,9,45,10],[33,5,33,6],[33,7,33,8],[33,9,33,10],[36,5,36,6],[36,7,36,8],[36,9,36,10],[39,5,39,6],[39,7,39,8],[39,9,39,10],[42,5,42,6],[42,7,42,8],[42,9,42,10],[27,5,27,6],[27,7,27,8],[27,9,27,10],[30,5,30,6],[30,7,30,8],[30,9,30,10],[21,5,21,6],[21,7,21,8],[21,9,21,10],[24,5,24,6],[24,7,24,8],[24,9,24,10],[15,5,15,6],[15,7,15,8],[15,9,15,10],[18,5,18,6],[18,7,18,8],[18,9,18,10],[0,0,3,0],[12,5,12,6],[12,7,12,8],[12,9,12,10]]}
[null,null," MATRIZ DE VERSATILIDADE - F 140  R01         "]
[]
[]
[]
[]
[]
[]
[]
[]
[]
[]
[]
[null,null,null,null,null,"Trein. Finalizado",null,"Trein. Finalizado",null,"Trein. Finalizado"]
[]
[]
[null,null,null,null,null,"Trein. Finalizado",null,"Em Treinamento",null,"Trein. Finalizado"]
[]
[]
[null,null,null,null,null,"Trein. Finalizado",null,"Trein. Finalizado",null,"Trein. Finalizado"]
[]
[]
[null,null,null,null,null,"Trein. Finalizado",null,"Trein. Finalizado",null,"Trein. Finalizado"]
[]
[]
[null,null,null,null,null,"Trein. Finalizado",null,"Trein. Finalizado",null,"Em Treinamento"]
[null,null,null,null,null,null,null,null,null,null,null,null,null,null,null,null,null,null,null,null,null,null,null,null,null,null,null,null,null,null,null,null,null,null,null,null,null,null,null,null,null,null,null,null,null,null,null,{"$f":"IF('Teor A.'!F34<>\"Trein. Finalizado\",\"Em Treinamento\",IF('Teor A.'!#REF!<>\"Trein. Finalizado\",\"Em Treinamento\",IF('Teor A.'!H34<>\"Trein. Finalizado\",\"Em Treinamento\",IF(Titulação!S34<>\"Trein. Finalizado\",\"Em Treinamento\",\"Treinamento Finalizado\"))))","v":{"$error":"#REF!"}}]
[]
[null,null,null,null,null,"Trein. Finalizado",null,null,null,"Trein. Finalizado"]
[]
[]
[null,null,null,null,null,"Trein. Finalizado",null,null,null,"Trein. Finalizado"]
[]
[]
[null,null,null,null,null,"Trein. Finalizado",null,null,null,"Trein. Finalizado"]
[]
[]
[null,null,null,null,null,"Trein. Finalizado",null,null,null,"Trein. Finalizado"]
[]
[]
[null,null,null,null,null,"Trein. Finalizado",null,null,null,"Trein. Finalizado"]
[]
[]
[null,null,null,null,null,"Em Treinamento",null,null,null,"Em Treinamento"]
[]
[]
[null,null,null,null,null,"Trein. Finalizado",null,null,null,"Trein. Finalizado"]

{"sheet":"Perfil","index":17,"n_rows":46,"n_cols":14,"rows_kept":46,"cut":false,"hidden":false,"merged":[[60,15,60,16],[0,2,3,20],[45,15,45,16],[48,15,48,16],[51,15,51,16],[54,15,54,16],[57,15,57,16],[30,15,30,16],[33,15,33,16],[36,15,36,16],[39,15,39,16],[42,15,42,16],[15,15,15,16],[18,15,18,16],[21,15,21,16],[24,15,24,16],[27,15,27,16],[60,5,60,6],[60,7,60,8],[60,9,60,10],[60,11,60,12],[60,13,60,14],[57,5,57,6],[57,7,57,8],[57,9,57,10],[57,11,57,12],[57,13,57,14],[54,5,54,6],[54,7,54,8],[54,9,54,10],[54,11,54,12],[54,13,54,14],[51,5,51,6],[51,7,51,8],[51,9,51,10],[51,11,51,12],[51,13,51,14],[48,5,48,6],[48,7,48,8],[48,9,48,10],[48,11,48,12],[48,13,48,14],[45,5,45,6],[45,7,45,8],[45,9,45,10],[45,11,45,12],[45,13,45,14],[42,5,42,6],[42,7,42,8],[42,9,42,10],[42,11,42,12],[42,13,42,14],[39,5,39,6],[39,7,39,8],[39,9,39,10],[39,11,39,12],[39,13,39,14],[36,5,36,6],[36,7,36,8],[36,9,36,10],[36,11,36,12],[36,13,36,14],[33,5,33,6],[33,7,33,8],[33,9,33,10],[33,11,33,12],[33,13,33,14],[30,5,30,6],[30,7,30,8],[30,9,30,10],[30,11,30,12],[30,13,30,14],[27,5,27,6],[27,7,27,8],[27,9,27,10],[27,11,27,12],[27,13,27,14],[24,5,24,6],[24,7,24,8],[24,9,24,10],[24,11,24,12],[24,13,24,14],[21,5,21,6],[21,7,21,8],[21,9,21,10],[21,11,21,12],[21,13,21,14],[18,5,18,6],[18,7,18,8],[18,9,18,10],[18,11,18,12],[18,13,18,14],[15,5,15,6],[15,7,15,8],[15,9,15,10],[15,11,15,12],[15,13,15,14],[0,0,3,0],[12,5,12,6],[12,7,12,8],[12,9,12,10],[12,11,12,12],[12,13,12,14],[12,15,12,16]]}
[null,null,"                                  MATRIZ DE VERSATILIDADE - F 140  R01                                                                                                    "]
[]
[]
[]
[]
[]
[]
[]
[]
[]
[]
[]
[null,null,null,null,null,"Trein. Finalizado",null,"Trein. Finalizado",null,"Trein. Finalizado",null,"Trein. Finalizado",null,"Trein. Finalizado"]
[]
[]
[null,null,null,null,null,"Trein. Finalizado",null,"Trein. Finalizado",null,"Em Treinamento",null,"Trein. Finalizado",null,"Em Treinamento"]
[]
[]
[null,null,null,null,null,"Trein. Finalizado",null,"Trein. Finalizado",null,"Trein. Finalizado",null,"Trein. Finalizado",null,"Trein. Finalizado"]
[]
[]
[null,null,null,null,null,"Trein. Finalizado",null,"Em Treinamento",null,"Trein. Finalizado",null,"Trein. Finalizado",null,"Trein. Finalizado"]
[]
[]
[null,null,null,null,null,"Trein. Finalizado",null,"Trein. Finalizado",null,"Trein. Finalizado",null,"Trein. Finalizado",null,"Trein. Finalizado"]
[]
[]
[null,null,null,null,null,"Trein. Finalizado",null,"Trein. Finalizado",null,null,null,"Trein. Finalizado"]
[]
[]
[null,null,null,null,null,"Trein. Finalizado",null,"Trein. Finalizado",null,null,null,"Trein. Finalizado"]
[]
[]
[null,null,null,null,null,"Trein. Finalizado",null,"Trein. Finalizado",null,null,null,"Trein. Finalizado"]
[]
[]
[null,null,null,null,null,"Trein. Finalizado",null,"Trein. Finalizado",null,null,null,"Trein. Finalizado"]
[]
[]
[null,null,null,null,null,"Trein. Finalizado",null,"Trein. Finalizado",null,null,null,"Trein. Finalizado"]
[]
[]
[null,null,null,null,null,"Em Treinamento",null,"Em Treinamento",null,null,null,"Em Treinamento"]
[]
[]
[null,null,null,null,null,"Trein. Finalizado",null,"Trein. Finalizado",null,null,null,"Trein. Finalizado"]

{"sheet":"Perda S.","index":18,"n_rows":1,"n_cols":3,"rows_kept":1,"cut":false,"hidden":false,"merged":[[51,15,51,16],[54,15,54,16],[57,15,57,16],[60,15,60,16],[0,2,3,20],[48,15,48,16],[12,15,12,16],[15,15,15,16],[18,15,18,16],[21,15,21,16],[24,15,24,16],[27,15,27,16],[30,15,30,16],[33,15,33,16],[36,15,36,16],[39,15,39,16],[42,15,42,16],[45,15,45,16],[15,5,15,6],[15,7,15,8],[15,9,15,10],[15,11,15,12],[15,13,15,14],[12,5,12,6],[12,7,12,8],[12,9,12,10],[12,11,12,12],[12,13,12,14],[21,5,21,6],[21,7,21,8],[21,9,21,10],[21,11,21,12],[21,13,21,14],[18,5,18,6],[18,7,18,8],[18,9,18,10],[18,11,18,12],[18,13,18,14],[27,5,27,6],[27,7,27,8],[27,9,27,10],[27,11,27,12],[27,13,27,14],[24,5,24,6],[24,7,24,8],[24,9,24,10],[24,11,24,12],[24,13,24,14],[30,11,30,12],[30,13,30,14],[33,5,33,6],[33,7,33,8],[33,9,33,10],[33,11,33,12],[33,13,33,14],[36,13,36,14],[39,5,39,6],[39,7,39,8],[39,9,39,10],[39,11,39,12],[39,13,39,14],[42,13,42,14],[45,5,45,6],[45,7,45,8],[45,9,45,10],[45,11,45,12],[45,13,45,14],[51,13,51,14],[57,5,57,6],[57,7,57,8],[57,9,57,10],[57,11,57,12],[57,13,57,14],[60,13,60,14],[54,5,54,6],[54,7,54,8],[54,9,54,10],[54,11,54,12],[54,13,54,14],[48,5,48,6],[48,7,48,8],[48,9,48,10],[48,11,48,12],[48,13,48,14],[51,5,51,6],[51,7,51,8],[51,9,51,10],[51,11,51,12],[0,0,3,0],[60,5,60,6],[60,7,60,8],[60,9,60,10],[60,11,60,12],[42,5,42,6],[42,7,42,8],[42,9,42,10],[42,11,42,12],[36,5,36,6],[36,7,36,8],[36,9,36,10],[36,11,36,12],[30,5,30,6],[30,7,30,8],[30,9,30,10]]}
[null,null," MATRIZ DE VERSATILIDADE - F 140  R01         "]

{"sheet":"GQ-Descrição de Pop´s ","index":19,"n_rows":19,"n_cols":5,"rows_kept":19,"cut":false,"hidden":false,"merged":[[36,4,36,14],[37,4,37,14],[38,4,38,14],[39,4,39,14],[0,2,4,17],[30,4,30,14],[31,4,31,14],[32,4,32,14],[33,4,33,14],[34,4,34,14],[35,4,35,14],[24,4,24,14],[25,4,25,14],[26,4,26,14],[27,4,27,14],[28,4,28,14],[29,4,29,14],[18,4,18,14],[19,4,19,14],[20,4,20,14],[21,4,21,14],[22,4,22,14],[23,4,23,14],[14,4,14,14],[15,4,15,14],[16,4,16,14],[17,4,17,14],[0,0,4,0],[6,3,11,12],[6,17,11,17],[13,4,13,14]]}
[null,null," MATRIZ DE VERSATILIDADE - F 140  R01         "]
[]
[]
[]
[]
[]
[null,null,null,"                   Pop´s Técnicos "]
[]
[]
[]
[]
[]
[]
[null,null,null,"POP TEC - 073","Identificação, Recebimento e Armazenamento de Amostras"]
[null,null,null,"POP TEC - 075","Armazenamento de Documentos"]
[null,null,null,"POP TEC - 081","Armazenamento, Manuseio e Descarte"]
[null,null,null,"POP TEC - 083","Elaboração de Certificados"]
[null,null,null,"POP TEC - 130","Coletas de Amostras"]
[null,null,null,"POP TEC - 133","Coleta de Amostras Veterinária"]

{"sheet":"GQ-Trein.Autorizados ","index":20,"n_rows":54,"n_cols":22,"rows_kept":54,"cut":false,"hidden":false,"merged":[[11,12,12,13],[15,9,15,10],[15,12,15,13],[0,3,4,25],[65,9,65,10],[65,12,65,13],[64,9,64,10],[64,12,64,13],[62,9,63,10],[62,12,63,13],[59,9,59,10],[59,12,59,13],[58,9,58,10],[58,12,58,13],[56,9,57,10],[56,12,57,13],[53,9,53,10],[53,12,53,13],[52,9,52,10],[52,12,52,13],[50,9,51,10],[50,12,51,13],[14,15,14,16],[14,18,14,19],[14,21,14,22],[20,15,20,16],[13,21,13,22],[11,21,12,22],[27,9,27,10],[27,12,27,13],[26,9,26,10],[26,12,26,13],[27,15,27,16],[27,18,27,19],[27,21,27,22],[24,9,25,10],[24,12,25,13],[26,15,26,16],[26,18,26,19],[26,21,26,22],[20,21,20,22],[20,18,20,19],[24,18,25,19],[24,21,25,22],[19,21,19,22],[19,18,19,19],[24,15,25,16],[17,21,18,22],[17,18,18,19],[20,9,20,10],[20,12,20,13],[19,9,19,10],[19,12,19,13],[17,15,18,16],[17,9,18,10],[17,12,18,13],[15,18,15,19],[15,21,15,22],[14,9,14,10],[14,12,14,13],[15,15,15,16],[11,18,12,19],[13,9,13,10],[13,12,13,13],[11,15,12,16],[0,0,4,0],[11,9,12,10]]}
[null,null,null,"                                                                    MATRIZ DE VERSATILIDADE - F 140  R01                                                                                          "]
[]
[]
[]
[]
[]
[]
[]
[]
[]
[]
[null,null,null,null,null,null,null,null,null,{"$f":"IF(COUNTIF('GQ-Trein.Pops'!F13:Q13,\"Trein. Finalizado\")=6,\"Treinamento Finalizado\",IF(COUNTBLANK('GQ-Trein.Pops'!F13:Q13)=12,\"* * * * *\",\"Em Treinamento\"))","v":"* * * * *"},null,null,{"$f":"IF(COUNTIF('GQ-Trein.Pops'!F16:Q16,\"Trein. Finalizado\")=6,\"Treinamento Finalizado\",IF(COUNTBLANK('GQ-Trein.Pops'!F16:Q16)=12,\"* * * * *\",\"Em Treinamento\"))","v":"* * * * *"},null,null,{"$f":"IF(COUNTIF('GQ-Trein.Pops'!F19:Q19,\"Trein. Finalizado\")=6,\"Treinamento Finalizado\",IF(COUNTBLANK('GQ-Trein.Pops'!F19:Q19)=12,\"* * * * *\",\"Em Treinamento\"))","v":"* * * * *"},null,null,{"$f":"IF(COUNTIF('GQ-Trein.Pops'!F22:Q22,\"Trein. Finalizado\")=6,\"Treinamento Finalizado\",IF(COUNTBLANK('GQ-Trein.Pops'!F22:Q22)=12,\"* * * * *\",\"Em Treinamento\"))","v":"* * * * *"},null,null,{"$f":"IF(COUNTIF('GQ-Trein.Pops'!F25:Q25,\"Trein. Finalizado\")=6,\"Treinamento Finalizado\",IF(COUNTBLANK('GQ-Trein.Pops'!F25:Q25)=12,\"* * * * *\",\"Em Treinamento\"))","v":"* * * * *"}]
[]
[]
[]
[]
[]
[null,null,null,null,null,null,null,null,null,{"$f":"IF(COUNTIF('GQ-Trein.Pops'!F28:Q28,\"Trein. Finalizado\")=6,\"Treinamento Finalizado\",IF(COUNTBLANK('GQ-Trein.Pops'!F28:Q28)=12,\"* * * * *\",\"Em Treinamento\"))","v":"* * * * *"},null,null,{"$f":"IF(COUNTIF('GQ-Trein.Pops'!F31:Q31,\"Trein. Finalizado\")=6,\"Treinamento Finalizado\",IF(COUNTBLANK('GQ-Trein.Pops'!F31:Q31)=12,\"* * * * *\",\"Em Treinamento\"))","v":"* * * * *"},null,null,{"$f":"IF(COUNTIF('GQ-Trein.Pops'!F34:Q34,\"Trein. Finalizado\")=6,\"Treinamento Finalizado\",IF(COUNTBLANK('GQ-Trein.Pops'!F34:Q34)=12,\"* * * * *\",\"Em Treinamento\"))","v":"* * * * *"},null,null,{"$f":"IF(COUNTIF('GQ-Trein.Pops'!F37:Q37,\"Trein. Finalizado\")=6,\"Treinamento Finalizado\",IF(COUNTBLANK('GQ-Trein.Pops'!F37:Q37)=12,\"* * * * *\",\"Em Treinamento\"))","v":"* * * * *"},null,null,{"$f":"IF(COUNTIF('GQ-Trein.Pops'!F40:Q40,\"Trein. Finalizado\")=6,\"Treinamento Finalizado\",IF(COUNTBLANK('GQ-Trein.Pops'!F40:Q40)=12,\"* * * * *\",\"Em Treinamento\"))","v":"* * * * *"}]
[]
[]
[]
[]
[]
[]
[null,null,null,null,null,null,null,null,null,{"$f":"IF(COUNTIF('GQ-Trein.Pops'!F43:Q43,\"Trein. Finalizado\")=6,\"Treinamento Finalizado\",IF(COUNTBLANK('GQ-Trein.Pops'!F43:Q43)=12,\"* * * * *\",\"Em Treinamento\"))","v":"* * * * *"},null,null,{"$f":"IF(COUNTIF('GQ-Trein.Pops'!F46:Q46,\"Trein. Finalizado\")=6,\"Treinamento Finalizado\",IF(COUNTBLANK('GQ-Trein.Pops'!F46:Q46)=12,\"* * * * *\",\"Em Treinamento\"))","v":"* * * * *"},null,null,{"$f":"IF(COUNTIF('GQ-Trein.Pops'!F49:Q49,\"Trein. Finalizado\")=6,\"Treinamento Finalizado\",IF(COUNTBLANK('GQ-Trein.Pops'!F49:Q49)=12,\"* * * * *\",\"Em Treinamento\"))","v":"* * * * *"},null,null,{"$f":"IF(COUNTIF('GQ-Trein.Pops'!F52:Q52,\"Trein. Finalizado\")=6,\"Treinamento Finalizado\",IF(COUNTBLANK('GQ-Trein.Pops'!F52:Q52)=12,\"* * * * *\",\"Em Treinamento\"))","v":"* * * * *"},null,null,{"$f":"IF(COUNTIF('GQ-Trein.Pops'!F55:Q55,\"Trein. Finalizado\")=6,\"Treinamento Finalizado\",IF(COUNTBLANK('GQ-Trein.Pops'!F55:Q55)=12,\"* * * * *\",\"Em Treinamento\"))","v":"* * * * *"}]
[]
[]
[]
[]
[]
[]
[]
[]
[]
[]
[]
[]
[]
[]
[]
[]
[]
[]
[]
[]
[]
[]
[]
[]
[]
[null,null,null,null,null,null,null,null,null,{"$f":"IF(COUNTIF(Geral!F49:AM49,\"Trein. Finalizado\")=17,\"Treinamento Finalizado\",IF(COUNTBLANK(Geral!F49:AM49)=34,\"* * * * *\",\"Em Treinamento\"))","v":"Em Treinamento"},null,null,{"$f":"IF(COUNTIF(Geral!F52:AM52,\"Trein. Finalizado\")=17,\"Treinamento Finalizado\",IF(COUNTBLANK(Geral!F52:AM52)=34,\"* * * * *\",\"Em Treinamento\"))","v":"Em Treinamento"}]
[]
[]
[null,null,null,null,null,null,null,null,null,{"$f":"Geral!AN49","v":0},null,null,{"$f":"Geral!AN52","v":0}]

{"sheet":"GQ-Trein.Pops","index":21,"n_rows":16,"n_cols":18,"rows_kept":16,"cut":false,"hidden":false,"merged":[[57,17,57,18],[60,5,60,6],[60,7,60,8],[60,9,60,10],[60,11,60,12],[60,13,60,14],[60,15,60,16],[60,17,60,18],[57,5,57,6],[57,7,57,8],[57,9,57,10],[57,11,57,12],[57,13,57,14],[57,15,57,16],[51,17,51,18],[54,5,54,6],[54,7,54,8],[54,9,54,10],[54,11,54,12],[54,13,54,14],[54,15,54,16],[54,17,54,18],[51,5,51,6],[51,7,51,8],[51,9,51,10],[51,11,51,12],[51,13,51,14],[51,15,51,16],[45,17,45,18],[48,5,48,6],[48,7,48,8],[48,9,48,10],[48,11,48,12],[48,13,48,14],[48,15,48,16],[48,17,48,18],[45,5,45,6],[45,7,45,8],[45,9,45,10],[45,11,45,12],[45,13,45,14],[45,15,45,16],[39,17,39,18],[42,5,42,6],[42,7,42,8],[42,9,42,10],[42,11,42,12],[42,13,42,14],[42,15,42,16],[42,17,42,18],[39,5,39,6],[39,7,39,8],[39,9,39,10],[39,11,39,12],[39,13,39,14],[39,15,39,16],[33,17,33,18],[36,5,36,6],[36,7,36,8],[36,9,36,10],[36,11,36,12],[36,13,36,14],[36,15,36,16],[36,17,36,18],[33,5,33,6],[33,7,33,8],[33,9,33,10],[33,11,33,12],[33,13,33,14],[33,15,33,16],[27,17,27,18],[30,5,30,6],[30,7,30,8],[30,9,30,10],[30,11,30,12],[30,13,30,14],[30,15,30,16],[30,17,30,18],[27,5,27,6],[27,7,27,8],[27,9,27,10],[27,11,27,12],[27,13,27,14],[27,15,27,16],[21,17,21,18],[24,5,24,6],[24,7,24,8],[24,9,24,10],[24,11,24,12],[24,13,24,14],[24,15,24,16],[24,17,24,18],[21,5,21,6],[21,7,21,8],[21,9,21,10],[21,11,21,12],[21,13,21,14],[21,15,21,16],[15,17,15,18],[18,5,18,6],[18,7,18,8],[18,9,18,10],[18,11,18,12],[18,13,18,14],[18,15,18,16],[18,17,18,18],[15,5,15,6],[15,7,15,8],[15,9,15,10],[15,11,15,12],[15,13,15,14],[15,15,15,16],[0,0,3,0],[12,5,12,6],[12,7,12,8],[12,9,12,10],[12,11,12,12],[12,13,12,14],[12,15,12,16],[12,17,12,18],[0,2,3,21]]}
[null,null,"                      MATRIZ DE VERSATILIDADE - F 140  R01         "]
[]
[]
[]
[]
[]
[]
[]
[]
[]
[]
[]
[null,null,null,null,null,null,null,null,null,null,null,null,null,null,null,null,null,"Autorizado(a)"]
[]
[]
[null,null,null,null,null,null,null,null,null,null,null,null,null,null,null,null,null,"Autorizado(a)"]