{"text_format":"1","workbook":"xlsx","n_sheets":5,"sheets":["Empresas","UF","Dados","Planilha (A)","Planilha (B)"],"not_rendered":{"charts":2,"images":0,"macros":1,"external_links":0,"defined_names":31,"comments":0,"pivot_tables":0},"unopened":[],"bounds":{"document_bytes":16777216,"sheet_cells":100000,"rows_first":2000,"rows_last":500,"rows_between":2000,"halvings":0,"cell_chars":16384,"cell_head_chars":4096},"cells_cut":0,"cells_raw":0,"read":"whole","date_system":"1900"}

{"sheet":"Empresas","index":0,"n_rows":47,"n_cols":45,"rows_kept":47,"cut":false,"hidden":false,"merged":[[2,18,2,19],[2,24,2,25],[2,20,2,23],[3,33,3,35],[1,1,2,3],[3,18,3,20],[3,21,3,23],[3,24,3,26],[3,9,3,11],[3,12,3,14],[3,15,3,17],[3,6,3,8],[3,36,3,38],[3,39,3,41],[3,42,3,44],[3,27,3,29],[3,30,3,32]]}
["  "]
[]
[]
[null,null,null,null,null,"JANEIRO",2017,null,null,"JANEIRO",null,null,"FEVEREIRO",null,null,"MARÇO",null,null,"ABRIL",null,null,"MAIO",null,null,"JUNHO",null,null,"JULHO",null,null,"AGOSTO",null,null,"SETEMBRO",null,null,"OUTUBRO",null,null,"NOVEMBRO",null,null,"DEZEMBRO"]
[null,"UF","Código","Sindicato","SIGLA",{"$f":"\"Comparativo \"&CHAR(10)&OFFSET(INDIRECT(F4,TRUE),,-3)&\" / \"&F4","v":"Comparativo \n2017 / JANEIRO"},"Serviços Demandados","Serviços Atendidos","% Atendimento","Serviços Demandados","Serviços Atendidos","% Atendimento","Serviços Demandados","Serviços Atendidos","% Atendimento","Serviços Demandados","Serviços Atendidos","% Atendimento","Serviços Demandados","Serviços Atendidos","% Atendimento","Serviços Demandados","Serviços Atendidos","% Atendimento","Serviços Demandados","Serviços Atendidos","% Atendimento","Serviços Demandados","Serviços Atendidos","% Atendimento","Serviços Demandados","Serviços Atendidos","% Atendimento","Serviços Demandados","Serviços Atendidos","% Atendimento","Serviços Demandados","Serviços Atendidos","% Atendimento","Serviços Demandados","Serviços Atendidos","% Atendimento","Serviços Demandados","Serviços Atendidos","% Atendimento"]
[null,"AM",1,"EMPRESA 1","EMP1",{"$f":"IF(OFFSET(INDIRECT($F$4,TRUE),ROW(D6)-4,2)>OFFSET(INDIRECT($F$4),ROW(D6)-4,-1),1,IF(OFFSET(INDIRECT($F$4,TRUE),ROW(D6)-4,2)=OFFSET(INDIRECT($F$4),ROW(D6)-4,-1),2,3))","v":2},10,5,{"$f":"IFERROR(H6/G6,\"\")","v":0.5},10,5,{"$f":"IFERROR(K6/J6,\"\")","v":0.5},{"$f":"\"\"","v":""},{"$f":"\"\"","v":""},{"$f":"IFERROR(N6/M6,\"\")","v":""},{"$f":"\"\"","v":""},{"$f":"\"\"","v":""},{"$f":"IFERROR(Q6/P6,\"\")","v":""},{"$f":"\"\"","v":""},{"$f":"\"\"","v":""},{"$f":"IFERROR(T6/S6,\"\")","v":""},{"$f":"\"\"","v":""},{"$f":"\"\"","v":""},{"$f":"IFERROR(W6/V6,\"\")","v":""},{"$f":"\"\"","v":""},{"$f":"\"\"","v":""},{"$f":"IFERROR(Z6/Y6,\"\")","v":""},{"$f":"\"\"","v":""},{"$f":"\"\"","v":""},{"$f":"IFERROR(AC6/AB6,\"\")","v":""},{"$f":"\"\"","v":""},{"$f":"\"\"","v":""},{"$f":"IFERROR(AF6/AE6,\"\")","v":""},{"$f":"\"\"","v":""},{"$f":"\"\"","v":""},{"$f":"IFERROR(AI6/AH6,\"\")","v":""},{"$f":"\"\"","v":""},{"$f":"\"\"","v":""},{"$f":"IFERROR(AL6/AK6,\"\")","v":""},{"$f":"\"\"","v":""},{"$f":"\"\"","v":""},{"$f":"IFERROR(AO6/AN6,\"\")","v":""},{"$f":"\"\"","v":""},{"$f":"\"\"","v":""},{"$f":"IFERROR(AR6/AQ6,\"\")","v":""}]
{"$rows_left_out":42}
{"sheet":"UF","index":1,"n_rows":12,"n_cols":43,"rows_kept":12,"cut":false,"hidden":false,"merged":[[1,7,1,9],[1,10,1,12],[1,13,1,15],[13,0,13,2],[0,1,1,2],[1,4,1,6],[1,16,1,18],[1,19,1,21],[1,40,1,42],[1,37,1,39],[1,34,1,36],[1,31,1,33],[1,28,1,30],[1,25,1,27],[1,22,1,24]]}
[null,{"$f":"VLOOKUP(Dados!$E$2,Dados!$B$33:$C$68,2,FALSE)","v":"JANEIRO"}]
[null,null,null,null,2017,null,null,"JANEIRO",null,null,"FEVEREIRO",null,null,"MARÇO",null,null,"ABRIL",null,null,"MAIO",null,null,"JUNHO",null,null,"JULHO",null,null,"AGOSTO",null,null,"SETEMBRO",null,null,"OUTUBRO",null,null,"NOVEMBRO",null,null,"DEZEMBRO"]
[null,"UF","Qtd. De Empresas",null,"Serviços Demandados","Serviços Atendidos","% Atendimento","Serviços Demandados","Serviços Atendidos","% Atendimento","Serviços Demandados","Serviços Atendidos","% Atendimento","Serviços Demandados","Serviços Atendidos","% Atendimento","Serviços Demandados","Serviços Atendidos","% Atendimento","Serviços Demandados","Serviços Atendidos","% Atendimento","Serviços Demandados","Serviços Atendidos","% Atendimento","Serviços Demandados","Serviços Atendidos","% Atendimento","Serviços Demandados","Serviços Atendidos","% Atendimento","Serviços Demandados","Serviços Atendidos","% Atendimento","Serviços Demandados","Serviços Atendidos","% Atendimento","Serviços Demandados","Serviços Atendidos","% Atendimento","Serviços Demandados","Serviços Atendidos","% Atendimento"]
[{"$f":"IFERROR(IF(OR(Dados!$D5=\"\",Dados!$E5=\"\"),\"\",IF(Dados!$E5>Dados!$D5,3,IF(Dados!$E5=Dados!$D5,2,1))),\"\")","v":""},"AM",{"$f":"COUNTIF(Empresas!$B$5:$B$47,UF!$B4)","v":3},{"$f":"\"\"","v":""},{"$f":"IF(Empresas!G6=\"\",\"\",SUMIF(Empresas!$B$6:$B$50,UF!$B4,Empresas!G$6:G$46))","v":20},{"$f":"IF(Empresas!H6=\"\",\"\",SUMIF(Empresas!$B$6:$B$46,UF!$B4,Empresas!H$6:H$46))","v":8},{"$f":"IFERROR(F4/E4,\"\")","v":0.4},{"$f":"IF(Empresas!J6=\"\",\"\",SUMIF(Empresas!$B$6:$B$50,UF!$B4,Empresas!J$6:J$46))","v":20},{"$f":"IF(Empresas!K6=\"\",\"\",SUMIF(Empresas!$B$6:$B$46,UF!$B4,Empresas!K$6:K$46))","v":10},{"$f":"IFERROR(I4/H4,\"\")","v":0.5},{"$f":"IF(Empresas!M6=\"\",\"\",SUMIF(Empresas!$B$6:$B$46,UF!$B4,Empresas!M$6:M$46))","v":""},{"$f":"IF(Empresas!N6=\"\",\"\",SUMIF(Empresas!$B$6:$B$46,UF!$B4,Empresas!N$6:N$46))","v":""},{"$f":"IFERROR(L4/K4,\"\")","v":""},{"$f":"IF(Empresas!P6=\"\",\"\",SUMIF(Empresas!$B$6:$B$46,UF!$B4,Empresas!P$6:P$46))","v":""},{"$f":"IF(Empresas!Q6=\"\",\"\",SUMIF(Empresas!$B$6:$B$46,UF!$B4,Empresas!Q$6:Q$46))","v":""},{"$f":"IFERROR(O4/N4,\"\")","v":""},{"$f":"IF(Empresas!S6=\"\",\"\",SUMIF(Empresas!$B$6:$B$46,UF!$B4,Empresas!S$6:S$46))","v":""},{"$f":"IF(Empresas!T6=\"\",\"\",SUMIF(Empresas!$B$6:$B$46,UF!$B4,Empresas!T$6:T$46))","v":""},{"$f":"IFERROR(R4/Q4,\"\")","v":""},{"$f":"IF(Empresas!V6=\"\",\"\",SUMIF(Empresas!$B$6:$B$46,UF!$B4,Empresas!V$6:V$46))","v":""},{"$f":"IF(Empresas!W6=\"\",\"\",SUMIF(Empresas!$B$6:$B$46,UF!$B4,Empresas!W$6:W$46))","v":""},{"$f":"IFERROR(U4/T4,\"\")","v":""},{"$f":"IF(Empresas!Y6=\"\",\"\",SUMIF(Empresas!$B$6:$B$46,UF!$B4,Empresas!Y$6:Y$46))","v":""},{"$f":"IF(Empresas!Z6=\"\",\"\",SUMIF(Empresas!$B$6:$B$46,UF!$B4,Empresas!Z$6:Z$46))","v":""},{"$f":"IFERROR(X4/W4,\"\")","v":""},{"$f":"IF(Empresas!AB6=\"\",\"\",SUMIF(Empresas!$B$6:$B$46,UF!$B4,Empresas!AB$6:AB$46))","v":""},{"$f":"IF(Empresas!AC6=\"\",\"\",SUMIF(Empresas!$B$6:$B$46,UF!$B4,Empresas!AC$6:AC$46))","v":""},{"$f":"IFERROR(AA4/Z4,\"\")","v":""},{"$f":"IF(Empresas!AE6=\"\",\"\",SUMIF(Empresas!$B$6:$B$46,UF!$B4,Empresas!AE$6:AE$46))","v":""},{"$f":"IF(Empresas!AF6=\"\",\"\",SUMIF(Empresas!$B$6:$B$46,UF!$B4,Empresas!AF$6:AF$46))","v":""},{"$f":"IFERROR(AD4/AC4,\"\")","v":""},{"$f":"IF(Empresas!AH6=\"\",\"\",SUMIF(Empresas!$B$6:$B$46,UF!$B4,Empresas!AH$6:AH$46))","v":""},{"$f":"IF(Empresas!AI6=\"\",\"\",SUMIF(Empresas!$B$6:$B$46,UF!$B4,Empresas!AI$6:AI$46))","v":""},{"$f":"IFERROR(AG4/AF4,\"\")","v":""},{"$f":"IF(Empresas!AK6=\"\",\"\",SUMIF(Empresas!$B$6:$B$46,UF!$B4,Empresas!AK$6:AK$46))","v":""},{"$f":"IF(Empresas!AL6=\"\",\"\",SUMIF(Empresas!$B$6:$B$46,UF!$B4,Empresas!AL$6:AL$46))","v":""},{"$f":"IFERROR(AJ4/AI4,\"\")","v":""},{"$f":"IF(Empresas!AN6=\"\",\"\",SUMIF(Empresas!$B$6:$B$46,UF!$B4,Empresas!AN$6:AN$46))","v":""},{"$f":"IF(Empresas!AO6=\"\",\"\",SUMIF(Empresas!$B$6:$B$46,UF!$B4,Empresas!AO$6:AO$46))","v":""},{"$f":"IFERROR(AM4/AL4,\"\")","v":""},{"$f":"IF(Empresas!AQ6=\"\",\"\",SUMIF(Empresas!$B$6:$B$46,UF!$B4,Empresas!AQ$6:AQ$46))","v":""},{"$f":"IF(Empresas!AR6=\"\",\"\",SUMIF(Empresas!$B$6:$B$46,UF!$B4,Empresas!AR$6:AR$46))","v":""},{"$f":"IFERROR(AP4/AO4,\"\")","v":""}]
[{"$f":"IFERROR(IF(OR(Dados!$D6=\"\",Dados!$E6=\"\"),\"\",IF(Dados!$E6>Dados!$D6,3,IF(Dados!$E6=Dados!$D6,2,1))),\"\")","v":""},"BA",{"$f":"COUNTIF(Empresas!$B$5:$B$47,UF!$B5)","v":5},{"$f":"\"\"","v":""},{"$f":"IF(Empresas!G7=\"\",\"\",SUMIF(Empresas!$B$6:$B$50,UF!$B5,Empresas!G$6:G$46))","v":401},{"$f":"IF(Empresas!H7=\"\",\"\",SUMIF(Empresas!$B$6:$B$46,UF!$B5,Empresas!H$6:H$46))","v":178},{"$f":"IFERROR(F5/E5,\"\")","v":0.44389027431421446},{"$f":"IF(Empresas!J7=\"\",\"\",SUMIF(Empresas!$B$6:$B$50,UF!$B5,Empresas!J$6:J$46))","v":401},{"$f":"IF(Empresas!K7=\"\",\"\",SUMIF(Empresas!$B$6:$B$46,UF!$B5,Empresas!K$6:K$46))","v":170},{"$f":"IFERROR(I5/H5,\"\")","v":0.42394014962593518},{"$f":"IF(Empresas!M7=\"\",\"\",SUMIF(Empresas!$B$6:$B$46,UF!$B5,Empresas!M$6:M$46))","v":""},{"$f":"IF(Empresas!N7=\"\",\"\",SUMIF(Empresas!$B$6:$B$46,UF!$B5,Empresas!N$6:N$46))","v":""},{"$f":"IFERROR(L5/K5,\"\")","v":""},{"$f":"IF(Empresas!P7=\"\",\"\",SUMIF(Empresas!$B$6:$B$46,UF!$B5,Empresas!P$6:P$46))","v":""},{"$f":"IF(Empresas!Q7=\"\",\"\",SUMIF(Empresas!$B$6:$B$46,UF!$B5,Empresas!Q$6:Q$46))","v":""},{"$f":"IFERROR(O5/N5,\"\")","v":""},{"$f":"IF(Empresas!S7=\"\",\"\",SUMIF(Empresas!$B$6:$B$46,UF!$B5,Empresas!S$6:S$46))","v":""},{"$f":"IF(Empresas!T7=\"\",\"\",SUMIF(Empresas!$B$6:$B$46,UF!$B5,Empresas!T$6:T$46))","v":""},"",{"$f":"IF(Empresas!V7=\"\",\"\",SUMIF(Empresas!$B$6:$B$46,UF!$B5,Empresas!V$6:V$46))","v":""},{"$f":"IF(Empresas!W7=\"\",\"\",SUMIF(Empresas!$B$6:$B$46,UF!$B5,Empresas!W$6:W$46))","v":""},"",{"$f":"IF(Empresas!Y7=\"\",\"\",SUMIF(Empresas!$B$6:$B$46,UF!$B5,Empresas!Y$6:Y$46))","v":""},{"$f":"IF(Empresas!Z7=\"\",\"\",SUMIF(Empresas!$B$6:$B$46,UF!$B5,Empresas!Z$6:Z$46))","v":""},"",{"$f":"IF(Empresas!AB7=\"\",\"\",SUMIF(Empresas!$B$6:$B$46,UF!$B5,Empresas!AB$6:AB$46))","v":""},{"$f":"IF(Empresas!AC7=\"\",\"\",SUMIF(Empresas!$B$6:$B$46,UF!$B5,Empresas!AC$6:AC$46))","v":""},"",{"$f":"IF(Empresas!AE7=\"\",\"\",SUMIF(Empresas!$B$6:$B$46,UF!$B5,Empresas!AE$6:AE$46))","v":""},{"$f":"IF(Empresas!AF7=\"\",\"\",SUMIF(Empresas!$B$6:$B$46,UF!$B5,Empresas!AF$6:AF$46))","v":""},"",{"$f":"IF(Empresas!AH7=\"\",\"\",SUMIF(Empresas!$B$6:$B$46,UF!$B5,Empresas!AH$6:AH$46))","v":""},{"$f":"IF(Empresas!AI7=\"\",\"\",SUMIF(Empresas!$B$6:$B$46,UF!$B5,Empresas!AI$6:AI$46))","v":""},"",{"$f":"IF(Empresas!AK7=\"\",\"\",SUMIF(Empresas!$B$6:$B$46,UF!$B5,Empresas!AK$6:AK$46))","v":""},{"$f":"IF(Empresas!AL7=\"\",\"\",SUMIF(Empresas!$B$6:$B$46,UF!$B5,Empresas!AL$6:AL$46))","v":""},"",{"$f":"IF(Empresas!AN7=\"\",\"\",SUMIF(Empresas!$B$6:$B$46,UF!$B5,Empresas!AN$6:AN$46))","v":""},{"$f":"IF(Empresas!AO7=\"\",\"\",SUMIF(Empresas!$B$6:$B$46,UF!$B5,Empresas!AO$6:AO$46))","v":""},"",{"$f":"IF(Empresas!AQ7=\"\",\"\",SUMIF(Empresas!$B$6:$B$46,UF!$B5,Empresas!AQ$6:AQ$46))","v":""},{"$f":"IF(Empresas!AR7=\"\",\"\",SUMIF(Empresas!$B$6:$B$46,UF!$B5,Empresas!AR$6:AR$46))","v":""},""]
[{"$f":"IFERROR(IF(OR(Dados!$D7=\"\",Dados!$E7=\"\"),\"\",IF(Dados!$E7>Dados!$D7,3,IF(Dados!$E7=Dados!$D7,2,1))),\"\")","v":""},"CE",{"$f":"COUNTIF(Empresas!$B$5:$B$47,UF!$B6)","v":4},{"$f":"\"\"","v":""},{"$f":"IF(Empresas!G8=\"\",\"\",SUMIF(Empresas!$B$6:$B$50,UF!$B6,Empresas!G$6:G$46))","v":1740},{"$f":"IF(Empresas!H8=\"\",\"\",SUMIF(Empresas!$B$6:$B$46,UF!$B6,Empresas!H$6:H$46))","v":328},0.18850574712643678,{"$f":"IF(Empresas!J8=\"\",\"\",SUMIF(Empresas!$B$6:$B$50,UF!$B6,Empresas!J$6:J$46))","v":1740},{"$f":"IF(Empresas!K8=\"\",\"\",SUMIF(Empresas!$B$6:$B$46,UF!$B6,Empresas!K$6:K$46))","v":352},0.20229885057471264,{"$f":"IF(Empresas!M8=\"\",\"\",SUMIF(Empresas!$B$6:$B$46,UF!$B6,Empresas!M$6:M$46))","v":""},{"$f":"IF(Empresas!N8=\"\",\"\",SUMIF(Empresas!$B$6:$B$46,UF!$B6,Empresas!N$6:N$46))","v":""},"",{"$f":"IF(Empresas!P8=\"\",\"\",SUMIF(Empresas!$B$6:$B$46,UF!$B6,Empresas!P$6:P$46))","v":""},{"$f":"IF(Empresas!Q8=\"\",\"\",SUMIF(Empresas!$B$6:$B$46,UF!$B6,Empresas!Q$6:Q$46))","v":""},"",{"$f":"IF(Empresas!S8=\"\",\"\",SUMIF(Empresas!$B$6:$B$46,UF!$B6,Empresas!S$6:S$46))","v":""},{"$f":"IF(Empresas!T8=\"\",\"\",SUMIF(Empresas!$B$6:$B$46,UF!$B6,Empresas!T$6:T$46))","v":""},"",{"$f":"IF(Empresas!V8=\"\",\"\",SUMIF(Empresas!$B$6:$B$46,UF!$B6,Empresas!V$6:V$46))","v":""},{"$f":"IF(Empresas!W8=\"\",\"\",SUMIF(Empresas!$B$6:$B$46,UF!$B6,Empresas!W$6:W$46))","v":""},"",{"$f":"IF(Empresas!Y8=\"\",\"\",SUMIF(Empresas!$B$6:$B$46,UF!$B6,Empresas!Y$6:Y$46))","v":""},{"$f":"IF(Empresas!Z8=\"\",\"\",SUMIF(Empresas!$B$6:$B$46,UF!$B6,Empresas!Z$6:Z$46))","v":""},"",{"$f":"IF(Empresas!AB8=\"\",\"\",SUMIF(Empresas!$B$6:$B$46,UF!$B6,Empresas!AB$6:AB$46))","v":""},{"$f":"IF(Empresas!AC8=\"\",\"\",SUMIF(Empresas!$B$6:$B$46,UF!$B6,Empresas!AC$6:AC$46))","v":""},"",{"$f":"IF(Empresas!AE8=\"\",\"\",SUMIF(Empresas!$B$6:$B$46,UF!$B6,Empresas!AE$6:AE$46))","v":""},{"$f":"IF(Empresas!AF8=\"\",\"\",SUMIF(Empresas!$B$6:$B$46,UF!$B6,Empresas!AF$6:AF$46))","v":""},"",{"$f":"IF(Empresas!AH8=\"\",\"\",SUMIF(Empresas!$B$6:$B$46,UF!$B6,Empresas!AH$6:AH$46))","v":""},{"$f":"IF(Empresas!AI8=\"\",\"\",SUMIF(Empresas!$B$6:$B$46,UF!$B6,Empresas!AI$6:AI$46))","v":""},"",{"$f":"IF(Empresas!AK8=\"\",\"\",SUMIF(Empresas!$B$6:$B$46,UF!$B6,Empresas!AK$6:AK$46))","v":""},{"$f":"IF(Empresas!AL8=\"\",\"\",SUMIF(Empresas!$B$6:$B$46,UF!$B6,Empresas!AL$6:AL$46))","v":""},"",{"$f":"IF(Empresas!AN8=\"\",\"\",SUMIF(Empresas!$B$6:$B$46,UF!$B6,Empresas!AN$6:AN$46))","v":""},{"$f":"IF(Empresas!AO8=\"\",\"\",SUMIF(Empresas!$B$6:$B$46,UF!$B6,Empresas!AO$6:AO$46))","v":""},"",{"$f":"IF(Empresas!AQ8=\"\",\"\",SUMIF(Empresas!$B$6:$B$46,UF!$B6,Empresas!AQ$6:AQ$46))","v":""},{"$f":"IF(Empresas!AR8=\"\",\"\",SUMIF(Empresas!$B$6:$B$46,UF!$B6,Empresas!AR$6:AR$46))","v":""},""]
{"$rows_left_out":7}
{"sheet":"Dados","index":2,"n_rows":135,"n_cols":52,"rows_kept":135,"cut":false,"hidden":false,"merged":[[2,7,2,18],[2,21,2,32],[2,36,2,47]]}
[]
[null,null,{"$f":"MID(CELL(\"nome.arquivo\",UF!A1),FIND(\"]\",CELL(\"nome.arquivo\",UF!A1))+1,LEN(CELL(\"nome.arquivo\",UF!A1)))&\"!\"","v":"UF!"},"COL",7]
[null,null,null,"LIN",12,null,null,"% Atendimento",null,null,null,null,null,null,null,null,null,null,null,null,null,"Qtd. De Serviços Demandados",null,null,null,null,null,null,null,null,null,null,null,null,null,null,"Qtd. De Serviços Demandados",null,null,null,null,null,null,null,null,null,null,null,null,"Estado",{"$f":"Dados!AK35","v":0},{"$f":"Dados!BM68","v":0}]
[null,null,null,null,null,null,"Estado",{"$f":"UF!$H$2","v":"JANEIRO"},{"$f":"UF!$K$2","v":"FEVEREIRO"},{"$f":"UF!$N$2","v":"MARÇO"},{"$f":"UF!$Q$2","v":"ABRIL"},{"$f":"UF!$T$2","v":"MAIO"},{"$f":"UF!$W$2","v":"JUNHO"},{"$f":"UF!$Z$2","v":"JULHO"},{"$f":"UF!$AC$2","v":"AGOSTO"},{"$f":"UF!$AF$2","v":"SETEMBRO"},{"$f":"UF!$AI$2","v":"OUTUBRO"},{"$f":"UF!$AL$2","v":"NOVEMBRO"},{"$f":"UF!$AO$2","v":"DEZEMBRO"},null,"Estado",{"$f":"UF!$H$2","v":"JANEIRO"},{"$f":"UF!$K$2","v":"FEVEREIRO"},{"$f":"UF!$N$2","v":"MARÇO"},{"$f":"UF!$Q$2","v":"ABRIL"},{"$f":"UF!$T$2","v":"MAIO"},{"$f":"UF!$W$2","v":"JUNHO"},{"$f":"UF!$Z$2","v":"JULHO"},{"$f":"UF!$AC$2","v":"AGOSTO"},{"$f":"UF!$AF$2","v":"SETEMBRO"},{"$f":"UF!$AI$2","v":"OUTUBRO"},{"$f":"UF!$AL$2","v":"NOVEMBRO"},{"$f":"UF!$AO$2","v":"DEZEMBRO"},null,null,"Estado",{"$f":"UF!$H$2","v":"JANEIRO"},{"$f":"UF!$K$2","v":"FEVEREIRO"},{"$f":"UF!$N$2","v":"MARÇO"},{"$f":"UF!$Q$2","v":"ABRIL"},{"$f":"UF!$T$2","v":"MAIO"},{"$f":"UF!$W$2","v":"JUNHO"},{"$f":"UF!$Z$2","v":"JULHO"},{"$f":"UF!$AC$2","v":"AGOSTO"},{"$f":"UF!$AF$2","v":"SETEMBRO"},{"$f":"UF!$AI$2","v":"OUTUBRO"},{"$f":"UF!$AL$2","v":"NOVEMBRO"},{"$f":"UF!$AO$2","v":"DEZEMBRO"},null,{"$f":"UF!$H$2","v":"JANEIRO"},{"$f":"INDEX(Dados!$H$72:$P$83,ROW(AX4)-5,periodo)","v":{"$error":"#VALUE!"}},{"$f":"Dados!BM69","v":0}]
[null,{"$f":"IF(OR($D5=\"\",$E5=\"\"),\"\",IF($E5>$D5,3,IF($E5=$D5,2,1)))","v":""},4,{"$f":"INDIRECT($C$2&ADDRESS($C5,$E$2-3))","v":""},{"$f":"INDIRECT($C$2&ADDRESS($C5,$E$2))","v":0.4},null,"AM",{"$f":"IF(UF!$J$4=\"\",#N/A,UF!$J$4)","v":0.5},{"$f":"IF(UF!$M$4=\"\",#N/A,UF!$M$4)","v":{"$error":"#N/A"}},{"$f":"IF(UF!$P$4=\"\",#N/A,UF!$P$4)","v":{"$error":"#N/A"}},{"$f":"IF(UF!$S$4=\"\",#N/A,UF!$S$4)","v":{"$error":"#N/A"}},{"$f":"IF(UF!$V$4=\"\",#N/A,UF!$V$4)","v":{"$error":"#N/A"}},{"$f":"IF(UF!$Y$4=\"\",#N/A,UF!$Y$4)","v":{"$error":"#N/A"}},{"$f":"IF(UF!$AB$4=\"\",#N/A,UF!$AB$4)","v":{"$error":"#N/A"}},{"$f":"IF(UF!$AE$4=\"\",#N/A,UF!$AE$4)","v":{"$error":"#N/A"}},{"$f":"IF(UF!$AH$4=\"\",#N/A,UF!$AH$4)","v":{"$error":"#N/A"}},{"$f":"IF(UF!$AK$4=\"\",#N/A,UF!$AK$4)","v":{"$error":"#N/A"}},{"$f":"IF(UF!$AN$4=\"\",#N/A,UF!$AN$4)","v":{"$error":"#N/A"}},{"$f":"IF(UF!$AQ$4=\"\",#N/A,UF!$AQ$4)","v":{"$error":"#N/A"}},null,"AM",{"$f":"IF(UF!H4=\"\",#N/A,UF!H4)","v":20},{"$f":"IF(UF!K4=\"\",#N/A,UF!K4)","v":{"$error":"#N/A"}},{"$f":"IF(UF!N4=\"\",#N/A,UF!N4)","v":{"$error":"#N/A"}},{"$f":"IF(UF!Q4=\"\",#N/A,UF!Q4)","v":{"$error":"#N/A"}},{"$f":"IF(UF!T4=\"\",#N/A,UF!T4)","v":{"$error":"#N/A"}},{"$f":"IF(UF!W4=\"\",#N/A,UF!W4)","v":{"$error":"#N/A"}},{"$f":"IF(UF!Z4=\"\",#N/A,UF!Z4)","v":{"$error":"#N/A"}},{"$f":"IF(UF!AC4=\"\",#N/A,UF!AC4)","v":{"$error":"#N/A"}},{"$f":"IF(UF!AF4=\"\",#N/A,UF!AF4)","v":{"$error":"#N/A"}},{"$f":"IF(UF!AI4=\"\",#N/A,UF!AI4)","v":{"$error":"#N/A"}},{"$f":"IF(UF!AL4=\"\",#N/A,UF!AL4)","v":{"$error":"#N/A"}},{"$f":"IF(UF!AO4=\"\",#N/A,UF!AO4)","v":{"$error":"#N/A"}},null,null,"AM",{"$f":"IF(UF!I4=\"\",#N/A,UF!I4)","v":10},{"$f":"IF(UF!L4=\"\",#N/A,UF!L4)","v":{"$error":"#N/A"}},{"$f":"IF(UF!O4=\"\",#N/A,UF!O4)","v":{"$error":"#N/A"}},{"$f":"IF(UF!R4=\"\",#N/A,UF!R4)","v":{"$error":"#N/A"}},{"$f":"IF(UF!U4=\"\",#N/A,UF!U4)","v":{"$error":"#N/A"}},{"$f":"IF(UF!X4=\"\",#N/A,UF!X4)","v":{"$error":"#N/A"}},{"$f":"IF(UF!AA4=\"\",#N/A,UF!AA4)","v":{"$error":"#N/A"}},{"$f":"IF(UF!AD4=\"\",#N/A,UF!AD4)","v":{"$error":"#N/A"}},{"$f":"IF(UF!AG4=\"\",#N/A,UF!AG4)","v":{"$error":"#N/A"}},{"$f":"IF(UF!AJ4=\"\",#N/A,UF!AJ4)","v":{"$error":"#N/A"}},{"$f":"IF(UF!AM4=\"\",#N/A,UF!AM4)","v":{"$error":"#N/A"}},{"$f":"IF(UF!AP4=\"\",#N/A,UF!AP4)","v":{"$error":"#N/A"}},null,{"$f":"UF!$K$2","v":"FEVEREIRO"},{"$f":"INDEX(Dados!$H$72:$P$83,ROW(AX5)-5,periodo)","v":{"$error":"#VALUE!"}},{"$f":"Dados!AU70","v":0}]
[null,{"$f":"IF(OR($D6=\"\",$E6=\"\"),\"\",IF($E6>$D6,3,IF($E6=$D6,2,1)))","v":""},5,"",0.44389027431421446,null,"BA",{"$f":"IF(UF!$J$5=\"\",#N/A,UF!$J$5)","v":0.42394014962593518},{"$f":"IF(UF!$M$5=\"\",#N/A,UF!$M$5)","v":{"$error":"#N/A"}},{"$f":"IF(UF!$P$5=\"\",#N/A,UF!$P$5)","v":{"$error":"#N/A"}},{"$f":"IF(UF!$S$5=\"\",#N/A,UF!$S$5)","v":{"$error":"#N/A"}},{"$f":"IF(UF!$V$5=\"\",#N/A,UF!$V$5)","v":{"$error":"#N/A"}},{"$f":"IF(UF!$Y$5=\"\",#N/A,UF!$Y$5)","v":{"$error":"#N/A"}},{"$f":"IF(UF!$AB$5=\"\",#N/A,UF!$AB$5)","v":{"$error":"#N/A"}},{"$f":"IF(UF!$AE$5=\"\",#N/A,UF!$AE$5)","v":{"$error":"#N/A"}},{"$f":"IF(UF!$AH$5=\"\",#N/A,UF!$AH$5)","v":{"$error":"#N/A"}},{"$f":"IF(UF!$AK$5=\"\",#N/A,UF!$AK$5)","v":{"$error":"#N/A"}},{"$f":"IF(UF!$AN$5=\"\",#N/A,UF!$AN$5)","v":{"$error":"#N/A"}},{"$f":"IF(UF!$AQ$5=\"\",#N/A,UF!$AQ$5)","v":{"$error":"#N/A"}},null,"BA",{"$f":"IF(UF!H5=\"\",#N/A,UF!H5)","v":401},{"$f":"IF(UF!K5=\"\",#N/A,UF!K5)","v":{"$error":"#N/A"}},{"$f":"IF(UF!$N5=\"\",#N/A,UF!$N5)","v":{"$error":"#N/A"}},{"$f":"IF(UF!$Q5=\"\",#N/A,UF!$Q5)","v":{"$error":"#N/A"}},{"$f":"IF(UF!T5=\"\",#N/A,UF!T5)","v":{"$error":"#N/A"}},{"$f":"IF(UF!W5=\"\",#N/A,UF!W5)","v":{"$error":"#N/A"}},{"$f":"IF(UF!Z5=\"\",#N/A,UF!Z5)","v":{"$error":"#N/A"}},{"$f":"IF(UF!AC5=\"\",#N/A,UF!AC5)","v":{"$error":"#N/A"}},{"$f":"IF(UF!AF5=\"\",#N/A,UF!AF5)","v":{"$error":"#N/A"}},{"$f":"IF(UF!AI5=\"\",#N/A,UF!AI5)","v":{"$error":"#N/A"}},{"$f":"IF(UF!AL5=\"\",#N/A,UF!AL5)","v":{"$error":"#N/A"}},{"$f":"IF(UF!AO5=\"\",#N/A,UF!AO5)","v":{"$error":"#N/A"}},null,null,"BA",{"$f":"IF(UF!I5=\"\",#N/A,UF!I5)","v":170},{"$f":"IF(UF!L5=\"\",#N/A,UF!L5)","v":{"$error":"#N/A"}},{"$f":"IF(UF!O5=\"\",#N/A,UF!O5)","v":{"$error":"#N/A"}},{"$f":"IF(UF!R5=\"\",#N/A,UF!R5)","v":{"$error":"#N/A"}},{"$f":"IF(UF!U5=\"\",#N/A,UF!U5)","v":{"$error":"#N/A"}},{"$f":"IF(UF!X5=\"\",#N/A,UF!X5)","v":{"$error":"#N/A"}},{"$f":"IF(UF!AA5=\"\",#N/A,UF!AA5)","v":{"$error":"#N/A"}},{"$f":"IF(UF!AD5=\"\",#N/A,UF!AD5)","v":{"$error":"#N/A"}},{"$f":"IF(UF!AG5=\"\",#N/A,UF!AG5)","v":{"$error":"#N/A"}},{"$f":"IF(UF!AJ5=\"\",#N/A,UF!AJ5)","v":{"$error":"#N/A"}},{"$f":"IF(UF!AM5=\"\",#N/A,UF!AM5)","v":{"$error":"#N/A"}},{"$f":"IF(UF!AP5=\"\",#N/A,UF!AP5)","v":{"$error":"#N/A"}},null,{"$f":"UF!$N$2","v":"MARÇO"},{"$f":"INDEX(Dados!$H$72:$P$83,ROW(AX6)-5,periodo)","v":0.48044692737430167},{"$f":"Dados!AU72","v":0}]
{"$rows_left_out":130}
{"sheet":"Planilha (A)","index":3,"n_rows":76,"n_cols":43,"rows_kept":76,"cut":false,"hidden":false,"merged":[[22,40,22,42],[22,7,22,9],[22,10,22,12],[22,13,22,15],[22,16,22,18],[22,19,22,21],[22,22,22,24],[22,25,22,27],[22,28,22,30],[22,31,22,33],[22,34,22,36],[22,37,22,39],[21,4,21,5],[21,6,21,9],[21,10,21,11],[22,4,22,6]]}
[]
[]
[]
[]
[null,null,null,null,null,null,null,null,null,null,"ESTADO",{"$f":"Dados!$H$37","v":"DF"},{"$f":"Dados!$R$70","v":"BRASIL"}]
[null,null,null,null,null,null,null,null,null,null,2017,{"$f":"INDEX(Dados!$H$71:$P$83,ROW(K6)-5,periodo)","v":0.45251396648044695},{"$f":"Dados!R71","v":0.35422582627908483}]
{"$rows_left_out":71}
{"sheet":"Planilha (B)","index":4,"n_rows":44,"n_cols":12,"rows_kept":44,"cut":false,"hidden":false,"merged":[[41,6,41,8],[1,2,1,3],[5,2,5,3],[37,6,37,8],[37,9,37,11],[3,2,3,12],[29,9,29,11],[33,3,33,5],[33,6,33,8],[33,9,33,11],[37,3,37,5],[25,3,25,5],[25,6,25,8],[25,9,25,11],[29,3,29,5],[29,6,29,8]]}
[]
[null,"REF",{"$f":"INDEX('Planilha (A)'!$B$25:$B$76,MATCH('Planilha (B)'!$C$4,'Planilha (A)'!$C$25:$C$76,0))","v":13}]
[]
[null,"Empresa","EMPRESA 13"]
[]
[null,"Sigla",{"$f":"VLOOKUP(C4,Empresas!$D$6:$E$46,2,0)","v":"EMP13"}]
{"$rows_left_out":38}