{"text_format":"1","workbook":"xlsx","n_sheets":5,"sheets":["Empresas","UF","Dados","Planilha (A)","Planilha (B)"],"not_rendered":{"charts":2,"images":0,"macros":1,"external_links":0,"defined_names":31,"comments":0,"pivot_tables":0},"unopened":[],"bounds":{"document_bytes":16777216,"sheet_cells":100000,"rows_first":2000,"rows_last":500,"rows_between":2000,"halvings":0,"cell_chars":16384,"cell_head_chars":4096},"cells_cut":0,"cells_raw":0,"read":"whole","date_system":"1900"}

{"sheet":"Empresas","index":0,"n_rows":47,"n_cols":45,"rows_kept":47,"cut":false,"hidden":false,"merged":[[2,18,2,19],[2,24,2,25],[2,20,2,23],[3,33,3,35],[1,1,2,3],[3,18,3,20],[3,21,3,23],[3,24,3,26],[3,9,3,11],[3,12,3,14],[3,15,3,17],[3,6,3,8],[3,36,3,38],[3,39,3,41],[3,42,3,44],[3,27,3,29],[3,30,3,32]]}
["  "]
[]
[]
[null,null,null,null,null,"JANEIRO",2017,null,null,"JANEIRO",null,null,"FEVEREIRO",null,null,"MARÇO",null,null,"ABRIL",null,null,"MAIO",null,null,"JUNHO",null,null,"JULHO",null,null,"AGOSTO",null,null,"SETEMBRO",null,null,"OUTUBRO",null,null,"NOVEMBRO",null,null,"DEZEMBRO"]
[null,"UF","Código","Sindicato","SIGLA",{"$f":"\"Comparativo \"&CHAR(10)&OFFSET(INDIRECT(F4,TRUE),,-3)&\" / \"&F4","v":"Comparativo \n2017 / JANEIRO"},"Serviços Demandados","Serviços Atendidos","% Atendimento","Serviços Demandados","Serviços Atendidos","% Atendimento","Serviços Demandados","Serviços Atendidos","% Atendimento","Serviços Demandados","Serviços Atendidos","% Atendimento","Serviços Demandados","Serviços Atendidos","% Atendimento","Serviços Demandados","Serviços Atendidos","% Atendimento","Serviços Demandados","Serviços Atendidos","% Atendimento","Serviços Demandados","Serviços Atendidos","% Atendimento","Serviços Demandados","Serviços Atendidos","% Atendimento","Serviços Demandados","Serviços Atendidos","% Atendimento","Serviços Demandados","Serviços Atendidos","% Atendimento","Serviços Demandados","Serviços Atendidos","% Atendimento","Serviços Demandados","Serviços Atendidos","% Atendimento"]
[null,"AM",1,"EMPRESA 1","EMP1",{"$f":"IF(OFFSET(INDIRECT($F$4,TRUE),ROW(D6)-4,2)>OFFSET(INDIRECT($F$4),ROW(D6)-4,-1),1,IF(OFFSET(INDIRECT($F$4,TRUE),ROW(D6)-4,2)=OFFSET(INDIRECT($F$4),ROW(D6)-4,-1),2,3))","v":2},10,5,{"$f":"IFERROR(H6/G6,\"\")","v":0.5},10,5,{"$f":"IFERROR(K6/J6,\"\")","v":0.5},{"$f":"\"\"","v":""},{"$f":"\"\"","v":""},{"$f":"IFERROR(N6/M6,\"\")","v":""},{"$f":"\"\"","v":""},{"$f":"\"\"","v":""},{"$f":"IFERROR(Q6/P6,\"\")","v":""},{"$f":"\"\"","v":""},{"$f":"\"\"","v":""},{"$f":"IFERROR(T6/S6,\"\")","v":""},{"$f":"\"\"","v":""},{"$f":"\"\"","v":""},{"$f":"IFERROR(W6/V6,\"\")","v":""},{"$f":"\"\"","v":""},{"$f":"\"\"","v":""},{"$f":"IFERROR(Z6/Y6,\"\")","v":""},{"$f":"\"\"","v":""},{"$f":"\"\"","v":""},{"$f":"IFERROR(AC6/AB6,\"\")","v":""},{"$f":"\"\"","v":""},{"$f":"\"\"","v":""},{"$f":"IFERROR(AF6/AE6,\"\")","v":""},{"$f":"\"\"","v":""},{"$f":"\"\"","v":""},{"$f":"IFERROR(AI6/AH6,\"\")","v":""},{"$f":"\"\"","v":""},{"$f":"\"\"","v":""},{"$f":"IFERROR(AL6/AK6,\"\")","v":""},{"$f":"\"\"","v":""},{"$f":"\"\"","v":""},{"$f":"IFERROR(AO6/AN6,\"\")","v":""},{"$f":"\"\"","v":""},{"$f":"\"\"","v":""},{"$f":"IFERROR(AR6/AQ6,\"\")","v":""}]
[null,"AM",2,"EMPRESA 2","EMP2",1,6,2,0.33333333333333331,6,3,0.5,{"$f":"\"\"","v":""},{"$f":"\"\"","v":""},"",{"$f":"\"\"","v":""},{"$f":"\"\"","v":""},"",{"$f":"\"\"","v":""},{"$f":"\"\"","v":""},"",{"$f":"\"\"","v":""},{"$f":"\"\"","v":""},"",{"$f":"\"\"","v":""},{"$f":"\"\"","v":""},"",{"$f":"\"\"","v":""},{"$f":"\"\"","v":""},"",{"$f":"\"\"","v":""},{"$f":"\"\"","v":""},"",{"$f":"\"\"","v":""},{"$f":"\"\"","v":""},"",{"$f":"\"\"","v":""},{"$f":"\"\"","v":""},"",{"$f":"\"\"","v":""},{"$f":"\"\"","v":""},"",{"$f":"\"\"","v":""},{"$f":"\"\"","v":""},""]
[null,"AM",3,"EMPRESA 3","EMP3",1,4,1,0.25,4,2,0.5,{"$f":"\"\"","v":""},{"$f":"\"\"","v":""},"",{"$f":"\"\"","v":""},{"$f":"\"\"","v":""},"",{"$f":"\"\"","v":""},{"$f":"\"\"","v":""},"",{"$f":"\"\"","v":""},{"$f":"\"\"","v":""},"",{"$f":"\"\"","v":""},{"$f":"\"\"","v":""},"",{"$f":"\"\"","v":""},{"$f":"\"\"","v":""},"",{"$f":"\"\"","v":""},{"$f":"\"\"","v":""},"",{"$f":"\"\"","v":""},{"$f":"\"\"","v":""},"",{"$f":"\"\"","v":""},{"$f":"\"\"","v":""},"",{"$f":"\"\"","v":""},{"$f":"\"\"","v":""},"",{"$f":"\"\"","v":""},{"$f":"\"\"","v":""},""]
[null,"BA",4,"EMPRESA 4","EMP4",2,1,1,1,1,1,1,{"$f":"\"\"","v":""},{"$f":"\"\"","v":""},"",{"$f":"\"\"","v":""},{"$f":"\"\"","v":""},"",{"$f":"\"\"","v":""},{"$f":"\"\"","v":""},"",{"$f":"\"\"","v":""},{"$f":"\"\"","v":""},"",{"$f":"\"\"","v":""},{"$f":"\"\"","v":""},"",{"$f":"\"\"","v":""},{"$f":"\"\"","v":""},"",{"$f":"\"\"","v":""},{"$f":"\"\"","v":""},"",{"$f":"\"\"","v":""},{"$f":"\"\"","v":""},"",{"$f":"\"\"","v":""},{"$f":"\"\"","v":""},"",{"$f":"\"\"","v":""},{"$f":"\"\"","v":""},"",{"$f":"\"\"","v":""},{"$f":"\"\"","v":""},""]
[null,"BA",5,"EMPRESA 5","EMP5",1,200,25,0.125,200,29,0.14499999999999999,{"$f":"\"\"","v":""},{"$f":"\"\"","v":""},"",{"$f":"\"\"","v":""},{"$f":"\"\"","v":""},"",{"$f":"\"\"","v":""},{"$f":"\"\"","v":""},"",{"$f":"\"\"","v":""},{"$f":"\"\"","v":""},"",{"$f":"\"\"","v":""},{"$f":"\"\"","v":""},"",{"$f":"\"\"","v":""},{"$f":"\"\"","v":""},"",{"$f":"\"\"","v":""},{"$f":"\"\"","v":""},"",{"$f":"\"\"","v":""},{"$f":"\"\"","v":""},"",{"$f":"\"\"","v":""},{"$f":"\"\"","v":""},"",{"$f":"\"\"","v":""},{"$f":"\"\"","v":""},"",{"$f":"\"\"","v":""},{"$f":"\"\"","v":""},""]
[null,"BA",6,"EMPRESA 6","EMP6",2,19,0,0,19,0,0,{"$f":"\"\"","v":""},{"$f":"\"\"","v":""},"",{"$f":"\"\"","v":""},{"$f":"\"\"","v":""},"",{"$f":"\"\"","v":""},{"$f":"\"\"","v":""},"",{"$f":"\"\"","v":""},{"$f":"\"\"","v":""},"",{"$f":"\"\"","v":""},{"$f":"\"\"","v":""},"",{"$f":"\"\"","v":""},{"$f":"\"\"","v":""},"",{"$f":"\"\"","v":""},{"$f":"\"\"","v":""},"",{"$f":"\"\"","v":""},{"$f":"\"\"","v":""},"",{"$f":"\"\"","v":""},{"$f":"\"\"","v":""},"",{"$f":"\"\"","v":""},{"$f":"\"\"","v":""},"",{"$f":"\"\"","v":""},{"$f":"\"\"","v":""},""]
[null,"BA",7,"EMPRESA 7","EMP7",1,32,12,0.375,32,18,0.5625,{"$f":"\"\"","v":""},{"$f":"\"\"","v":""},"",{"$f":"\"\"","v":""},{"$f":"\"\"","v":""},"",{"$f":"\"\"","v":""},{"$f":"\"\"","v":""},"",{"$f":"\"\"","v":""},{"$f":"\"\"","v":""},"",{"$f":"\"\"","v":""},{"$f":"\"\"","v":""},"",{"$f":"\"\"","v":""},{"$f":"\"\"","v":""},"",{"$f":"\"\"","v":""},{"$f":"\"\"","v":""},"",{"$f":"\"\"","v":""},{"$f":"\"\"","v":""},"",{"$f":"\"\"","v":""},{"$f":"\"\"","v":""},"",{"$f":"\"\"","v":""},{"$f":"\"\"","v":""},"",{"$f":"\"\"","v":""},{"$f":"\"\"","v":""},""]
[null,"BA",8,"EMPRESA 8","EMP8",3,149,140,0.93959731543624159,149,122,0.81879194630872487,{"$f":"\"\"","v":""},{"$f":"\"\"","v":""},"",{"$f":"\"\"","v":""},{"$f":"\"\"","v":""},"",{"$f":"\"\"","v":""},{"$f":"\"\"","v":""},"",{"$f":"\"\"","v":""},{"$f":"\"\"","v":""},"",{"$f":"\"\"","v":""},{"$f":"\"\"","v":""},"",{"$f":"\"\"","v":""},{"$f":"\"\"","v":""},"",{"$f":"\"\"","v":""},{"$f":"\"\"","v":""},"",{"$f":"\"\"","v":""},{"$f":"\"\"","v":""},"",{"$f":"\"\"","v":""},{"$f":"\"\"","v":""},"",{"$f":"\"\"","v":""},{"$f":"\"\"","v":""},"",{"$f":"\"\"","v":""},{"$f":"\"\"","v":""},""]
[null,"CE",9,"EMPRESA 9","EMP9",1,1050,50,4.7619047619047616E-2,1050,55,5.2380952380952382E-2,{"$f":"\"\"","v":""},{"$f":"\"\"","v":""},"",{"$f":"\"\"","v":""},{"$f":"\"\"","v":""},"",{"$f":"\"\"","v":""},{"$f":"\"\"","v":""},"",{"$f":"\"\"","v":""},{"$f":"\"\"","v":""},"",{"$f":"\"\"","v":""},{"$f":"\"\"","v":""},"",{"$f":"\"\"","v":""},{"$f":"\"\"","v":""},"",{"$f":"\"\"","v":""},{"$f":"\"\"","v":""},"",{"$f":"\"\"","v":""},{"$f":"\"\"","v":""},"",{"$f":"\"\"","v":""},{"$f":"\"\"","v":""},"",{"$f":"\"\"","v":""},{"$f":"\"\"","v":""},"",{"$f":"\"\"","v":""},{"$f":"\"\"","v":""},""]
[null,"CE",10,"EMPRESA 10","EMP10",3,122,22,0.18032786885245902,122,21,0.1721311475409836,{"$f":"\"\"","v":""},{"$f":"\"\"","v":""},"",{"$f":"\"\"","v":""},{"$f":"\"\"","v":""},"",{"$f":"\"\"","v":""},{"$f":"\"\"","v":""},"",{"$f":"\"\"","v":""},{"$f":"\"\"","v":""},"",{"$f":"\"\"","v":""},{"$f":"\"\"","v":""},"",{"$f":"\"\"","v":""},{"$f":"\"\"","v":""},"",{"$f":"\"\"","v":""},{"$f":"\"\"","v":""},"",{"$f":"\"\"","v":""},{"$f":"\"\"","v":""},"",{"$f":"\"\"","v":""},{"$f":"\"\"","v":""},"",{"$f":"\"\"","v":""},{"$f":"\"\"","v":""},"",{"$f":"\"\"","v":""},{"$f":"\"\"","v":""},""]
[null,"CE",11,"EMPRESA 11","EMP11",3,304,157,0.51644736842105265,304,133,0.4375,{"$f":"\"\"","v":""},{"$f":"\"\"","v":""},"",{"$f":"\"\"","v":""},{"$f":"\"\"","v":""},"",{"$f":"\"\"","v":""},{"$f":"\"\"","v":""},"",{"$f":"\"\"","v":""},{"$f":"\"\"","v":""},"",{"$f":"\"\"","v":""},{"$f":"\"\"","v":""},"",{"$f":"\"\"","v":""},{"$f":"\"\"","v":""},"",{"$f":"\"\"","v":""},{"$f":"\"\"","v":""},"",{"$f":"\"\"","v":""},{"$f":"\"\"","v":""},"",{"$f":"\"\"","v":""},{"$f":"\"\"","v":""},"",{"$f":"\"\"","v":""},{"$f":"\"\"","v":""},"",{"$f":"\"\"","v":""},{"$f":"\"\"","v":""},""]
[null,"CE",12,"EMPRESA 12","EMP12",1,264,99,0.375,264,143,0.54166666666666663,{"$f":"\"\"","v":""},{"$f":"\"\"","v":""},"",{"$f":"\"\"","v":""},{"$f":"\"\"","v":""},"",{"$f":"\"\"","v":""},{"$f":"\"\"","v":""},"",{"$f":"\"\"","v":""},{"$f":"\"\"","v":""},"",{"$f":"\"\"","v":""},{"$f":"\"\"","v":""},"",{"$f":"\"\"","v":""},{"$f":"\"\"","v":""},"",{"$f":"\"\"","v":""},{"$f":"\"\"","v":""},"",{"$f":"\"\"","v":""},{"$f":"\"\"","v":""},"",{"$f":"\"\"","v":""},{"$f":"\"\"","v":""},"",{"$f":"\"\"","v":""},{"$f":"\"\"","v":""},"",{"$f":"\"\"","v":""},{"$f":"\"\"","v":""},""]
[null,"DF",13,"EMPRESA 13","EMP13",1,72,18,0.25,72,29,0.40277777777777779,{"$f":"\"\"","v":""},{"$f":"\"\"","v":""},"",{"$f":"\"\"","v":""},{"$f":"\"\"","v":""},"",{"$f":"\"\"","v":""},{"$f":"\"\"","v":""},"",{"$f":"\"\"","v":""},{"$f":"\"\"","v":""},"",{"$f":"\"\"","v":""},{"$f":"\"\"","v":""},"",{"$f":"\"\"","v":""},{"$f":"\"\"","v":""},"",{"$f":"\"\"","v":""},{"$f":"\"\"","v":""},"",{"$f":"\"\"","v":""},{"$f":"\"\"","v":""},"",{"$f":"\"\"","v":""},{"$f":"\"\"","v":""},"",{"$f":"\"\"","v":""},{"$f":"\"\"","v":""},"",{"$f":"\"\"","v":""},{"$f":"\"\"","v":""},""]
[null,"DF",14,"EMPRESA 14","EMP14",3,67,29,0.43283582089552236,67,28,0.41791044776119401,{"$f":"\"\"","v":""},{"$f":"\"\"","v":""},"",{"$f":"\"\"","v":""},{"$f":"\"\"","v":""},"",{"$f":"\"\"","v":""},{"$f":"\"\"","v":""},"",{"$f":"\"\"","v":""},{"$f":"\"\"","v":""},"",{"$f":"\"\"","v":""},{"$f":"\"\"","v":""},"",{"$f":"\"\"","v":""},{"$f":"\"\"","v":""},"",{"$f":"\"\"","v":""},{"$f":"\"\"","v":""},"",{"$f":"\"\"","v":""},{"$f":"\"\"","v":""},"",{"$f":"\"\"","v":""},{"$f":"\"\"","v":""},"",{"$f":"\"\"","v":""},{"$f":"\"\"","v":""},"",{"$f":"\"\"","v":""},{"$f":"\"\"","v":""},""]
[null,"DF",15,"EMPRESA 15","EMP15",{"$f":"IF(OFFSET(INDIRECT($F$4,TRUE),ROW(D20)-4,2)>OFFSET(INDIRECT($F$4),ROW(D20)-4,-1),1,IF(OFFSET(INDIRECT($F$4,TRUE),ROW(D20)-4,2)=OFFSET(INDIRECT($F$4),ROW(D20)-4,-1),2,3))","v":1},47,8,{"$f":"IFERROR(H20/G20,\"\")","v":0.1702127659574468},47,12,{"$f":"IFERROR(K20/J20,\"\")","v":0.25531914893617019},{"$f":"\"\"","v":""},{"$f":"\"\"","v":""},{"$f":"IFERROR(N20/M20,\"\")","v":""},{"$f":"\"\"","v":""},{"$f":"\"\"","v":""},{"$f":"IFERROR(Q20/P20,\"\")","v":""},{"$f":"\"\"","v":""},{"$f":"\"\"","v":""},{"$f":"IFERROR(T20/S20,\"\")","v":""},{"$f":"\"\"","v":""},{"$f":"\"\"","v":""},{"$f":"IFERROR(W20/V20,\"\")","v":""},{"$f":"\"\"","v":""},{"$f":"\"\"","v":""},{"$f":"IFERROR(Z20/Y20,\"\")","v":""},{"$f":"\"\"","v":""},{"$f":"\"\"","v":""},{"$f":"IFERROR(AC20/AB20,\"\")","v":""},{"$f":"\"\"","v":""},{"$f":"\"\"","v":""},{"$f":"IFERROR(AF20/AE20,\"\")","v":""},{"$f":"\"\"","v":""},{"$f":"\"\"","v":""},{"$f":"IFERROR(AI20/AH20,\"\")","v":""},{"$f":"\"\"","v":""},{"$f":"\"\"","v":""},{"$f":"IFERROR(AL20/AK20,\"\")","v":""},{"$f":"\"\"","v":""},{"$f":"\"\"","v":""},{"$f":"IFERROR(AO20/AN20,\"\")","v":""},{"$f":"\"\"","v":""},{"$f":"\"\"","v":""},{"$f":"IFERROR(AR20/AQ20,\"\")","v":""}]
[null,"DF",16,"EMPRESA 16","EMP16",3,85,80,0.94117647058823528,85,66,0.77647058823529413,{"$f":"\"\"","v":""},{"$f":"\"\"","v":""},"",{"$f":"\"\"","v":""},{"$f":"\"\"","v":""},"",{"$f":"\"\"","v":""},{"$f":"\"\"","v":""},"",{"$f":"\"\"","v":""},{"$f":"\"\"","v":""},"",{"$f":"\"\"","v":""},{"$f":"\"\"","v":""},"",{"$f":"\"\"","v":""},{"$f":"\"\"","v":""},"",{"$f":"\"\"","v":""},{"$f":"\"\"","v":""},"",{"$f":"\"\"","v":""},{"$f":"\"\"","v":""},"",{"$f":"\"\"","v":""},{"$f":"\"\"","v":""},"",{"$f":"\"\"","v":""},{"$f":"\"\"","v":""},"",{"$f":"\"\"","v":""},{"$f":"\"\"","v":""},""]
[null,"DF",17,"EMPRESA 17","EMP17",1,87,27,0.31034482758620691,87,37,0.42528735632183906,{"$f":"\"\"","v":""},{"$f":"\"\"","v":""},"",{"$f":"\"\"","v":""},{"$f":"\"\"","v":""},"",{"$f":"\"\"","v":""},{"$f":"\"\"","v":""},"",{"$f":"\"\"","v":""},{"$f":"\"\"","v":""},"",{"$f":"\"\"","v":""},{"$f":"\"\"","v":""},"",{"$f":"\"\"","v":""},{"$f":"\"\"","v":""},"",{"$f":"\"\"","v":""},{"$f":"\"\"","v":""},"",{"$f":"\"\"","v":""},{"$f":"\"\"","v":""},"",{"$f":"\"\"","v":""},{"$f":"\"\"","v":""},"",{"$f":"\"\"","v":""},{"$f":"\"\"","v":""},"",{"$f":"\"\"","v":""},{"$f":"\"\"","v":""},""]
[null,"GO",18,"EMPRESA 18","EMP18",2,341,128,0.37536656891495601,341,128,0.37536656891495601,{"$f":"\"\"","v":""},{"$f":"\"\"","v":""},"",{"$f":"\"\"","v":""},{"$f":"\"\"","v":""},"",{"$f":"\"\"","v":""},{"$f":"\"\"","v":""},"",{"$f":"\"\"","v":""},{"$f":"\"\"","v":""},"",{"$f":"\"\"","v":""},{"$f":"\"\"","v":""},"",{"$f":"\"\"","v":""},{"$f":"\"\"","v":""},"",{"$f":"\"\"","v":""},{"$f":"\"\"","v":""},"",{"$f":"\"\"","v":""},{"$f":"\"\"","v":""},"",{"$f":"\"\"","v":""},{"$f":"\"\"","v":""},"",{"$f":"\"\"","v":""},{"$f":"\"\"","v":""},"",{"$f":"\"\"","v":""},{"$f":"\"\"","v":""},""]
[null,"GO",19,"EMPRESA 19","EMP19",2,79,55,0.69620253164556967,79,55,0.69620253164556967,{"$f":"\"\"","v":""},{"$f":"\"\"","v":""},"",{"$f":"\"\"","v":""},{"$f":"\"\"","v":""},"",{"$f":"\"\"","v":""},{"$f":"\"\"","v":""},"",{"$f":"\"\"","v":""},{"$f":"\"\"","v":""},"",{"$f":"\"\"","v":""},{"$f":"\"\"","v":""},"",{"$f":"\"\"","v":""},{"$f":"\"\"","v":""},"",{"$f":"\"\"","v":""},{"$f":"\"\"","v":""},"",{"$f":"\"\"","v":""},{"$f":"\"\"","v":""},"",{"$f":"\"\"","v":""},{"$f":"\"\"","v":""},"",{"$f":"\"\"","v":""},{"$f":"\"\"","v":""},"",{"$f":"\"\"","v":""},{"$f":"\"\"","v":""},""]
[null,"GO",20,"EMPRESA 20","EMP20",1,11,4,0.36363636363636365,11,6,0.54545454545454541,{"$f":"\"\"","v":""},{"$f":"\"\"","v":""},"",{"$f":"\"\"","v":""},{"$f":"\"\"","v":""},"",{"$f":"\"\"","v":""},{"$f":"\"\"","v":""},"",{"$f":"\"\"","v":""},{"$f":"\"\"","v":""},"",{"$f":"\"\"","v":""},{"$f":"\"\"","v":""},"",{"$f":"\"\"","v":""},{"$f":"\"\"","v":""},"",{"$f":"\"\"","v":""},{"$f":"\"\"","v":""},"",{"$f":"\"\"","v":""},{"$f":"\"\"","v":""},"",{"$f":"\"\"","v":""},{"$f":"\"\"","v":""},"",{"$f":"\"\"","v":""},{"$f":"\"\"","v":""},"",{"$f":"\"\"","v":""},{"$f":"\"\"","v":""},""]
[null,"GO",21,"EMPRESA 21","EMP21",3,19,16,0.84210526315789469,19,13,0.68421052631578949,{"$f":"\"\"","v":""},{"$f":"\"\"","v":""},"",{"$f":"\"\"","v":""},{"$f":"\"\"","v":""},"",{"$f":"\"\"","v":""},{"$f":"\"\"","v":""},"",{"$f":"\"\"","v":""},{"$f":"\"\"","v":""},"",{"$f":"\"\"","v":""},{"$f":"\"\"","v":""},"",{"$f":"\"\"","v":""},{"$f":"\"\"","v":""},"",{"$f":"\"\"","v":""},{"$f":"\"\"","v":""},"",{"$f":"\"\"","v":""},{"$f":"\"\"","v":""},"",{"$f":"\"\"","v":""},{"$f":"\"\"","v":""},"",{"$f":"\"\"","v":""},{"$f":"\"\"","v":""},"",{"$f":"\"\"","v":""},{"$f":"\"\"","v":""},""]
[null,"GO",22,"EMPRESA 22","EMP22",3,12,7,0.58333333333333337,12,5,0.41666666666666669,{"$f":"\"\"","v":""},{"$f":"\"\"","v":""},"",{"$f":"\"\"","v":""},{"$f":"\"\"","v":""},"",{"$f":"\"\"","v":""},{"$f":"\"\"","v":""},"",{"$f":"\"\"","v":""},{"$f":"\"\"","v":""},"",{"$f":"\"\"","v":""},{"$f":"\"\"","v":""},"",{"$f":"\"\"","v":""},{"$f":"\"\"","v":""},"",{"$f":"\"\"","v":""},{"$f":"\"\"","v":""},"",{"$f":"\"\"","v":""},{"$f":"\"\"","v":""},"",{"$f":"\"\"","v":""},{"$f":"\"\"","v":""},"",{"$f":"\"\"","v":""},{"$f":"\"\"","v":""},"",{"$f":"\"\"","v":""},{"$f":"\"\"","v":""},""]
[null,"MA",23,"EMPRESA 23","EMP23",2,46,6,0.13043478260869565,46,6,0.13043478260869565,{"$f":"\"\"","v":""},{"$f":"\"\"","v":""},"",{"$f":"\"\"","v":""},{"$f":"\"\"","v":""},"",{"$f":"\"\"","v":""},{"$f":"\"\"","v":""},"",{"$f":"\"\"","v":""},{"$f":"\"\"","v":""},"",{"$f":"\"\"","v":""},{"$f":"\"\"","v":""},"",{"$f":"\"\"","v":""},{"$f":"\"\"","v":""},"",{"$f":"\"\"","v":""},{"$f":"\"\"","v":""},"",{"$f":"\"\"","v":""},{"$f":"\"\"","v":""},"",{"$f":"\"\"","v":""},{"$f":"\"\"","v":""},"",{"$f":"\"\"","v":""},{"$f":"\"\"","v":""},"",{"$f":"\"\"","v":""},{"$f":"\"\"","v":""},""]
[null,"MA",24,"EMPRESA 24","EMP24",2,43,13,0.30232558139534882,43,13,0.30232558139534882,{"$f":"\"\"","v":""},{"$f":"\"\"","v":""},"",{"$f":"\"\"","v":""},{"$f":"\"\"","v":""},"",{"$f":"\"\"","v":""},{"$f":"\"\"","v":""},"",{"$f":"\"\"","v":""},{"$f":"\"\"","v":""},"",{"$f":"\"\"","v":""},{"$f":"\"\"","v":""},"",{"$f":"\"\"","v":""},{"$f":"\"\"","v":""},"",{"$f":"\"\"","v":""},{"$f":"\"\"","v":""},"",{"$f":"\"\"","v":""},{"$f":"\"\"","v":""},"",{"$f":"\"\"","v":""},{"$f":"\"\"","v":""},"",{"$f":"\"\"","v":""},{"$f":"\"\"","v":""},"",{"$f":"\"\"","v":""},{"$f":"\"\"","v":""},""]
[null,"MA",25,"EMPRESA 25","EMP25",1,60,28,0.46666666666666667,60,34,0.56666666666666665,{"$f":"\"\"","v":""},{"$f":"\"\"","v":""},"",{"$f":"\"\"","v":""},{"$f":"\"\"","v":""},"",{"$f":"\"\"","v":""},{"$f":"\"\"","v":""},"",{"$f":"\"\"","v":""},{"$f":"\"\"","v":""},"",{"$f":"\"\"","v":""},{"$f":"\"\"","v":""},"",{"$f":"\"\"","v":""},{"$f":"\"\"","v":""},"",{"$f":"\"\"","v":""},{"$f":"\"\"","v":""},"",{"$f":"\"\"","v":""},{"$f":"\"\"","v":""},"",{"$f":"\"\"","v":""},{"$f":"\"\"","v":""},"",{"$f":"\"\"","v":""},{"$f":"\"\"","v":""},"",{"$f":"\"\"","v":""},{"$f":"\"\"","v":""},""]
[null,"MA",26,"EMPRESA 26","EMP26",2,51,12,0.23529411764705882,51,12,0.23529411764705882,{"$f":"\"\"","v":""},{"$f":"\"\"","v":""},"",{"$f":"\"\"","v":""},{"$f":"\"\"","v":""},"",{"$f":"\"\"","v":""},{"$f":"\"\"","v":""},"",{"$f":"\"\"","v":""},{"$f":"\"\"","v":""},"",{"$f":"\"\"","v":""},{"$f":"\"\"","v":""},"",{"$f":"\"\"","v":""},{"$f":"\"\"","v":""},"",{"$f":"\"\"","v":""},{"$f":"\"\"","v":""},"",{"$f":"\"\"","v":""},{"$f":"\"\"","v":""},"",{"$f":"\"\"","v":""},{"$f":"\"\"","v":""},"",{"$f":"\"\"","v":""},{"$f":"\"\"","v":""},"",{"$f":"\"\"","v":""},{"$f":"\"\"","v":""},""]
[null,"MA",27,"EMPRESA 27","EMP27",1,82,0,0,82,2,2.4390243902439025E-2,{"$f":"\"\"","v":""},{"$f":"\"\"","v":""},"",{"$f":"\"\"","v":""},{"$f":"\"\"","v":""},"",{"$f":"\"\"","v":""},{"$f":"\"\"","v":""},"",{"$f":"\"\"","v":""},{"$f":"\"\"","v":""},"",{"$f":"\"\"","v":""},{"$f":"\"\"","v":""},"",{"$f":"\"\"","v":""},{"$f":"\"\"","v":""},"",{"$f":"\"\"","v":""},{"$f":"\"\"","v":""},"",{"$f":"\"\"","v":""},{"$f":"\"\"","v":""},"",{"$f":"\"\"","v":""},{"$f":"\"\"","v":""},"",{"$f":"\"\"","v":""},{"$f":"\"\"","v":""},"",{"$f":"\"\"","v":""},{"$f":"\"\"","v":""},""]
[null,"MT",28,"EMPRESA 28","EMP28",2,25,2,0.08,25,2,0.08,{"$f":"\"\"","v":""},{"$f":"\"\"","v":""},"",{"$f":"\"\"","v":""},{"$f":"\"\"","v":""},"",{"$f":"\"\"","v":""},{"$f":"\"\"","v":""},"",{"$f":"\"\"","v":""},{"$f":"\"\"","v":""},"",{"$f":"\"\"","v":""},{"$f":"\"\"","v":""},"",{"$f":"\"\"","v":""},{"$f":"\"\"","v":""},"",{"$f":"\"\"","v":""},{"$f":"\"\"","v":""},"",{"$f":"\"\"","v":""},{"$f":"\"\"","v":""},"",{"$f":"\"\"","v":""},{"$f":"\"\"","v":""},"",{"$f":"\"\"","v":""},{"$f":"\"\"","v":""},"",{"$f":"\"\"","v":""},{"$f":"\"\"","v":""},""]
[null,"MT",29,"EMPRESA 29","EMP29",3,58,33,0.56896551724137934,58,29,0.5,{"$f":"\"\"","v":""},{"$f":"\"\"","v":""},"",{"$f":"\"\"","v":""},{"$f":"\"\"","v":""},"",{"$f":"\"\"","v":""},{"$f":"\"\"","v":""},"",{"$f":"\"\"","v":""},{"$f":"\"\"","v":""},"",{"$f":"\"\"","v":""},{"$f":"\"\"","v":""},"",{"$f":"\"\"","v":""},{"$f":"\"\"","v":""},"",{"$f":"\"\"","v":""},{"$f":"\"\"","v":""},"",{"$f":"\"\"","v":""},{"$f":"\"\"","v":""},"",{"$f":"\"\"","v":""},{"$f":"\"\"","v":""},"",{"$f":"\"\"","v":""},{"$f":"\"\"","v":""},"",{"$f":"\"\"","v":""},{"$f":"\"\"","v":""},""]
[null,"MT",30,"EMPRESA 30","EMP30",{"$f":"IF(OFFSET(INDIRECT($F$4,TRUE),ROW(D35)-4,2)>OFFSET(INDIRECT($F$4),ROW(D35)-4,-1),1,IF(OFFSET(INDIRECT($F$4,TRUE),ROW(D35)-4,2)=OFFSET(INDIRECT($F$4),ROW(D35)-4,-1),2,3))","v":2},10,2,{"$f":"IFERROR(H35/G35,\"\")","v":0.2},10,2,{"$f":"IFERROR(K35/J35,\"\")","v":0.2},{"$f":"\"\"","v":""},{"$f":"\"\"","v":""},{"$f":"IFERROR(N35/M35,\"\")","v":""},{"$f":"\"\"","v":""},{"$f":"\"\"","v":""},{"$f":"IFERROR(Q35/P35,\"\")","v":""},{"$f":"\"\"","v":""},{"$f":"\"\"","v":""},{"$f":"IFERROR(T35/S35,\"\")","v":""},{"$f":"\"\"","v":""},{"$f":"\"\"","v":""},{"$f":"IFERROR(W35/V35,\"\")","v":""},{"$f":"\"\"","v":""},{"$f":"\"\"","v":""},{"$f":"IFERROR(Z35/Y35,\"\")","v":""},{"$f":"\"\"","v":""},{"$f":"\"\"","v":""},{"$f":"IFERROR(AC35/AB35,\"\")","v":""},{"$f":"\"\"","v":""},{"$f":"\"\"","v":""},{"$f":"IFERROR(AF35/AE35,\"\")","v":""},{"$f":"\"\"","v":""},{"$f":"\"\"","v":""},{"$f":"IFERROR(AI35/AH35,\"\")","v":""},{"$f":"\"\"","v":""},{"$f":"\"\"","v":""},{"$f":"IFERROR(AL35/AK35,\"\")","v":""},{"$f":"\"\"","v":""},{"$f":"\"\"","v":""},{"$f":"IFERROR(AO35/AN35,\"\")","v":""},{"$f":"\"\"","v":""},{"$f":"\"\"","v":""},{"$f":"IFERROR(AR35/AQ35,\"\")","v":""}]
[null,"MT",31,"EMPRESA 31","EMP31",1,30,1,3.3333333333333333E-2,30,3,0.1,{"$f":"\"\"","v":""},{"$f":"\"\"","v":""},"",{"$f":"\"\"","v":""},{"$f":"\"\"","v":""},"",{"$f":"\"\"","v":""},{"$f":"\"\"","v":""},"",{"$f":"\"\"","v":""},{"$f":"\"\"","v":""},"",{"$f":"\"\"","v":""},{"$f":"\"\"","v":""},"",{"$f":"\"\"","v":""},{"$f":"\"\"","v":""},"",{"$f":"\"\"","v":""},{"$f":"\"\"","v":""},"",{"$f":"\"\"","v":""},{"$f":"\"\"","v":""},"",{"$f":"\"\"","v":""},{"$f":"\"\"","v":""},"",{"$f":"\"\"","v":""},{"$f":"\"\"","v":""},"",{"$f":"\"\"","v":""},{"$f":"\"\"","v":""},""]
[null,"MT",32,"EMPRESA 32","EMP32",1,21,6,0.2857142857142857,21,7,0.33333333333333331,{"$f":"\"\"","v":""},{"$f":"\"\"","v":""},"",{"$f":"\"\"","v":""},{"$f":"\"\"","v":""},"",{"$f":"\"\"","v":""},{"$f":"\"\"","v":""},"",{"$f":"\"\"","v":""},{"$f":"\"\"","v":""},"",{"$f":"\"\"","v":""},{"$f":"\"\"","v":""},"",{"$f":"\"\"","v":""},{"$f":"\"\"","v":""},"",{"$f":"\"\"","v":""},{"$f":"\"\"","v":""},"",{"$f":"\"\"","v":""},{"$f":"\"\"","v":""},"",{"$f":"\"\"","v":""},{"$f":"\"\"","v":""},"",{"$f":"\"\"","v":""},{"$f":"\"\"","v":""},"",{"$f":"\"\"","v":""},{"$f":"\"\"","v":""},""]
[null,"MS",33,"EMPRESA 33","EMP33",1,85,58,0.68235294117647061,85,60,0.70588235294117652,{"$f":"\"\"","v":""},{"$f":"\"\"","v":""},"",{"$f":"\"\"","v":""},{"$f":"\"\"","v":""},"",{"$f":"\"\"","v":""},{"$f":"\"\"","v":""},"",{"$f":"\"\"","v":""},{"$f":"\"\"","v":""},"",{"$f":"\"\"","v":""},{"$f":"\"\"","v":""},"",{"$f":"\"\"","v":""},{"$f":"\"\"","v":""},"",{"$f":"\"\"","v":""},{"$f":"\"\"","v":""},"",{"$f":"\"\"","v":""},{"$f":"\"\"","v":""},"",{"$f":"\"\"","v":""},{"$f":"\"\"","v":""},"",{"$f":"\"\"","v":""},{"$f":"\"\"","v":""},"",{"$f":"\"\"","v":""},{"$f":"\"\"","v":""},""]
[null,"MS",34,"EMPRESA 34","EMP34",3,38,20,0.52631578947368418,38,17,0.44736842105263158,{"$f":"\"\"","v":""},{"$f":"\"\"","v":""},"",{"$f":"\"\"","v":""},{"$f":"\"\"","v":""},"",{"$f":"\"\"","v":""},{"$f":"\"\"","v":""},"",{"$f":"\"\"","v":""},{"$f":"\"\"","v":""},"",{"$f":"\"\"","v":""},{"$f":"\"\"","v":""},"",{"$f":"\"\"","v":""},{"$f":"\"\"","v":""},"",{"$f":"\"\"","v":""},{"$f":"\"\"","v":""},"",{"$f":"\"\"","v":""},{"$f":"\"\"","v":""},"",{"$f":"\"\"","v":""},{"$f":"\"\"","v":""},"",{"$f":"\"\"","v":""},{"$f":"\"\"","v":""},"",{"$f":"\"\"","v":""},{"$f":"\"\"","v":""},""]
[null,"MS",35,"EMPRESA 35","EMP35",3,42,19,0.45238095238095238,42,18,0.42857142857142855,{"$f":"\"\"","v":""},{"$f":"\"\"","v":""},"",{"$f":"\"\"","v":""},{"$f":"\"\"","v":""},"",{"$f":"\"\"","v":""},{"$f":"\"\"","v":""},"",{"$f":"\"\"","v":""},{"$f":"\"\"","v":""},"",{"$f":"\"\"","v":""},{"$f":"\"\"","v":""},"",{"$f":"\"\"","v":""},{"$f":"\"\"","v":""},"",{"$f":"\"\"","v":""},{"$f":"\"\"","v":""},"",{"$f":"\"\"","v":""},{"$f":"\"\"","v":""},"",{"$f":"\"\"","v":""},{"$f":"\"\"","v":""},"",{"$f":"\"\"","v":""},{"$f":"\"\"","v":""},"",{"$f":"\"\"","v":""},{"$f":"\"\"","v":""},""]
[null,"MS",36,"EMPRESA 36","EMP36",1,88,12,0.13636363636363635,88,16,0.18181818181818182,{"$f":"\"\"","v":""},{"$f":"\"\"","v":""},"",{"$f":"\"\"","v":""},{"$f":"\"\"","v":""},"",{"$f":"\"\"","v":""},{"$f":"\"\"","v":""},"",{"$f":"\"\"","v":""},{"$f":"\"\"","v":""},"",{"$f":"\"\"","v":""},{"$f":"\"\"","v":""},"",{"$f":"\"\"","v":""},{"$f":"\"\"","v":""},"",{"$f":"\"\"","v":""},{"$f":"\"\"","v":""},"",{"$f":"\"\"","v":""},{"$f":"\"\"","v":""},"",{"$f":"\"\"","v":""},{"$f":"\"\"","v":""},"",{"$f":"\"\"","v":""},{"$f":"\"\"","v":""},"",{"$f":"\"\"","v":""},{"$f":"\"\"","v":""},""]
[null,"MS",37,"EMPRESA 37","EMP37",3,2,2,1,2,1,0.5,{"$f":"\"\"","v":""},{"$f":"\"\"","v":""},"",{"$f":"\"\"","v":""},{"$f":"\"\"","v":""},"",{"$f":"\"\"","v":""},{"$f":"\"\"","v":""},"",{"$f":"\"\"","v":""},{"$f":"\"\"","v":""},"",{"$f":"\"\"","v":""},{"$f":"\"\"","v":""},"",{"$f":"\"\"","v":""},{"$f":"\"\"","v":""},"",{"$f":"\"\"","v":""},{"$f":"\"\"","v":""},"",{"$f":"\"\"","v":""},{"$f":"\"\"","v":""},"",{"$f":"\"\"","v":""},{"$f":"\"\"","v":""},"",{"$f":"\"\"","v":""},{"$f":"\"\"","v":""},"",{"$f":"\"\"","v":""},{"$f":"\"\"","v":""},""]
[null,"MG",38,"EMPRESA 38","EMP38",2,26,7,0.26923076923076922,26,7,0.26923076923076922,{"$f":"\"\"","v":""},{"$f":"\"\"","v":""},"",{"$f":"\"\"","v":""},{"$f":"\"\"","v":""},"",{"$f":"\"\"","v":""},{"$f":"\"\"","v":""},"",{"$f":"\"\"","v":""},{"$f":"\"\"","v":""},"",{"$f":"\"\"","v":""},{"$f":"\"\"","v":""},"",{"$f":"\"\"","v":""},{"$f":"\"\"","v":""},"",{"$f":"\"\"","v":""},{"$f":"\"\"","v":""},"",{"$f":"\"\"","v":""},{"$f":"\"\"","v":""},"",{"$f":"\"\"","v":""},{"$f":"\"\"","v":""},"",{"$f":"\"\"","v":""},{"$f":"\"\"","v":""},"",{"$f":"\"\"","v":""},{"$f":"\"\"","v":""},""]
[null,"MG",39,"EMPRESA 39","EMP39",3,12,7,0.58333333333333337,12,6,0.5,{"$f":"\"\"","v":""},{"$f":"\"\"","v":""},"",{"$f":"\"\"","v":""},{"$f":"\"\"","v":""},"",{"$f":"\"\"","v":""},{"$f":"\"\"","v":""},"",{"$f":"\"\"","v":""},{"$f":"\"\"","v":""},"",{"$f":"\"\"","v":""},{"$f":"\"\"","v":""},"",{"$f":"\"\"","v":""},{"$f":"\"\"","v":""},"",{"$f":"\"\"","v":""},{"$f":"\"\"","v":""},"",{"$f":"\"\"","v":""},{"$f":"\"\"","v":""},"",{"$f":"\"\"","v":""},{"$f":"\"\"","v":""},"",{"$f":"\"\"","v":""},{"$f":"\"\"","v":""},"",{"$f":"\"\"","v":""},{"$f":"\"\"","v":""},""]
[null,"MG",40,"EMPRESA 40","EMP40",1,83,22,0.26506024096385544,83,30,0.36144578313253012,{"$f":"\"\"","v":""},{"$f":"\"\"","v":""},"",{"$f":"\"\"","v":""},{"$f":"\"\"","v":""},"",{"$f":"\"\"","v":""},{"$f":"\"\"","v":""},"",{"$f":"\"\"","v":""},{"$f":"\"\"","v":""},"",{"$f":"\"\"","v":""},{"$f":"\"\"","v":""},"",{"$f":"\"\"","v":""},{"$f":"\"\"","v":""},"",{"$f":"\"\"","v":""},{"$f":"\"\"","v":""},"",{"$f":"\"\"","v":""},{"$f":"\"\"","v":""},"",{"$f":"\"\"","v":""},{"$f":"\"\"","v":""},"",{"$f":"\"\"","v":""},{"$f":"\"\"","v":""},"",{"$f":"\"\"","v":""},{"$f":"\"\"","v":""},""]
[null,"MG",41,"EMPRESA 41","EMP41",2,13,4,0.30769230769230771,13,4,0.30769230769230771,{"$f":"\"\"","v":""},{"$f":"\"\"","v":""},"",{"$f":"\"\"","v":""},{"$f":"\"\"","v":""},"",{"$f":"\"\"","v":""},{"$f":"\"\"","v":""},"",{"$f":"\"\"","v":""},{"$f":"\"\"","v":""},"",{"$f":"\"\"","v":""},{"$f":"\"\"","v":""},"",{"$f":"\"\"","v":""},{"$f":"\"\"","v":""},"",{"$f":"\"\"","v":""},{"$f":"\"\"","v":""},"",{"$f":"\"\"","v":""},{"$f":"\"\"","v":""},"",{"$f":"\"\"","v":""},{"$f":"\"\"","v":""},"",{"$f":"\"\"","v":""},{"$f":"\"\"","v":""},"",{"$f":"\"\"","v":""},{"$f":"\"\"","v":""},""]
[null,"Total","TOTAL",{"$f":"COUNTA(D6:D46)-COUNTIF(D6:D46,\"*[BAIXA]*\")","v":41},null,null,{"$f":"SUM(G6:G46)","v":3796},1140,0.30031612223393045,{"$f":"SUM(J6:J46)","v":3796},{"$f":"SUM(K6:K46)","v":1180},0.3108535300316122,{"$f":"SUM(M6:M46)","v":0},{"$f":"SUM(N6:N46)","v":0},"",{"$f":"SUM(P6:P46)","v":0},{"$f":"SUM(Q6:Q46)","v":0},"",{"$f":"SUM(S6:S46)","v":0},{"$f":"SUM(T6:T46)","v":0},"",{"$f":"SUM(V6:V46)","v":0},{"$f":"SUM(W6:W46)","v":0},"",{"$f":"SUM(Y6:Y46)","v":0},{"$f":"SUM(Z6:Z46)","v":0},"",{"$f":"SUM(AB6:AB46)","v":0},{"$f":"SUM(AC6:AC46)","v":0},"",{"$f":"SUM(AE6:AE46)","v":0},{"$f":"SUM(AF6:AF46)","v":0},"",{"$f":"SUM(AH6:AH46)","v":0},{"$f":"SUM(AI6:AI46)","v":0},"",{"$f":"SUM(AK6:AK46)","v":0},{"$f":"SUM(AL6:AL46)","v":0},"",{"$f":"SUM(AN6:AN46)","v":0},{"$f":"SUM(AO6:AO46)","v":0},"",{"$f":"SUM(AQ6:AQ46)","v":0},{"$f":"SUM(AR6:AR46)","v":0},""]

{"sheet":"UF","index":1,"n_rows":12,"n_cols":43,"rows_kept":12,"cut":false,"hidden":false,"merged":[[1,7,1,9],[1,10,1,12],[1,13,1,15],[13,0,13,2],[0,1,1,2],[1,4,1,6],[1,16,1,18],[1,19,1,21],[1,40,1,42],[1,37,1,39],[1,34,1,36],[1,31,1,33],[1,28,1,30],[1,25,1,27],[1,22,1,24]]}
[null,{"$f":"VLOOKUP(Dados!$E$2,Dados!$B$33:$C$68,2,FALSE)","v":"JANEIRO"}]
[null,null,null,null,2017,null,null,"JANEIRO",null,null,"FEVEREIRO",null,null,"MARÇO",null,null,"ABRIL",null,null,"MAIO",null,null,"JUNHO",null,null,"JULHO",null,null,"AGOSTO",null,null,"SETEMBRO",null,null,"OUTUBRO",null,null,"NOVEMBRO",null,null,"DEZEMBRO"]
[null,"UF","Qtd. De Empresas",null,"Serviços Demandados","Serviços Atendidos","% Atendimento","Serviços Demandados","Serviços Atendidos","% Atendimento","Serviços Demandados","Serviços Atendidos","% Atendimento","Serviços Demandados","Serviços Atendidos","% Atendimento","Serviços Demandados","Serviços Atendidos","% Atendimento","Serviços Demandados","Serviços Atendidos","% Atendimento","Serviços Demandados","Serviços Atendidos","% Atendimento","Serviços Demandados","Serviços Atendidos","% Atendimento","Serviços Demandados","Serviços Atendidos","% Atendimento","Serviços Demandados","Serviços Atendidos","% Atendimento","Serviços Demandados","Serviços Atendidos","% Atendimento","Serviços Demandados","Serviços Atendidos","% Atendimento","Serviços Demandados","Serviços Atendidos","% Atendimento"]
[{"$f":"IFERROR(IF(OR(Dados!$D5=\"\",Dados!$E5=\"\"),\"\",IF(Dados!$E5>Dados!$D5,3,IF(Dados!$E5=Dados!$D5,2,1))),\"\")","v":""},"AM",{"$f":"COUNTIF(Empresas!$B$5:$B$47,UF!$B4)","v":3},{"$f":"\"\"","v":""},{"$f":"IF(Empresas!G6=\"\",\"\",SUMIF(Empresas!$B$6:$B$50,UF!$B4,Empresas!G$6:G$46))","v":20},{"$f":"IF(Empresas!H6=\"\",\"\",SUMIF(Empresas!$B$6:$B$46,UF!$B4,Empresas!H$6:H$46))","v":8},{"$f":"IFERROR(F4/E4,\"\")","v":0.4},{"$f":"IF(Empresas!J6=\"\",\"\",SUMIF(Empresas!$B$6:$B$50,UF!$B4,Empresas!J$6:J$46))","v":20},{"$f":"IF(Empresas!K6=\"\",\"\",SUMIF(Empresas!$B$6:$B$46,UF!$B4,Empresas!K$6:K$46))","v":10},{"$f":"IFERROR(I4/H4,\"\")","v":0.5},{"$f":"IF(Empresas!M6=\"\",\"\",SUMIF(Empresas!$B$6:$B$46,UF!$B4,Empresas!M$6:M$46))","v":""},{"$f":"IF(Empresas!N6=\"\",\"\",SUMIF(Empresas!$B$6:$B$46,UF!$B4,Empresas!N$6:N$46))","v":""},{"$f":"IFERROR(L4/K4,\"\")","v":""},{"$f":"IF(Empresas!P6=\"\",\"\",SUMIF(Empresas!$B$6:$B$46,UF!$B4,Empresas!P$6:P$46))","v":""},{"$f":"IF(Empresas!Q6=\"\",\"\",SUMIF(Empresas!$B$6:$B$46,UF!$B4,Empresas!Q$6:Q$46))","v":""},{"$f":"IFERROR(O4/N4,\"\")","v":""},{"$f":"IF(Empresas!S6=\"\",\"\",SUMIF(Empresas!$B$6:$B$46,UF!$B4,Empresas!S$6:S$46))","v":""},{"$f":"IF(Empresas!T6=\"\",\"\",SUMIF(Empresas!$B$6:$B$46,UF!$B4,Empresas!T$6:T$46))","v":""},{"$f":"IFERROR(R4/Q4,\"\")","v":""},{"$f":"IF(Empresas!V6=\"\",\"\",SUMIF(Empresas!$B$6:$B$46,UF!$B4,Empresas!V$6:V$46))","v":""},{"$f":"IF(Empresas!W6=\"\",\"\",SUMIF(Empresas!$B$6:$B$46,UF!$B4,Empresas!W$6:W$46))","v":""},{"$f":"IFERROR(U4/T4,\"\")","v":""},{"$f":"IF(Empresas!Y6=\"\",\"\",SUMIF(Empresas!$B$6:$B$46,UF!$B4,Empresas!Y$6:Y$46))","v":""},{"$f":"IF(Empresas!Z6=\"\",\"\",SUMIF(Empresas!$B$6:$B$46,UF!$B4,Empresas!Z$6:Z$46))","v":""},{"$f":"IFERROR(X4/W4,\"\")","v":""},{"$f":"IF(Empresas!AB6=\"\",\"\",SUMIF(Empresas!$B$6:$B$46,UF!$B4,Empresas!AB$6:AB$46))","v":""},{"$f":"IF(Empresas!AC6=\"\",\"\",SUMIF(Empresas!$B$6:$B$46,UF!$B4,Empresas!AC$6:AC$46))","v":""},{"$f":"IFERROR(AA4/Z4,\"\")","v":""},{"$f":"IF(Empresas!AE6=\"\",\"\",SUMIF(Empresas!$B$6:$B$46,UF!$B4,Empresas!AE$6:AE$46))","v":""},{"$f":"IF(Empresas!AF6=\"\",\"\",SUMIF(Empresas!$B$6:$B$46,UF!$B4,Empresas!AF$6:AF$46))","v":""},{"$f":"IFERROR(AD4/AC4,\"\")","v":""},{"$f":"IF(Empresas!AH6=\"\",\"\",SUMIF(Empresas!$B$6:$B$46,UF!$B4,Empresas!AH$6:AH$46))","v":""},{"$f":"IF(Empresas!AI6=\"\",\"\",SUMIF(Empresas!$B$6:$B$46,UF!$B4,Empresas!AI$6:AI$46))","v":""},{"$f":"IFERROR(AG4/AF4,\"\")","v":""},{"$f":"IF(Empresas!AK6=\"\",\"\",SUMIF(Empresas!$B$6:$B$46,UF!$B4,Empresas!AK$6:AK$46))","v":""},{"$f":"IF(Empresas!AL6=\"\",\"\",SUMIF(Empresas!$B$6:$B$46,UF!$B4,Empresas!AL$6:AL$46))","v":""},{"$f":"IFERROR(AJ4/AI4,\"\")","v":""},{"$f":"IF(Empresas!AN6=\"\",\"\",SUMIF(Empresas!$B$6:$B$46,UF!$B4,Empresas!AN$6:AN$46))","v":""},{"$f":"IF(Empresas!AO6=\"\",\"\",SUMIF(Empresas!$B$6:$B$46,UF!$B4,Empresas!AO$6:AO$46))","v":""},{"$f":"IFERROR(AM4/AL4,\"\")","v":""},{"$f":"IF(Empresas!AQ6=\"\",\"\",SUMIF(Empresas!$B$6:$B$46,UF!$B4,Empresas!AQ$6:AQ$46))","v":""},{"$f":"IF(Empresas!AR6=\"\",\"\",SUMIF(Empresas!$B$6:$B$46,UF!$B4,Empresas!AR$6:AR$46))","v":""},{"$f":"IFERROR(AP4/AO4,\"\")","v":""}]
[{"$f":"IFERROR(IF(OR(Dados!$D6=\"\",Dados!$E6=\"\"),\"\",IF(Dados!$E6>Dados!$D6,3,IF(Dados!$E6=Dados!$D6,2,1))),\"\")","v":""},"BA",{"$f":"COUNTIF(Empresas!$B$5:$B$47,UF!$B5)","v":5},{"$f":"\"\"","v":""},{"$f":"IF(Empresas!G7=\"\",\"\",SUMIF(Empresas!$B$6:$B$50,UF!$B5,Empresas!G$6:G$46))","v":401},{"$f":"IF(Empresas!H7=\"\",\"\",SUMIF(Empresas!$B$6:$B$46,UF!$B5,Empresas!H$6:H$46))","v":178},{"$f":"IFERROR(F5/E5,\"\")","v":0.44389027431421446},{"$f":"IF(Empresas!J7=\"\",\"\",SUMIF(Empresas!$B$6:$B$50,UF!$B5,Empresas!J$6:J$46))","v":401},{"$f":"IF(Empresas!K7=\"\",\"\",SUMIF(Empresas!$B$6:$B$46,UF!$B5,Empresas!K$6:K$46))","v":170},{"$f":"IFERROR(I5/H5,\"\")","v":0.42394014962593518},{"$f":"IF(Empresas!M7=\"\",\"\",SUMIF(Empresas!$B$6:$B$46,UF!$B5,Empresas!M$6:M$46))","v":""},{"$f":"IF(Empresas!N7=\"\",\"\",SUMIF(Empresas!$B$6:$B$46,UF!$B5,Empresas!N$6:N$46))","v":""},{"$f":"IFERROR(L5/K5,\"\")","v":""},{"$f":"IF(Empresas!P7=\"\",\"\",SUMIF(Empresas!$B$6:$B$46,UF!$B5,Empresas!P$6:P$46))","v":""},{"$f":"IF(Empresas!Q7=\"\",\"\",SUMIF(Empresas!$B$6:$B$46,UF!$B5,Empresas!Q$6:Q$46))","v":""},{"$f":"IFERROR(O5/N5,\"\")","v":""},{"$f":"IF(Empresas!S7=\"\",\"\",SUMIF(Empresas!$B$6:$B$46,UF!$B5,Empresas!S$6:S$46))","v":""},{"$f":"IF(Empresas!T7=\"\",\"\",SUMIF(Empresas!$B$6:$B$46,UF!$B5,Empresas!T$6:T$46))","v":""},"",{"$f":"IF(Empresas!V7=\"\",\"\",SUMIF(Empresas!$B$6:$B$46,UF!$B5,Empresas!V$6:V$46))","v":""},{"$f":"IF(Empresas!W7=\"\",\"\",SUMIF(Empresas!$B$6:$B$46,UF!$B5,Empresas!W$6:W$46))","v":""},"",{"$f":"IF(Empresas!Y7=\"\",\"\",SUMIF(Empresas!$B$6:$B$46,UF!$B5,Empresas!Y$6:Y$46))","v":""},{"$f":"IF(Empresas!Z7=\"\",\"\",SUMIF(Empresas!$B$6:$B$46,UF!$B5,Empresas!Z$6:Z$46))","v":""},"",{"$f":"IF(Empresas!AB7=\"\",\"\",SUMIF(Empresas!$B$6:$B$46,UF!$B5,Empresas!AB$6:AB$46))","v":""},{"$f":"IF(Empresas!AC7=\"\",\"\",SUMIF(Empresas!$B$6:$B$46,UF!$B5,Empresas!AC$6:AC$46))","v":""},"",{"$f":"IF(Empresas!AE7=\"\",\"\",SUMIF(Empresas!$B$6:$B$46,UF!$B5,Empresas!AE$6:AE$46))","v":""},{"$f":"IF(Empresas!AF7=\"\",\"\",SUMIF(Empresas!$B$6:$B$46,UF!$B5,Empresas!AF$6:AF$46))","v":""},"",{"$f":"IF(Empresas!AH7=\"\",\"\",SUMIF(Empresas!$B$6:$B$46,UF!$B5,Empresas!AH$6:AH$46))","v":""},{"$f":"IF(Empresas!AI7=\"\",\"\",SUMIF(Empresas!$B$6:$B$46,UF!$B5,Empresas!AI$6:AI$46))","v":""},"",{"$f":"IF(Empresas!AK7=\"\",\"\",SUMIF(Empresas!$B$6:$B$46,UF!$B5,Empresas!AK$6:AK$46))","v":""},{"$f":"IF(Empresas!AL7=\"\",\"\",SUMIF(Empresas!$B$6:$B$46,UF!$B5,Empresas!AL$6:AL$46))","v":""},"",{"$f":"IF(Empresas!AN7=\"\",\"\",SUMIF(Empresas!$B$6:$B$46,UF!$B5,Empresas!AN$6:AN$46))","v":""},{"$f":"IF(Empresas!AO7=\"\",\"\",SUMIF(Empresas!$B$6:$B$46,UF!$B5,Empresas!AO$6:AO$46))","v":""},"",{"$f":"IF(Empresas!AQ7=\"\",\"\",SUMIF(Empresas!$B$6:$B$46,UF!$B5,Empresas!AQ$6:AQ$46))","v":""},{"$f":"IF(Empresas!AR7=\"\",\"\",SUMIF(Empresas!$B$6:$B$46,UF!$B5,Empresas!AR$6:AR$46))","v":""},""]
[{"$f":"IFERROR(IF(OR(Dados!$D7=\"\",Dados!$E7=\"\"),\"\",IF(Dados!$E7>Dados!$D7,3,IF(Dados!$E7=Dados!$D7,2,1))),\"\")","v":""},"CE",{"$f":"COUNTIF(Empresas!$B$5:$B$47,UF!$B6)","v":4},{"$f":"\"\"","v":""},{"$f":"IF(Empresas!G8=\"\",\"\",SUMIF(Empresas!$B$6:$B$50,UF!$B6,Empresas!G$6:G$46))","v":1740},{"$f":"IF(Empresas!H8=\"\",\"\",SUMIF(Empresas!$B$6:$B$46,UF!$B6,Empresas!H$6:H$46))","v":328},0.18850574712643678,{"$f":"IF(Empresas!J8=\"\",\"\",SUMIF(Empresas!$B$6:$B$50,UF!$B6,Empresas!J$6:J$46))","v":1740},{"$f":"IF(Empresas!K8=\"\",\"\",SUMIF(Empresas!$B$6:$B$46,UF!$B6,Empresas!K$6:K$46))","v":352},0.20229885057471264,{"$f":"IF(Empresas!M8=\"\",\"\",SUMIF(Empresas!$B$6:$B$46,UF!$B6,Empresas!M$6:M$46))","v":""},{"$f":"IF(Empresas!N8=\"\",\"\",SUMIF(Empresas!$B$6:$B$46,UF!$B6,Empresas!N$6:N$46))","v":""},"",{"$f":"IF(Empresas!P8=\"\",\"\",SUMIF(Empresas!$B$6:$B$46,UF!$B6,Empresas!P$6:P$46))","v":""},{"$f":"IF(Empresas!Q8=\"\",\"\",SUMIF(Empresas!$B$6:$B$46,UF!$B6,Empresas!Q$6:Q$46))","v":""},"",{"$f":"IF(Empresas!S8=\"\",\"\",SUMIF(Empresas!$B$6:$B$46,UF!$B6,Empresas!S$6:S$46))","v":""},{"$f":"IF(Empresas!T8=\"\",\"\",SUMIF(Empresas!$B$6:$B$46,UF!$B6,Empresas!T$6:T$46))","v":""},"",{"$f":"IF(Empresas!V8=\"\",\"\",SUMIF(Empresas!$B$6:$B$46,UF!$B6,Empresas!V$6:V$46))","v":""},{"$f":"IF(Empresas!W8=\"\",\"\",SUMIF(Empresas!$B$6:$B$46,UF!$B6,Empresas!W$6:W$46))","v":""},"",{"$f":"IF(Empresas!Y8=\"\",\"\",SUMIF(Empresas!$B$6:$B$46,UF!$B6,Empresas!Y$6:Y$46))","v":""},{"$f":"IF(Empresas!Z8=\"\",\"\",SUMIF(Empresas!$B$6:$B$46,UF!$B6,Empresas!Z$6:Z$46))","v":""},"",{"$f":"IF(Empresas!AB8=\"\",\"\",SUMIF(Empresas!$B$6:$B$46,UF!$B6,Empresas!AB$6:AB$46))","v":""},{"$f":"IF(Empresas!AC8=\"\",\"\",SUMIF(Empresas!$B$6:$B$46,UF!$B6,Empresas!AC$6:AC$46))","v":""},"",{"$f":"IF(Empresas!AE8=\"\",\"\",SUMIF(Empresas!$B$6:$B$46,UF!$B6,Empresas!AE$6:AE$46))","v":""},{"$f":"IF(Empresas!AF8=\"\",\"\",SUMIF(Empresas!$B$6:$B$46,UF!$B6,Empresas!AF$6:AF$46))","v":""},"",{"$f":"IF(Empresas!AH8=\"\",\"\",SUMIF(Empresas!$B$6:$B$46,UF!$B6,Empresas!AH$6:AH$46))","v":""},{"$f":"IF(Empresas!AI8=\"\",\"\",SUMIF(Empresas!$B$6:$B$46,UF!$B6,Empresas!AI$6:AI$46))","v":""},"",{"$f":"IF(Empresas!AK8=\"\",\"\",SUMIF(Empresas!$B$6:$B$46,UF!$B6,Empresas!AK$6:AK$46))","v":""},{"$f":"IF(Empresas!AL8=\"\",\"\",SUMIF(Empresas!$B$6:$B$46,UF!$B6,Empresas!AL$6:AL$46))","v":""},"",{"$f":"IF(Empresas!AN8=\"\",\"\",SUMIF(Empresas!$B$6:$B$46,UF!$B6,Empresas!AN$6:AN$46))","v":""},{"$f":"IF(Empresas!AO8=\"\",\"\",SUMIF(Empresas!$B$6:$B$46,UF!$B6,Empresas!AO$6:AO$46))","v":""},"",{"$f":"IF(Empresas!AQ8=\"\",\"\",SUMIF(Empresas!$B$6:$B$46,UF!$B6,Empresas!AQ$6:AQ$46))","v":""},{"$f":"IF(Empresas!AR8=\"\",\"\",SUMIF(Empresas!$B$6:$B$46,UF!$B6,Empresas!AR$6:AR$46))","v":""},""]
[{"$f":"IFERROR(IF(OR(Dados!$D8=\"\",Dados!$E8=\"\"),\"\",IF(Dados!$E8>Dados!$D8,3,IF(Dados!$E8=Dados!$D8,2,1))),\"\")","v":""},"DF",{"$f":"COUNTIF(Empresas!$B$5:$B$47,UF!$B7)","v":5},{"$f":"\"\"","v":""},{"$f":"IF(Empresas!G9=\"\",\"\",SUMIF(Empresas!$B$6:$B$50,UF!$B7,Empresas!G$6:G$46))","v":358},{"$f":"IF(Empresas!H9=\"\",\"\",SUMIF(Empresas!$B$6:$B$46,UF!$B7,Empresas!H$6:H$46))","v":162},0.45251396648044695,{"$f":"IF(Empresas!J9=\"\",\"\",SUMIF(Empresas!$B$6:$B$50,UF!$B7,Empresas!J$6:J$46))","v":358},{"$f":"IF(Empresas!K9=\"\",\"\",SUMIF(Empresas!$B$6:$B$46,UF!$B7,Empresas!K$6:K$46))","v":172},0.48044692737430167,{"$f":"IF(Empresas!M9=\"\",\"\",SUMIF(Empresas!$B$6:$B$46,UF!$B7,Empresas!M$6:M$46))","v":""},{"$f":"IF(Empresas!N9=\"\",\"\",SUMIF(Empresas!$B$6:$B$46,UF!$B7,Empresas!N$6:N$46))","v":""},"",{"$f":"IF(Empresas!P9=\"\",\"\",SUMIF(Empresas!$B$6:$B$46,UF!$B7,Empresas!P$6:P$46))","v":""},{"$f":"IF(Empresas!Q9=\"\",\"\",SUMIF(Empresas!$B$6:$B$46,UF!$B7,Empresas!Q$6:Q$46))","v":""},"",{"$f":"IF(Empresas!S9=\"\",\"\",SUMIF(Empresas!$B$6:$B$46,UF!$B7,Empresas!S$6:S$46))","v":""},{"$f":"IF(Empresas!T9=\"\",\"\",SUMIF(Empresas!$B$6:$B$46,UF!$B7,Empresas!T$6:T$46))","v":""},"",{"$f":"IF(Empresas!V9=\"\",\"\",SUMIF(Empresas!$B$6:$B$46,UF!$B7,Empresas!V$6:V$46))","v":""},{"$f":"IF(Empresas!W9=\"\",\"\",SUMIF(Empresas!$B$6:$B$46,UF!$B7,Empresas!W$6:W$46))","v":""},"",{"$f":"IF(Empresas!Y9=\"\",\"\",SUMIF(Empresas!$B$6:$B$46,UF!$B7,Empresas!Y$6:Y$46))","v":""},{"$f":"IF(Empresas!Z9=\"\",\"\",SUMIF(Empresas!$B$6:$B$46,UF!$B7,Empresas!Z$6:Z$46))","v":""},"",{"$f":"IF(Empresas!AB9=\"\",\"\",SUMIF(Empresas!$B$6:$B$46,UF!$B7,Empresas!AB$6:AB$46))","v":""},{"$f":"IF(Empresas!AC9=\"\",\"\",SUMIF(Empresas!$B$6:$B$46,UF!$B7,Empresas!AC$6:AC$46))","v":""},"",{"$f":"IF(Empresas!AE9=\"\",\"\",SUMIF(Empresas!$B$6:$B$46,UF!$B7,Empresas!AE$6:AE$46))","v":""},{"$f":"IF(Empresas!AF9=\"\",\"\",SUMIF(Empresas!$B$6:$B$46,UF!$B7,Empresas!AF$6:AF$46))","v":""},"",{"$f":"IF(Empresas!AH9=\"\",\"\",SUMIF(Empresas!$B$6:$B$46,UF!$B7,Empresas!AH$6:AH$46))","v":""},{"$f":"IF(Empresas!AI9=\"\",\"\",SUMIF(Empresas!$B$6:$B$46,UF!$B7,Empresas!AI$6:AI$46))","v":""},"",{"$f":"IF(Empresas!AK9=\"\",\"\",SUMIF(Empresas!$B$6:$B$46,UF!$B7,Empresas!AK$6:AK$46))","v":""},{"$f":"IF(Empresas!AL9=\"\",\"\",SUMIF(Empresas!$B$6:$B$46,UF!$B7,Empresas!AL$6:AL$46))","v":""},"",{"$f":"IF(Empresas!AN9=\"\",\"\",SUMIF(Empresas!$B$6:$B$46,UF!$B7,Empresas!AN$6:AN$46))","v":""},{"$f":"IF(Empresas!AO9=\"\",\"\",SUMIF(Empresas!$B$6:$B$46,UF!$B7,Empresas!AO$6:AO$46))","v":""},"",{"$f":"IF(Empresas!AQ9=\"\",\"\",SUMIF(Empresas!$B$6:$B$46,UF!$B7,Empresas!AQ$6:AQ$46))","v":""},{"$f":"IF(Empresas!AR9=\"\",\"\",SUMIF(Empresas!$B$6:$B$46,UF!$B7,Empresas!AR$6:AR$46))","v":""},""]
[{"$f":"IFERROR(IF(OR(Dados!$D9=\"\",Dados!$E9=\"\"),\"\",IF(Dados!$E9>Dados!$D9,3,IF(Dados!$E9=Dados!$D9,2,1))),\"\")","v":""},"GO",{"$f":"COUNTIF(Empresas!$B$5:$B$47,UF!$B8)","v":5},{"$f":"\"\"","v":""},{"$f":"IF(Empresas!G10=\"\",\"\",SUMIF(Empresas!$B$6:$B$50,UF!$B8,Empresas!G$6:G$46))","v":462},{"$f":"IF(Empresas!H10=\"\",\"\",SUMIF(Empresas!$B$6:$B$46,UF!$B8,Empresas!H$6:H$46))","v":210},0.45454545454545453,{"$f":"IF(Empresas!J10=\"\",\"\",SUMIF(Empresas!$B$6:$B$50,UF!$B8,Empresas!J$6:J$46))","v":462},{"$f":"IF(Empresas!K10=\"\",\"\",SUMIF(Empresas!$B$6:$B$46,UF!$B8,Empresas!K$6:K$46))","v":207},0.44805194805194803,{"$f":"IF(Empresas!M10=\"\",\"\",SUMIF(Empresas!$B$6:$B$46,UF!$B8,Empresas!M$6:M$46))","v":""},{"$f":"IF(Empresas!N10=\"\",\"\",SUMIF(Empresas!$B$6:$B$46,UF!$B8,Empresas!N$6:N$46))","v":""},"",{"$f":"IF(Empresas!P10=\"\",\"\",SUMIF(Empresas!$B$6:$B$46,UF!$B8,Empresas!P$6:P$46))","v":""},{"$f":"IF(Empresas!Q10=\"\",\"\",SUMIF(Empresas!$B$6:$B$46,UF!$B8,Empresas!Q$6:Q$46))","v":""},"",{"$f":"IF(Empresas!S10=\"\",\"\",SUMIF(Empresas!$B$6:$B$46,UF!$B8,Empresas!S$6:S$46))","v":""},{"$f":"IF(Empresas!T10=\"\",\"\",SUMIF(Empresas!$B$6:$B$46,UF!$B8,Empresas!T$6:T$46))","v":""},"",{"$f":"IF(Empresas!V10=\"\",\"\",SUMIF(Empresas!$B$6:$B$46,UF!$B8,Empresas!V$6:V$46))","v":""},{"$f":"IF(Empresas!W10=\"\",\"\",SUMIF(Empresas!$B$6:$B$46,UF!$B8,Empresas!W$6:W$46))","v":""},"",{"$f":"IF(Empresas!Y10=\"\",\"\",SUMIF(Empresas!$B$6:$B$46,UF!$B8,Empresas!Y$6:Y$46))","v":""},{"$f":"IF(Empresas!Z10=\"\",\"\",SUMIF(Empresas!$B$6:$B$46,UF!$B8,Empresas!Z$6:Z$46))","v":""},"",{"$f":"IF(Empresas!AB10=\"\",\"\",SUMIF(Empresas!$B$6:$B$46,UF!$B8,Empresas!AB$6:AB$46))","v":""},{"$f":"IF(Empresas!AC10=\"\",\"\",SUMIF(Empresas!$B$6:$B$46,UF!$B8,Empresas!AC$6:AC$46))","v":""},"",{"$f":"IF(Empresas!AE10=\"\",\"\",SUMIF(Empresas!$B$6:$B$46,UF!$B8,Empresas!AE$6:AE$46))","v":""},{"$f":"IF(Empresas!AF10=\"\",\"\",SUMIF(Empresas!$B$6:$B$46,UF!$B8,Empresas!AF$6:AF$46))","v":""},"",{"$f":"IF(Empresas!AH10=\"\",\"\",SUMIF(Empresas!$B$6:$B$46,UF!$B8,Empresas!AH$6:AH$46))","v":""},{"$f":"IF(Empresas!AI10=\"\",\"\",SUMIF(Empresas!$B$6:$B$46,UF!$B8,Empresas!AI$6:AI$46))","v":""},"",{"$f":"IF(Empresas!AK10=\"\",\"\",SUMIF(Empresas!$B$6:$B$46,UF!$B8,Empresas!AK$6:AK$46))","v":""},{"$f":"IF(Empresas!AL10=\"\",\"\",SUMIF(Empresas!$B$6:$B$46,UF!$B8,Empresas!AL$6:AL$46))","v":""},"",{"$f":"IF(Empresas!AN10=\"\",\"\",SUMIF(Empresas!$B$6:$B$46,UF!$B8,Empresas!AN$6:AN$46))","v":""},{"$f":"IF(Empresas!AO10=\"\",\"\",SUMIF(Empresas!$B$6:$B$46,UF!$B8,Empresas!AO$6:AO$46))","v":""},"",{"$f":"IF(Empresas!AQ10=\"\",\"\",SUMIF(Empresas!$B$6:$B$46,UF!$B8,Empresas!AQ$6:AQ$46))","v":""},{"$f":"IF(Empresas!AR10=\"\",\"\",SUMIF(Empresas!$B$6:$B$46,UF!$B8,Empresas!AR$6:AR$46))","v":""},""]
[{"$f":"IFERROR(IF(OR(Dados!$D10=\"\",Dados!$E10=\"\"),\"\",IF(Dados!$E10>Dados!$D10,3,IF(Dados!$E10=Dados!$D10,2,1))),\"\")","v":""},"MA",{"$f":"COUNTIF(Empresas!$B$5:$B$47,UF!$B9)","v":5},{"$f":"\"\"","v":""},{"$f":"IF(Empresas!G11=\"\",\"\",SUMIF(Empresas!$B$6:$B$50,UF!$B9,Empresas!G$6:G$46))","v":282},{"$f":"IF(Empresas!H11=\"\",\"\",SUMIF(Empresas!$B$6:$B$46,UF!$B9,Empresas!H$6:H$46))","v":59},0.20921985815602837,{"$f":"IF(Empresas!J11=\"\",\"\",SUMIF(Empresas!$B$6:$B$50,UF!$B9,Empresas!J$6:J$46))","v":282},{"$f":"IF(Empresas!K11=\"\",\"\",SUMIF(Empresas!$B$6:$B$46,UF!$B9,Empresas!K$6:K$46))","v":67},0.23758865248226951,{"$f":"IF(Empresas!M11=\"\",\"\",SUMIF(Empresas!$B$6:$B$46,UF!$B9,Empresas!M$6:M$46))","v":""},{"$f":"IF(Empresas!N11=\"\",\"\",SUMIF(Empresas!$B$6:$B$46,UF!$B9,Empresas!N$6:N$46))","v":""},"",{"$f":"IF(Empresas!P11=\"\",\"\",SUMIF(Empresas!$B$6:$B$46,UF!$B9,Empresas!P$6:P$46))","v":""},{"$f":"IF(Empresas!Q11=\"\",\"\",SUMIF(Empresas!$B$6:$B$46,UF!$B9,Empresas!Q$6:Q$46))","v":""},"",{"$f":"IF(Empresas!S11=\"\",\"\",SUMIF(Empresas!$B$6:$B$46,UF!$B9,Empresas!S$6:S$46))","v":""},{"$f":"IF(Empresas!T11=\"\",\"\",SUMIF(Empresas!$B$6:$B$46,UF!$B9,Empresas!T$6:T$46))","v":""},"",{"$f":"IF(Empresas!V11=\"\",\"\",SUMIF(Empresas!$B$6:$B$46,UF!$B9,Empresas!V$6:V$46))","v":""},{"$f":"IF(Empresas!W11=\"\",\"\",SUMIF(Empresas!$B$6:$B$46,UF!$B9,Empresas!W$6:W$46))","v":""},"",{"$f":"IF(Empresas!Y11=\"\",\"\",SUMIF(Empresas!$B$6:$B$46,UF!$B9,Empresas!Y$6:Y$46))","v":""},{"$f":"IF(Empresas!Z11=\"\",\"\",SUMIF(Empresas!$B$6:$B$46,UF!$B9,Empresas!Z$6:Z$46))","v":""},"",{"$f":"IF(Empresas!AB11=\"\",\"\",SUMIF(Empresas!$B$6:$B$46,UF!$B9,Empresas!AB$6:AB$46))","v":""},{"$f":"IF(Empresas!AC11=\"\",\"\",SUMIF(Empresas!$B$6:$B$46,UF!$B9,Empresas!AC$6:AC$46))","v":""},"",{"$f":"IF(Empresas!AE11=\"\",\"\",SUMIF(Empresas!$B$6:$B$46,UF!$B9,Empresas!AE$6:AE$46))","v":""},{"$f":"IF(Empresas!AF11=\"\",\"\",SUMIF(Empresas!$B$6:$B$46,UF!$B9,Empresas!AF$6:AF$46))","v":""},"",{"$f":"IF(Empresas!AH11=\"\",\"\",SUMIF(Empresas!$B$6:$B$46,UF!$B9,Empresas!AH$6:AH$46))","v":""},{"$f":"IF(Empresas!AI11=\"\",\"\",SUMIF(Empresas!$B$6:$B$46,UF!$B9,Empresas!AI$6:AI$46))","v":""},"",{"$f":"IF(Empresas!AK11=\"\",\"\",SUMIF(Empresas!$B$6:$B$46,UF!$B9,Empresas!AK$6:AK$46))","v":""},{"$f":"IF(Empresas!AL11=\"\",\"\",SUMIF(Empresas!$B$6:$B$46,UF!$B9,Empresas!AL$6:AL$46))","v":""},"",{"$f":"IF(Empresas!AN11=\"\",\"\",SUMIF(Empresas!$B$6:$B$46,UF!$B9,Empresas!AN$6:AN$46))","v":""},{"$f":"IF(Empresas!AO11=\"\",\"\",SUMIF(Empresas!$B$6:$B$46,UF!$B9,Empresas!AO$6:AO$46))","v":""},"",{"$f":"IF(Empresas!AQ11=\"\",\"\",SUMIF(Empresas!$B$6:$B$46,UF!$B9,Empresas!AQ$6:AQ$46))","v":""},{"$f":"IF(Empresas!AR11=\"\",\"\",SUMIF(Empresas!$B$6:$B$46,UF!$B9,Empresas!AR$6:AR$46))","v":""},""]
[{"$f":"IFERROR(IF(OR(Dados!$D11=\"\",Dados!$E11=\"\"),\"\",IF(Dados!$E11>Dados!$D11,3,IF(Dados!$E11=Dados!$D11,2,1))),\"\")","v":""},"MT",{"$f":"COUNTIF(Empresas!$B$5:$B$47,UF!$B10)","v":5},{"$f":"\"\"","v":""},{"$f":"IF(Empresas!G12=\"\",\"\",SUMIF(Empresas!$B$6:$B$50,UF!$B10,Empresas!G$6:G$46))","v":144},{"$f":"IF(Empresas!H12=\"\",\"\",SUMIF(Empresas!$B$6:$B$46,UF!$B10,Empresas!H$6:H$46))","v":44},{"$f":"IFERROR(F10/E10,\"\")","v":0.30555555555555558},{"$f":"IF(Empresas!J12=\"\",\"\",SUMIF(Empresas!$B$6:$B$50,UF!$B10,Empresas!J$6:J$46))","v":144},{"$f":"IF(Empresas!K12=\"\",\"\",SUMIF(Empresas!$B$6:$B$46,UF!$B10,Empresas!K$6:K$46))","v":43},{"$f":"IFERROR(I10/H10,\"\")","v":0.2986111111111111},{"$f":"IF(Empresas!M12=\"\",\"\",SUMIF(Empresas!$B$6:$B$46,UF!$B10,Empresas!M$6:M$46))","v":""},{"$f":"IF(Empresas!N12=\"\",\"\",SUMIF(Empresas!$B$6:$B$46,UF!$B10,Empresas!N$6:N$46))","v":""},{"$f":"IFERROR(L10/K10,\"\")","v":""},{"$f":"IF(Empresas!P12=\"\",\"\",SUMIF(Empresas!$B$6:$B$46,UF!$B10,Empresas!P$6:P$46))","v":""},{"$f":"IF(Empresas!Q12=\"\",\"\",SUMIF(Empresas!$B$6:$B$46,UF!$B10,Empresas!Q$6:Q$46))","v":""},{"$f":"IFERROR(O10/N10,\"\")","v":""},{"$f":"IF(Empresas!S12=\"\",\"\",SUMIF(Empresas!$B$6:$B$46,UF!$B10,Empresas!S$6:S$46))","v":""},{"$f":"IF(Empresas!T12=\"\",\"\",SUMIF(Empresas!$B$6:$B$46,UF!$B10,Empresas!T$6:T$46))","v":""},{"$f":"IFERROR(R10/Q10,\"\")","v":""},{"$f":"IF(Empresas!V12=\"\",\"\",SUMIF(Empresas!$B$6:$B$46,UF!$B10,Empresas!V$6:V$46))","v":""},{"$f":"IF(Empresas!W12=\"\",\"\",SUMIF(Empresas!$B$6:$B$46,UF!$B10,Empresas!W$6:W$46))","v":""},{"$f":"IFERROR(U10/T10,\"\")","v":""},{"$f":"IF(Empresas!Y12=\"\",\"\",SUMIF(Empresas!$B$6:$B$46,UF!$B10,Empresas!Y$6:Y$46))","v":""},{"$f":"IF(Empresas!Z12=\"\",\"\",SUMIF(Empresas!$B$6:$B$46,UF!$B10,Empresas!Z$6:Z$46))","v":""},{"$f":"IFERROR(X10/W10,\"\")","v":""},{"$f":"IF(Empresas!AB12=\"\",\"\",SUMIF(Empresas!$B$6:$B$46,UF!$B10,Empresas!AB$6:AB$46))","v":""},{"$f":"IF(Empresas!AC12=\"\",\"\",SUMIF(Empresas!$B$6:$B$46,UF!$B10,Empresas!AC$6:AC$46))","v":""},{"$f":"IFERROR(AA10/Z10,\"\")","v":""},{"$f":"IF(Empresas!AE12=\"\",\"\",SUMIF(Empresas!$B$6:$B$46,UF!$B10,Empresas!AE$6:AE$46))","v":""},{"$f":"IF(Empresas!AF12=\"\",\"\",SUMIF(Empresas!$B$6:$B$46,UF!$B10,Empresas!AF$6:AF$46))","v":""},{"$f":"IFERROR(AD10/AC10,\"\")","v":""},{"$f":"IF(Empresas!AH12=\"\",\"\",SUMIF(Empresas!$B$6:$B$46,UF!$B10,Empresas!AH$6:AH$46))","v":""},{"$f":"IF(Empresas!AI12=\"\",\"\",SUMIF(Empresas!$B$6:$B$46,UF!$B10,Empresas!AI$6:AI$46))","v":""},{"$f":"IFERROR(AG10/AF10,\"\")","v":""},{"$f":"IF(Empresas!AK12=\"\",\"\",SUMIF(Empresas!$B$6:$B$46,UF!$B10,Empresas!AK$6:AK$46))","v":""},{"$f":"IF(Empresas!AL12=\"\",\"\",SUMIF(Empresas!$B$6:$B$46,UF!$B10,Empresas!AL$6:AL$46))","v":""},{"$f":"IFERROR(AJ10/AI10,\"\")","v":""},{"$f":"IF(Empresas!AN12=\"\",\"\",SUMIF(Empresas!$B$6:$B$46,UF!$B10,Empresas!AN$6:AN$46))","v":""},{"$f":"IF(Empresas!AO12=\"\",\"\",SUMIF(Empresas!$B$6:$B$46,UF!$B10,Empresas!AO$6:AO$46))","v":""},{"$f":"IFERROR(AM10/AL10,\"\")","v":""},{"$f":"IF(Empresas!AQ12=\"\",\"\",SUMIF(Empresas!$B$6:$B$46,UF!$B10,Empresas!AQ$6:AQ$46))","v":""},{"$f":"IF(Empresas!AR12=\"\",\"\",SUMIF(Empresas!$B$6:$B$46,UF!$B10,Empresas!AR$6:AR$46))","v":""},{"$f":"IFERROR(AP10/AO10,\"\")","v":""}]
[{"$f":"IFERROR(IF(OR(Dados!$D12=\"\",Dados!$E12=\"\"),\"\",IF(Dados!$E12>Dados!$D12,3,IF(Dados!$E12=Dados!$D12,2,1))),\"\")","v":""},"MS",{"$f":"COUNTIF(Empresas!$B$5:$B$47,UF!$B11)","v":5},{"$f":"\"\"","v":""},{"$f":"IF(Empresas!G13=\"\",\"\",SUMIF(Empresas!$B$6:$B$50,UF!$B11,Empresas!G$6:G$46))","v":255},{"$f":"IF(Empresas!H13=\"\",\"\",SUMIF(Empresas!$B$6:$B$46,UF!$B11,Empresas!H$6:H$46))","v":111},0.43529411764705883,{"$f":"IF(Empresas!J13=\"\",\"\",SUMIF(Empresas!$B$6:$B$50,UF!$B11,Empresas!J$6:J$46))","v":255},{"$f":"IF(Empresas!K13=\"\",\"\",SUMIF(Empresas!$B$6:$B$46,UF!$B11,Empresas!K$6:K$46))","v":112},0.4392156862745098,{"$f":"IF(Empresas!M13=\"\",\"\",SUMIF(Empresas!$B$6:$B$46,UF!$B11,Empresas!M$6:M$46))","v":""},{"$f":"IF(Empresas!N13=\"\",\"\",SUMIF(Empresas!$B$6:$B$46,UF!$B11,Empresas!N$6:N$46))","v":""},"",{"$f":"IF(Empresas!P13=\"\",\"\",SUMIF(Empresas!$B$6:$B$46,UF!$B11,Empresas!P$6:P$46))","v":""},{"$f":"IF(Empresas!Q13=\"\",\"\",SUMIF(Empresas!$B$6:$B$46,UF!$B11,Empresas!Q$6:Q$46))","v":""},"",{"$f":"IF(Empresas!S13=\"\",\"\",SUMIF(Empresas!$B$6:$B$46,UF!$B11,Empresas!S$6:S$46))","v":""},{"$f":"IF(Empresas!T13=\"\",\"\",SUMIF(Empresas!$B$6:$B$46,UF!$B11,Empresas!T$6:T$46))","v":""},"",{"$f":"IF(Empresas!V13=\"\",\"\",SUMIF(Empresas!$B$6:$B$46,UF!$B11,Empresas!V$6:V$46))","v":""},{"$f":"IF(Empresas!W13=\"\",\"\",SUMIF(Empresas!$B$6:$B$46,UF!$B11,Empresas!W$6:W$46))","v":""},"",{"$f":"IF(Empresas!Y13=\"\",\"\",SUMIF(Empresas!$B$6:$B$46,UF!$B11,Empresas!Y$6:Y$46))","v":""},{"$f":"IF(Empresas!Z13=\"\",\"\",SUMIF(Empresas!$B$6:$B$46,UF!$B11,Empresas!Z$6:Z$46))","v":""},"",{"$f":"IF(Empresas!AB13=\"\",\"\",SUMIF(Empresas!$B$6:$B$46,UF!$B11,Empresas!AB$6:AB$46))","v":""},{"$f":"IF(Empresas!AC13=\"\",\"\",SUMIF(Empresas!$B$6:$B$46,UF!$B11,Empresas!AC$6:AC$46))","v":""},"",{"$f":"IF(Empresas!AE13=\"\",\"\",SUMIF(Empresas!$B$6:$B$46,UF!$B11,Empresas!AE$6:AE$46))","v":""},{"$f":"IF(Empresas!AF13=\"\",\"\",SUMIF(Empresas!$B$6:$B$46,UF!$B11,Empresas!AF$6:AF$46))","v":""},"",{"$f":"IF(Empresas!AH13=\"\",\"\",SUMIF(Empresas!$B$6:$B$46,UF!$B11,Empresas!AH$6:AH$46))","v":""},{"$f":"IF(Empresas!AI13=\"\",\"\",SUMIF(Empresas!$B$6:$B$46,UF!$B11,Empresas!AI$6:AI$46))","v":""},"",{"$f":"IF(Empresas!AK13=\"\",\"\",SUMIF(Empresas!$B$6:$B$46,UF!$B11,Empresas!AK$6:AK$46))","v":""},{"$f":"IF(Empresas!AL13=\"\",\"\",SUMIF(Empresas!$B$6:$B$46,UF!$B11,Empresas!AL$6:AL$46))","v":""},"",{"$f":"IF(Empresas!AN13=\"\",\"\",SUMIF(Empresas!$B$6:$B$46,UF!$B11,Empresas!AN$6:AN$46))","v":""},{"$f":"IF(Empresas!AO13=\"\",\"\",SUMIF(Empresas!$B$6:$B$46,UF!$B11,Empresas!AO$6:AO$46))","v":""},"",{"$f":"IF(Empresas!AQ13=\"\",\"\",SUMIF(Empresas!$B$6:$B$46,UF!$B11,Empresas!AQ$6:AQ$46))","v":""},{"$f":"IF(Empresas!AR13=\"\",\"\",SUMIF(Empresas!$B$6:$B$46,UF!$B11,Empresas!AR$6:AR$46))","v":""},""]
[{"$f":"IFERROR(IF(OR(Dados!$D13=\"\",Dados!$E13=\"\"),\"\",IF(Dados!$E13>Dados!$D13,3,IF(Dados!$E13=Dados!$D13,2,1))),\"\")","v":""},"MG",{"$f":"COUNTIF(Empresas!$B$5:$B$47,UF!$B12)","v":4},{"$f":"\"\"","v":""},{"$f":"IF(Empresas!G14=\"\",\"\",SUMIF(Empresas!$B$6:$B$50,UF!$B12,Empresas!G$6:G$46))","v":134},{"$f":"IF(Empresas!H14=\"\",\"\",SUMIF(Empresas!$B$6:$B$46,UF!$B12,Empresas!H$6:H$46))","v":40},0.29850746268656714,{"$f":"IF(Empresas!J14=\"\",\"\",SUMIF(Empresas!$B$6:$B$50,UF!$B12,Empresas!J$6:J$46))","v":134},{"$f":"IF(Empresas!K14=\"\",\"\",SUMIF(Empresas!$B$6:$B$46,UF!$B12,Empresas!K$6:K$46))","v":47},0.35074626865671643,{"$f":"IF(Empresas!M14=\"\",\"\",SUMIF(Empresas!$B$6:$B$46,UF!$B12,Empresas!M$6:M$46))","v":""},{"$f":"IF(Empresas!N14=\"\",\"\",SUMIF(Empresas!$B$6:$B$46,UF!$B12,Empresas!N$6:N$46))","v":""},"",{"$f":"IF(Empresas!P14=\"\",\"\",SUMIF(Empresas!$B$6:$B$46,UF!$B12,Empresas!P$6:P$46))","v":""},{"$f":"IF(Empresas!Q14=\"\",\"\",SUMIF(Empresas!$B$6:$B$46,UF!$B12,Empresas!Q$6:Q$46))","v":""},"",{"$f":"IF(Empresas!S14=\"\",\"\",SUMIF(Empresas!$B$6:$B$46,UF!$B12,Empresas!S$6:S$46))","v":""},{"$f":"IF(Empresas!T14=\"\",\"\",SUMIF(Empresas!$B$6:$B$46,UF!$B12,Empresas!T$6:T$46))","v":""},"",{"$f":"IF(Empresas!V14=\"\",\"\",SUMIF(Empresas!$B$6:$B$46,UF!$B12,Empresas!V$6:V$46))","v":""},{"$f":"IF(Empresas!W14=\"\",\"\",SUMIF(Empresas!$B$6:$B$46,UF!$B12,Empresas!W$6:W$46))","v":""},"",{"$f":"IF(Empresas!Y14=\"\",\"\",SUMIF(Empresas!$B$6:$B$46,UF!$B12,Empresas!Y$6:Y$46))","v":""},{"$f":"IF(Empresas!Z14=\"\",\"\",SUMIF(Empresas!$B$6:$B$46,UF!$B12,Empresas!Z$6:Z$46))","v":""},"",{"$f":"IF(Empresas!AB14=\"\",\"\",SUMIF(Empresas!$B$6:$B$46,UF!$B12,Empresas!AB$6:AB$46))","v":""},{"$f":"IF(Empresas!AC14=\"\",\"\",SUMIF(Empresas!$B$6:$B$46,UF!$B12,Empresas!AC$6:AC$46))","v":""},"",{"$f":"IF(Empresas!AE14=\"\",\"\",SUMIF(Empresas!$B$6:$B$46,UF!$B12,Empresas!AE$6:AE$46))","v":""},{"$f":"IF(Empresas!AF14=\"\",\"\",SUMIF(Empresas!$B$6:$B$46,UF!$B12,Empresas!AF$6:AF$46))","v":""},"",{"$f":"IF(Empresas!AH14=\"\",\"\",SUMIF(Empresas!$B$6:$B$46,UF!$B12,Empresas!AH$6:AH$46))","v":""},{"$f":"IF(Empresas!AI14=\"\",\"\",SUMIF(Empresas!$B$6:$B$46,UF!$B12,Empresas!AI$6:AI$46))","v":""},"",{"$f":"IF(Empresas!AK14=\"\",\"\",SUMIF(Empresas!$B$6:$B$46,UF!$B12,Empresas!AK$6:AK$46))","v":""},{"$f":"IF(Empresas!AL14=\"\",\"\",SUMIF(Empresas!$B$6:$B$46,UF!$B12,Empresas!AL$6:AL$46))","v":""},"",{"$f":"IF(Empresas!AN14=\"\",\"\",SUMIF(Empresas!$B$6:$B$46,UF!$B12,Empresas!AN$6:AN$46))","v":""},{"$f":"IF(Empresas!AO14=\"\",\"\",SUMIF(Empresas!$B$6:$B$46,UF!$B12,Empresas!AO$6:AO$46))","v":""},"",{"$f":"IF(Empresas!AQ14=\"\",\"\",SUMIF(Empresas!$B$6:$B$46,UF!$B12,Empresas!AQ$6:AQ$46))","v":""},{"$f":"IF(Empresas!AR14=\"\",\"\",SUMIF(Empresas!$B$6:$B$46,UF!$B12,Empresas!AR$6:AR$46))","v":""},""]

{"sheet":"Dados","index":2,"n_rows":135,"n_cols":52,"rows_kept":135,"cut":false,"hidden":false,"merged":[[2,7,2,18],[2,21,2,32],[2,36,2,47]]}
[]
[null,null,{"$f":"MID(CELL(\"nome.arquivo\",UF!A1),FIND(\"]\",CELL(\"nome.arquivo\",UF!A1))+1,LEN(CELL(\"nome.arquivo\",UF!A1)))&\"!\"","v":"UF!"},"COL",7]
[null,null,null,"LIN",12,null,null,"% Atendimento",null,null,null,null,null,null,null,null,null,null,null,null,null,"Qtd. De Serviços Demandados",null,null,null,null,null,null,null,null,null,null,null,null,null,null,"Qtd. De Serviços Demandados",null,null,null,null,null,null,null,null,null,null,null,null,"Estado",{"$f":"Dados!AK35","v":0},{"$f":"Dados!BM68","v":0}]
[null,null,null,null,null,null,"Estado",{"$f":"UF!$H$2","v":"JANEIRO"},{"$f":"UF!$K$2","v":"FEVEREIRO"},{"$f":"UF!$N$2","v":"MARÇO"},{"$f":"UF!$Q$2","v":"ABRIL"},{"$f":"UF!$T$2","v":"MAIO"},{"$f":"UF!$W$2","v":"JUNHO"},{"$f":"UF!$Z$2","v":"JULHO"},{"$f":"UF!$AC$2","v":"AGOSTO"},{"$f":"UF!$AF$2","v":"SETEMBRO"},{"$f":"UF!$AI$2","v":"OUTUBRO"},{"$f":"UF!$AL$2","v":"NOVEMBRO"},{"$f":"UF!$AO$2","v":"DEZEMBRO"},null,"Estado",{"$f":"UF!$H$2","v":"JANEIRO"},{"$f":"UF!$K$2","v":"FEVEREIRO"},{"$f":"UF!$N$2","v":"MARÇO"},{"$f":"UF!$Q$2","v":"ABRIL"},{"$f":"UF!$T$2","v":"MAIO"},{"$f":"UF!$W$2","v":"JUNHO"},{"$f":"UF!$Z$2","v":"JULHO"},{"$f":"UF!$AC$2","v":"AGOSTO"},{"$f":"UF!$AF$2","v":"SETEMBRO"},{"$f":"UF!$AI$2","v":"OUTUBRO"},{"$f":"UF!$AL$2","v":"NOVEMBRO"},{"$f":"UF!$AO$2","v":"DEZEMBRO"},null,null,"Estado",{"$f":"UF!$H$2","v":"JANEIRO"},{"$f":"UF!$K$2","v":"FEVEREIRO"},{"$f":"UF!$N$2","v":"MARÇO"},{"$f":"UF!$Q$2","v":"ABRIL"},{"$f":"UF!$T$2","v":"MAIO"},{"$f":"UF!$W$2","v":"JUNHO"},{"$f":"UF!$Z$2","v":"JULHO"},{"$f":"UF!$AC$2","v":"AGOSTO"},{"$f":"UF!$AF$2","v":"SETEMBRO"},{"$f":"UF!$AI$2","v":"OUTUBRO"},{"$f":"UF!$AL$2","v":"NOVEMBRO"},{"$f":"UF!$AO$2","v":"DEZEMBRO"},null,{"$f":"UF!$H$2","v":"JANEIRO"},{"$f":"INDEX(Dados!$H$72:$P$83,ROW(AX4)-5,periodo)","v":{"$error":"#VALUE!"}},{"$f":"Dados!BM69","v":0}]
[null,{"$f":"IF(OR($D5=\"\",$E5=\"\"),\"\",IF($E5>$D5,3,IF($E5=$D5,2,1)))","v":""},4,{"$f":"INDIRECT($C$2&ADDRESS($C5,$E$2-3))","v":""},{"$f":"INDIRECT($C$2&ADDRESS($C5,$E$2))","v":0.4},null,"AM",{"$f":"IF(UF!$J$4=\"\",#N/A,UF!$J$4)","v":0.5},{"$f":"IF(UF!$M$4=\"\",#N/A,UF!$M$4)","v":{"$error":"#N/A"}},{"$f":"IF(UF!$P$4=\"\",#N/A,UF!$P$4)","v":{"$error":"#N/A"}},{"$f":"IF(UF!$S$4=\"\",#N/A,UF!$S$4)","v":{"$error":"#N/A"}},{"$f":"IF(UF!$V$4=\"\",#N/A,UF!$V$4)","v":{"$error":"#N/A"}},{"$f":"IF(UF!$Y$4=\"\",#N/A,UF!$Y$4)","v":{"$error":"#N/A"}},{"$f":"IF(UF!$AB$4=\"\",#N/A,UF!$AB$4)","v":{"$error":"#N/A"}},{"$f":"IF(UF!$AE$4=\"\",#N/A,UF!$AE$4)","v":{"$error":"#N/A"}},{"$f":"IF(UF!$AH$4=\"\",#N/A,UF!$AH$4)","v":{"$error":"#N/A"}},{"$f":"IF(UF!$AK$4=\"\",#N/A,UF!$AK$4)","v":{"$error":"#N/A"}},{"$f":"IF(UF!$AN$4=\"\",#N/A,UF!$AN$4)","v":{"$error":"#N/A"}},{"$f":"IF(UF!$AQ$4=\"\",#N/A,UF!$AQ$4)","v":{"$error":"#N/A"}},null,"AM",{"$f":"IF(UF!H4=\"\",#N/A,UF!H4)","v":20},{"$f":"IF(UF!K4=\"\",#N/A,UF!K4)","v":{"$error":"#N/A"}},{"$f":"IF(UF!N4=\"\",#N/A,UF!N4)","v":{"$error":"#N/A"}},{"$f":"IF(UF!Q4=\"\",#N/A,UF!Q4)","v":{"$error":"#N/A"}},{"$f":"IF(UF!T4=\"\",#N/A,UF!T4)","v":{"$error":"#N/A"}},{"$f":"IF(UF!W4=\"\",#N/A,UF!W4)","v":{"$error":"#N/A"}},{"$f":"IF(UF!Z4=\"\",#N/A,UF!Z4)","v":{"$error":"#N/A"}},{"$f":"IF(UF!AC4=\"\",#N/A,UF!AC4)","v":{"$error":"#N/A"}},{"$f":"IF(UF!AF4=\"\",#N/A,UF!AF4)","v":{"$error":"#N/A"}},{"$f":"IF(UF!AI4=\"\",#N/A,UF!AI4)","v":{"$error":"#N/A"}},{"$f":"IF(UF!AL4=\"\",#N/A,UF!AL4)","v":{"$error":"#N/A"}},{"$f":"IF(UF!AO4=\"\",#N/A,UF!AO4)","v":{"$error":"#N/A"}},null,null,"AM",{"$f":"IF(UF!I4=\"\",#N/A,UF!I4)","v":10},{"$f":"IF(UF!L4=\"\",#N/A,UF!L4)","v":{"$error":"#N/A"}},{"$f":"IF(UF!O4=\"\",#N/A,UF!O4)","v":{"$error":"#N/A"}},{"$f":"IF(UF!R4=\"\",#N/A,UF!R4)","v":{"$error":"#N/A"}},{"$f":"IF(UF!U4=\"\",#N/A,UF!U4)","v":{"$error":"#N/A"}},{"$f":"IF(UF!X4=\"\",#N/A,UF!X4)","v":{"$error":"#N/A"}},{"$f":"IF(UF!AA4=\"\",#N/A,UF!AA4)","v":{"$error":"#N/A"}},{"$f":"IF(UF!AD4=\"\",#N/A,UF!AD4)","v":{"$error":"#N/A"}},{"$f":"IF(UF!AG4=\"\",#N/A,UF!AG4)","v":{"$error":"#N/A"}},{"$f":"IF(UF!AJ4=\"\",#N/A,UF!AJ4)","v":{"$error":"#N/A"}},{"$f":"IF(UF!AM4=\"\",#N/A,UF!AM4)","v":{"$error":"#N/A"}},{"$f":"IF(UF!AP4=\"\",#N/A,UF!AP4)","v":{"$error":"#N/A"}},null,{"$f":"UF!$K$2","v":"FEVEREIRO"},{"$f":"INDEX(Dados!$H$72:$P$83,ROW(AX5)-5,periodo)","v":{"$error":"#VALUE!"}},{"$f":"Dados!AU70","v":0}]
[null,{"$f":"IF(OR($D6=\"\",$E6=\"\"),\"\",IF($E6>$D6,3,IF($E6=$D6,2,1)))","v":""},5,"",0.44389027431421446,null,"BA",{"$f":"IF(UF!$J$5=\"\",#N/A,UF!$J$5)","v":0.42394014962593518},{"$f":"IF(UF!$M$5=\"\",#N/A,UF!$M$5)","v":{"$error":"#N/A"}},{"$f":"IF(UF!$P$5=\"\",#N/A,UF!$P$5)","v":{"$error":"#N/A"}},{"$f":"IF(UF!$S$5=\"\",#N/A,UF!$S$5)","v":{"$error":"#N/A"}},{"$f":"IF(UF!$V$5=\"\",#N/A,UF!$V$5)","v":{"$error":"#N/A"}},{"$f":"IF(UF!$Y$5=\"\",#N/A,UF!$Y$5)","v":{"$error":"#N/A"}},{"$f":"IF(UF!$AB$5=\"\",#N/A,UF!$AB$5)","v":{"$error":"#N/A"}},{"$f":"IF(UF!$AE$5=\"\",#N/A,UF!$AE$5)","v":{"$error":"#N/A"}},{"$f":"IF(UF!$AH$5=\"\",#N/A,UF!$AH$5)","v":{"$error":"#N/A"}},{"$f":"IF(UF!$AK$5=\"\",#N/A,UF!$AK$5)","v":{"$error":"#N/A"}},{"$f":"IF(UF!$AN$5=\"\",#N/A,UF!$AN$5)","v":{"$error":"#N/A"}},{"$f":"IF(UF!$AQ$5=\"\",#N/A,UF!$AQ$5)","v":{"$error":"#N/A"}},null,"BA",{"$f":"IF(UF!H5=\"\",#N/A,UF!H5)","v":401},{"$f":"IF(UF!K5=\"\",#N/A,UF!K5)","v":{"$error":"#N/A"}},{"$f":"IF(UF!$N5=\"\",#N/A,UF!$N5)","v":{"$error":"#N/A"}},{"$f":"IF(UF!$Q5=\"\",#N/A,UF!$Q5)","v":{"$error":"#N/A"}},{"$f":"IF(UF!T5=\"\",#N/A,UF!T5)","v":{"$error":"#N/A"}},{"$f":"IF(UF!W5=\"\",#N/A,UF!W5)","v":{"$error":"#N/A"}},{"$f":"IF(UF!Z5=\"\",#N/A,UF!Z5)","v":{"$error":"#N/A"}},{"$f":"IF(UF!AC5=\"\",#N/A,UF!AC5)","v":{"$error":"#N/A"}},{"$f":"IF(UF!AF5=\"\",#N/A,UF!AF5)","v":{"$error":"#N/A"}},{"$f":"IF(UF!AI5=\"\",#N/A,UF!AI5)","v":{"$error":"#N/A"}},{"$f":"IF(UF!AL5=\"\",#N/A,UF!AL5)","v":{"$error":"#N/A"}},{"$f":"IF(UF!AO5=\"\",#N/A,UF!AO5)","v":{"$error":"#N/A"}},null,null,"BA",{"$f":"IF(UF!I5=\"\",#N/A,UF!I5)","v":170},{"$f":"IF(UF!L5=\"\",#N/A,UF!L5)","v":{"$error":"#N/A"}},{"$f":"IF(UF!O5=\"\",#N/A,UF!O5)","v":{"$error":"#N/A"}},{"$f":"IF(UF!R5=\"\",#N/A,UF!R5)","v":{"$error":"#N/A"}},{"$f":"IF(UF!U5=\"\",#N/A,UF!U5)","v":{"$error":"#N/A"}},{"$f":"IF(UF!X5=\"\",#N/A,UF!X5)","v":{"$error":"#N/A"}},{"$f":"IF(UF!AA5=\"\",#N/A,UF!AA5)","v":{"$error":"#N/A"}},{"$f":"IF(UF!AD5=\"\",#N/A,UF!AD5)","v":{"$error":"#N/A"}},{"$f":"IF(UF!AG5=\"\",#N/A,UF!AG5)","v":{"$error":"#N/A"}},{"$f":"IF(UF!AJ5=\"\",#N/A,UF!AJ5)","v":{"$error":"#N/A"}},{"$f":"IF(UF!AM5=\"\",#N/A,UF!AM5)","v":{"$error":"#N/A"}},{"$f":"IF(UF!AP5=\"\",#N/A,UF!AP5)","v":{"$error":"#N/A"}},null,{"$f":"UF!$N$2","v":"MARÇO"},{"$f":"INDEX(Dados!$H$72:$P$83,ROW(AX6)-5,periodo)","v":0.48044692737430167},{"$f":"Dados!AU72","v":0}]
[null,"",6,"",0.18850574712643678,null,"CE",{"$f":"IF(UF!$J$6=\"\",#N/A,UF!$J$6)","v":0.20229885057471264},{"$f":"IF(UF!$M$6=\"\",#N/A,UF!$M$6)","v":{"$error":"#N/A"}},{"$f":"IF(UF!$P$6=\"\",#N/A,UF!$P$6)","v":{"$error":"#N/A"}},{"$f":"IF(UF!$S$6=\"\",#N/A,UF!$S$6)","v":{"$error":"#N/A"}},{"$f":"IF(UF!$V$6=\"\",#N/A,UF!$V$6)","v":{"$error":"#N/A"}},{"$f":"IF(UF!$Y$6=\"\",#N/A,UF!$Y$6)","v":{"$error":"#N/A"}},{"$f":"IF(UF!$AB$6=\"\",#N/A,UF!$AB$6)","v":{"$error":"#N/A"}},{"$f":"IF(UF!$AE$6=\"\",#N/A,UF!$AE$6)","v":{"$error":"#N/A"}},{"$f":"IF(UF!$AH$6=\"\",#N/A,UF!$AH$6)","v":{"$error":"#N/A"}},{"$f":"IF(UF!$AK$6=\"\",#N/A,UF!$AK$6)","v":{"$error":"#N/A"}},{"$f":"IF(UF!$AN$6=\"\",#N/A,UF!$AN$6)","v":{"$error":"#N/A"}},{"$f":"IF(UF!$AQ$6=\"\",#N/A,UF!$AQ$6)","v":{"$error":"#N/A"}},null,"CE",{"$f":"IF(UF!H6=\"\",#N/A,UF!H6)","v":1740},{"$f":"IF(UF!K6=\"\",#N/A,UF!K6)","v":{"$error":"#N/A"}},{"$f":"IF(UF!$N6=\"\",#N/A,UF!$N6)","v":{"$error":"#N/A"}},{"$f":"IF(UF!$Q6=\"\",#N/A,UF!$Q6)","v":{"$error":"#N/A"}},{"$f":"IF(UF!T6=\"\",#N/A,UF!T6)","v":{"$error":"#N/A"}},{"$f":"IF(UF!W6=\"\",#N/A,UF!W6)","v":{"$error":"#N/A"}},{"$f":"IF(UF!Z6=\"\",#N/A,UF!Z6)","v":{"$error":"#N/A"}},{"$f":"IF(UF!AC6=\"\",#N/A,UF!AC6)","v":{"$error":"#N/A"}},{"$f":"IF(UF!AF6=\"\",#N/A,UF!AF6)","v":{"$error":"#N/A"}},{"$f":"IF(UF!AI6=\"\",#N/A,UF!AI6)","v":{"$error":"#N/A"}},{"$f":"IF(UF!AL6=\"\",#N/A,UF!AL6)","v":{"$error":"#N/A"}},{"$f":"IF(UF!AO6=\"\",#N/A,UF!AO6)","v":{"$error":"#N/A"}},null,null,"CE",{"$f":"IF(UF!I6=\"\",#N/A,UF!I6)","v":352},{"$f":"IF(UF!L6=\"\",#N/A,UF!L6)","v":{"$error":"#N/A"}},{"$f":"IF(UF!O6=\"\",#N/A,UF!O6)","v":{"$error":"#N/A"}},{"$f":"IF(UF!R6=\"\",#N/A,UF!R6)","v":{"$error":"#N/A"}},{"$f":"IF(UF!U6=\"\",#N/A,UF!U6)","v":{"$error":"#N/A"}},{"$f":"IF(UF!X6=\"\",#N/A,UF!X6)","v":{"$error":"#N/A"}},{"$f":"IF(UF!AA6=\"\",#N/A,UF!AA6)","v":{"$error":"#N/A"}},{"$f":"IF(UF!AD6=\"\",#N/A,UF!AD6)","v":{"$error":"#N/A"}},{"$f":"IF(UF!AG6=\"\",#N/A,UF!AG6)","v":{"$error":"#N/A"}},{"$f":"IF(UF!AJ6=\"\",#N/A,UF!AJ6)","v":{"$error":"#N/A"}},{"$f":"IF(UF!AM6=\"\",#N/A,UF!AM6)","v":{"$error":"#N/A"}},{"$f":"IF(UF!AP6=\"\",#N/A,UF!AP6)","v":{"$error":"#N/A"}},null,{"$f":"UF!$Q$2","v":"ABRIL"},{"$f":"INDEX(Dados!$H$72:$P$83,ROW(AX7)-5,periodo)","v":{"$error":"#N/A"}},{"$f":"Dados!AU73","v":0}]
[null,"",7,"",0.45251396648044695,null,"DF",{"$f":"IF(UF!$J$7=\"\",#N/A,UF!$J$7)","v":0.48044692737430167},{"$f":"IF(UF!$M$7=\"\",#N/A,UF!$M$7)","v":{"$error":"#N/A"}},{"$f":"IF(UF!$P$7=\"\",#N/A,UF!$P$7)","v":{"$error":"#N/A"}},{"$f":"IF(UF!$S$7=\"\",#N/A,UF!$S$7)","v":{"$error":"#N/A"}},{"$f":"IF(UF!$V$7=\"\",#N/A,UF!$V$7)","v":{"$error":"#N/A"}},{"$f":"IF(UF!$Y$7=\"\",#N/A,UF!$Y$7)","v":{"$error":"#N/A"}},{"$f":"IF(UF!$AB$7=\"\",#N/A,UF!$AB$7)","v":{"$error":"#N/A"}},{"$f":"IF(UF!$AE$7=\"\",#N/A,UF!$AE$7)","v":{"$error":"#N/A"}},{"$f":"IF(UF!$AH$7=\"\",#N/A,UF!$AH$7)","v":{"$error":"#N/A"}},{"$f":"IF(UF!$AK$7=\"\",#N/A,UF!$AK$7)","v":{"$error":"#N/A"}},{"$f":"IF(UF!$AN$7=\"\",#N/A,UF!$AN$7)","v":{"$error":"#N/A"}},{"$f":"IF(UF!$AQ$7=\"\",#N/A,UF!$AQ$7)","v":{"$error":"#N/A"}},null,"DF",{"$f":"IF(UF!H7=\"\",#N/A,UF!H7)","v":358},{"$f":"IF(UF!K7=\"\",#N/A,UF!K7)","v":{"$error":"#N/A"}},{"$f":"IF(UF!$N7=\"\",#N/A,UF!$N7)","v":{"$error":"#N/A"}},{"$f":"IF(UF!$Q7=\"\",#N/A,UF!$Q7)","v":{"$error":"#N/A"}},{"$f":"IF(UF!T7=\"\",#N/A,UF!T7)","v":{"$error":"#N/A"}},{"$f":"IF(UF!W7=\"\",#N/A,UF!W7)","v":{"$error":"#N/A"}},{"$f":"IF(UF!Z7=\"\",#N/A,UF!Z7)","v":{"$error":"#N/A"}},{"$f":"IF(UF!AC7=\"\",#N/A,UF!AC7)","v":{"$error":"#N/A"}},{"$f":"IF(UF!AF7=\"\",#N/A,UF!AF7)","v":{"$error":"#N/A"}},{"$f":"IF(UF!AI7=\"\",#N/A,UF!AI7)","v":{"$error":"#N/A"}},{"$f":"IF(UF!AL7=\"\",#N/A,UF!AL7)","v":{"$error":"#N/A"}},{"$f":"IF(UF!AO7=\"\",#N/A,UF!AO7)","v":{"$error":"#N/A"}},null,null,"DF",{"$f":"IF(UF!I7=\"\",#N/A,UF!I7)","v":172},{"$f":"IF(UF!L7=\"\",#N/A,UF!L7)","v":{"$error":"#N/A"}},{"$f":"IF(UF!O7=\"\",#N/A,UF!O7)","v":{"$error":"#N/A"}},{"$f":"IF(UF!R7=\"\",#N/A,UF!R7)","v":{"$error":"#N/A"}},{"$f":"IF(UF!U7=\"\",#N/A,UF!U7)","v":{"$error":"#N/A"}},{"$f":"IF(UF!X7=\"\",#N/A,UF!X7)","v":{"$error":"#N/A"}},{"$f":"IF(UF!AA7=\"\",#N/A,UF!AA7)","v":{"$error":"#N/A"}},{"$f":"IF(UF!AD7=\"\",#N/A,UF!AD7)","v":{"$error":"#N/A"}},{"$f":"IF(UF!AG7=\"\",#N/A,UF!AG7)","v":{"$error":"#N/A"}},{"$f":"IF(UF!AJ7=\"\",#N/A,UF!AJ7)","v":{"$error":"#N/A"}},{"$f":"IF(UF!AM7=\"\",#N/A,UF!AM7)","v":{"$error":"#N/A"}},{"$f":"IF(UF!AP7=\"\",#N/A,UF!AP7)","v":{"$error":"#N/A"}},null,{"$f":"UF!$T$2","v":"MAIO"},{"$f":"INDEX(Dados!$H$72:$P$83,ROW(AX8)-5,periodo)","v":{"$error":"#N/A"}},{"$f":"Dados!AU74","v":0}]
[null,"",8,"",0.45454545454545453,null,"GO",{"$f":"IF(UF!$J$8=\"\",#N/A,UF!$J$8)","v":0.44805194805194803},{"$f":"IF(UF!$M$8=\"\",#N/A,UF!$M$8)","v":{"$error":"#N/A"}},{"$f":"IF(UF!$P$8=\"\",#N/A,UF!$P$8)","v":{"$error":"#N/A"}},{"$f":"IF(UF!$S$8=\"\",#N/A,UF!$S$8)","v":{"$error":"#N/A"}},{"$f":"IF(UF!$V$8=\"\",#N/A,UF!$V$8)","v":{"$error":"#N/A"}},{"$f":"IF(UF!$Y$8=\"\",#N/A,UF!$Y$8)","v":{"$error":"#N/A"}},{"$f":"IF(UF!$AB$8=\"\",#N/A,UF!$AB$8)","v":{"$error":"#N/A"}},{"$f":"IF(UF!$AE$8=\"\",#N/A,UF!$AE$8)","v":{"$error":"#N/A"}},{"$f":"IF(UF!$AH$8=\"\",#N/A,UF!$AH$8)","v":{"$error":"#N/A"}},{"$f":"IF(UF!$AK$8=\"\",#N/A,UF!$AK$8)","v":{"$error":"#N/A"}},{"$f":"IF(UF!$AN$8=\"\",#N/A,UF!$AN$8)","v":{"$error":"#N/A"}},{"$f":"IF(UF!$AQ$8=\"\",#N/A,UF!$AQ$8)","v":{"$error":"#N/A"}},null,"GO",{"$f":"IF(UF!H8=\"\",#N/A,UF!H8)","v":462},{"$f":"IF(UF!K8=\"\",#N/A,UF!K8)","v":{"$error":"#N/A"}},{"$f":"IF(UF!$N8=\"\",#N/A,UF!$N8)","v":{"$error":"#N/A"}},{"$f":"IF(UF!$Q8=\"\",#N/A,UF!$Q8)","v":{"$error":"#N/A"}},{"$f":"IF(UF!T8=\"\",#N/A,UF!T8)","v":{"$error":"#N/A"}},{"$f":"IF(UF!W8=\"\",#N/A,UF!W8)","v":{"$error":"#N/A"}},{"$f":"IF(UF!Z8=\"\",#N/A,UF!Z8)","v":{"$error":"#N/A"}},{"$f":"IF(UF!AC8=\"\",#N/A,UF!AC8)","v":{"$error":"#N/A"}},{"$f":"IF(UF!AF8=\"\",#N/A,UF!AF8)","v":{"$error":"#N/A"}},{"$f":"IF(UF!AI8=\"\",#N/A,UF!AI8)","v":{"$error":"#N/A"}},{"$f":"IF(UF!AL8=\"\",#N/A,UF!AL8)","v":{"$error":"#N/A"}},{"$f":"IF(UF!AO8=\"\",#N/A,UF!AO8)","v":{"$error":"#N/A"}},null,null,"GO",{"$f":"IF(UF!I8=\"\",#N/A,UF!I8)","v":207},{"$f":"IF(UF!L8=\"\",#N/A,UF!L8)","v":{"$error":"#N/A"}},{"$f":"IF(UF!O8=\"\",#N/A,UF!O8)","v":{"$error":"#N/A"}},{"$f":"IF(UF!R8=\"\",#N/A,UF!R8)","v":{"$error":"#N/A"}},{"$f":"IF(UF!U8=\"\",#N/A,UF!U8)","v":{"$error":"#N/A"}},{"$f":"IF(UF!X8=\"\",#N/A,UF!X8)","v":{"$error":"#N/A"}},{"$f":"IF(UF!AA8=\"\",#N/A,UF!AA8)","v":{"$error":"#N/A"}},{"$f":"IF(UF!AD8=\"\",#N/A,UF!AD8)","v":{"$error":"#N/A"}},{"$f":"IF(UF!AG8=\"\",#N/A,UF!AG8)","v":{"$error":"#N/A"}},{"$f":"IF(UF!AJ8=\"\",#N/A,UF!AJ8)","v":{"$error":"#N/A"}},{"$f":"IF(UF!AM8=\"\",#N/A,UF!AM8)","v":{"$error":"#N/A"}},{"$f":"IF(UF!AP8=\"\",#N/A,UF!AP8)","v":{"$error":"#N/A"}},null,{"$f":"UF!$W$2","v":"JUNHO"},{"$f":"INDEX(Dados!$H$72:$P$83,ROW(AX9)-5,periodo)","v":{"$error":"#N/A"}},{"$f":"Dados!AU75","v":0}]
[null,"",9,"",0.20921985815602837,null,"MA",{"$f":"IF(UF!$J$9=\"\",#N/A,UF!$J$9)","v":0.23758865248226951},{"$f":"IF(UF!$M$9=\"\",#N/A,UF!$M$9)","v":{"$error":"#N/A"}},{"$f":"IF(UF!$P$9=\"\",#N/A,UF!$P$9)","v":{"$error":"#N/A"}},{"$f":"IF(UF!$S$9=\"\",#N/A,UF!$S$9)","v":{"$error":"#N/A"}},{"$f":"IF(UF!$V$9=\"\",#N/A,UF!$V$9)","v":{"$error":"#N/A"}},{"$f":"IF(UF!$Y$9=\"\",#N/A,UF!$Y$9)","v":{"$error":"#N/A"}},{"$f":"IF(UF!$AB$9=\"\",#N/A,UF!$AB$9)","v":{"$error":"#N/A"}},{"$f":"IF(UF!$AE$9=\"\",#N/A,UF!$AE$9)","v":{"$error":"#N/A"}},{"$f":"IF(UF!$AH$9=\"\",#N/A,UF!$AH$9)","v":{"$error":"#N/A"}},{"$f":"IF(UF!$AK$9=\"\",#N/A,UF!$AK$9)","v":{"$error":"#N/A"}},{"$f":"IF(UF!$AN$9=\"\",#N/A,UF!$AN$9)","v":{"$error":"#N/A"}},{"$f":"IF(UF!$AQ$9=\"\",#N/A,UF!$AQ$9)","v":{"$error":"#N/A"}},null,"MA",{"$f":"IF(UF!H9=\"\",#N/A,UF!H9)","v":282},{"$f":"IF(UF!K9=\"\",#N/A,UF!K9)","v":{"$error":"#N/A"}},{"$f":"IF(UF!$N9=\"\",#N/A,UF!$N9)","v":{"$error":"#N/A"}},{"$f":"IF(UF!$Q9=\"\",#N/A,UF!$Q9)","v":{"$error":"#N/A"}},{"$f":"IF(UF!T9=\"\",#N/A,UF!T9)","v":{"$error":"#N/A"}},{"$f":"IF(UF!W9=\"\",#N/A,UF!W9)","v":{"$error":"#N/A"}},{"$f":"IF(UF!Z9=\"\",#N/A,UF!Z9)","v":{"$error":"#N/A"}},{"$f":"IF(UF!AC9=\"\",#N/A,UF!AC9)","v":{"$error":"#N/A"}},{"$f":"IF(UF!AF9=\"\",#N/A,UF!AF9)","v":{"$error":"#N/A"}},{"$f":"IF(UF!AI9=\"\",#N/A,UF!AI9)","v":{"$error":"#N/A"}},{"$f":"IF(UF!AL9=\"\",#N/A,UF!AL9)","v":{"$error":"#N/A"}},{"$f":"IF(UF!AO9=\"\",#N/A,UF!AO9)","v":{"$error":"#N/A"}},null,null,"MA",{"$f":"IF(UF!I9=\"\",#N/A,UF!I9)","v":67},{"$f":"IF(UF!L9=\"\",#N/A,UF!L9)","v":{"$error":"#N/A"}},{"$f":"IF(UF!O9=\"\",#N/A,UF!O9)","v":{"$error":"#N/A"}},{"$f":"IF(UF!R9=\"\",#N/A,UF!R9)","v":{"$error":"#N/A"}},{"$f":"IF(UF!U9=\"\",#N/A,UF!U9)","v":{"$error":"#N/A"}},{"$f":"IF(UF!X9=\"\",#N/A,UF!X9)","v":{"$error":"#N/A"}},{"$f":"IF(UF!AA9=\"\",#N/A,UF!AA9)","v":{"$error":"#N/A"}},{"$f":"IF(UF!AD9=\"\",#N/A,UF!AD9)","v":{"$error":"#N/A"}},{"$f":"IF(UF!AG9=\"\",#N/A,UF!AG9)","v":{"$error":"#N/A"}},{"$f":"IF(UF!AJ9=\"\",#N/A,UF!AJ9)","v":{"$error":"#N/A"}},{"$f":"IF(UF!AM9=\"\",#N/A,UF!AM9)","v":{"$error":"#N/A"}},{"$f":"IF(UF!AP9=\"\",#N/A,UF!AP9)","v":{"$error":"#N/A"}},null,{"$f":"UF!$Z$2","v":"JULHO"},{"$f":"INDEX(Dados!$H$72:$P$83,ROW(AX10)-5,periodo)","v":{"$error":"#N/A"}},{"$f":"Dados!AU76","v":0}]
[null,"",10,"",0.30555555555555558,null,"MT",{"$f":"IF(UF!$J$10=\"\",#N/A,UF!$J$10)","v":0.2986111111111111},{"$f":"IF(UF!$M$10=\"\",#N/A,UF!$M$10)","v":{"$error":"#N/A"}},{"$f":"IF(UF!$P$10=\"\",#N/A,UF!$P$10)","v":{"$error":"#N/A"}},{"$f":"IF(UF!$S$10=\"\",#N/A,UF!$S$10)","v":{"$error":"#N/A"}},{"$f":"IF(UF!$V$10=\"\",#N/A,UF!$V$10)","v":{"$error":"#N/A"}},{"$f":"IF(UF!$Y$10=\"\",#N/A,UF!$Y$10)","v":{"$error":"#N/A"}},{"$f":"IF(UF!$AB$10=\"\",#N/A,UF!$AB$10)","v":{"$error":"#N/A"}},{"$f":"IF(UF!$AE$10=\"\",#N/A,UF!$AE$10)","v":{"$error":"#N/A"}},{"$f":"IF(UF!$AH$10=\"\",#N/A,UF!$AH$10)","v":{"$error":"#N/A"}},{"$f":"IF(UF!$AK$10=\"\",#N/A,UF!$AK$10)","v":{"$error":"#N/A"}},{"$f":"IF(UF!$AN$10=\"\",#N/A,UF!$AN$10)","v":{"$error":"#N/A"}},{"$f":"IF(UF!$AQ$10=\"\",#N/A,UF!$AQ$10)","v":{"$error":"#N/A"}},null,"MT",{"$f":"IF(UF!H10=\"\",#N/A,UF!H10)","v":144},{"$f":"IF(UF!K10=\"\",#N/A,UF!K10)","v":{"$error":"#N/A"}},{"$f":"IF(UF!$N10=\"\",#N/A,UF!$N10)","v":{"$error":"#N/A"}},{"$f":"IF(UF!$Q10=\"\",#N/A,UF!$Q10)","v":{"$error":"#N/A"}},{"$f":"IF(UF!T10=\"\",#N/A,UF!T10)","v":{"$error":"#N/A"}},{"$f":"IF(UF!W10=\"\",#N/A,UF!W10)","v":{"$error":"#N/A"}},{"$f":"IF(UF!Z10=\"\",#N/A,UF!Z10)","v":{"$error":"#N/A"}},{"$f":"IF(UF!AC10=\"\",#N/A,UF!AC10)","v":{"$error":"#N/A"}},{"$f":"IF(UF!AF10=\"\",#N/A,UF!AF10)","v":{"$error":"#N/A"}},{"$f":"IF(UF!AI10=\"\",#N/A,UF!AI10)","v":{"$error":"#N/A"}},{"$f":"IF(UF!AL10=\"\",#N/A,UF!AL10)","v":{"$error":"#N/A"}},{"$f":"IF(UF!AO10=\"\",#N/A,UF!AO10)","v":{"$error":"#N/A"}},null,null,"MT",{"$f":"IF(UF!I10=\"\",#N/A,UF!I10)","v":43},{"$f":"IF(UF!L10=\"\",#N/A,UF!L10)","v":{"$error":"#N/A"}},{"$f":"IF(UF!O10=\"\",#N/A,UF!O10)","v":{"$error":"#N/A"}},{"$f":"IF(UF!R10=\"\",#N/A,UF!R10)","v":{"$error":"#N/A"}},{"$f":"IF(UF!U10=\"\",#N/A,UF!U10)","v":{"$error":"#N/A"}},{"$f":"IF(UF!X10=\"\",#N/A,UF!X10)","v":{"$error":"#N/A"}},{"$f":"IF(UF!AA10=\"\",#N/A,UF!AA10)","v":{"$error":"#N/A"}},{"$f":"IF(UF!AD10=\"\",#N/A,UF!AD10)","v":{"$error":"#N/A"}},{"$f":"IF(UF!AG10=\"\",#N/A,UF!AG10)","v":{"$error":"#N/A"}},{"$f":"IF(UF!AJ10=\"\",#N/A,UF!AJ10)","v":{"$error":"#N/A"}},{"$f":"IF(UF!AM10=\"\",#N/A,UF!AM10)","v":{"$error":"#N/A"}},{"$f":"IF(UF!AP10=\"\",#N/A,UF!AP10)","v":{"$error":"#N/A"}},null,{"$f":"UF!$AC$2","v":"AGOSTO"},{"$f":"INDEX(Dados!$H$72:$P$83,ROW(AX11)-5,periodo)","v":{"$error":"#N/A"}},{"$f":"Dados!AU77","v":0}]
[null,"",11,"",0.43529411764705883,null,"MS",{"$f":"IF(UF!$J$11=\"\",#N/A,UF!$J$11)","v":0.4392156862745098},{"$f":"IF(UF!$M$11=\"\",#N/A,UF!$M$11)","v":{"$error":"#N/A"}},{"$f":"IF(UF!$P$11=\"\",#N/A,UF!$P$11)","v":{"$error":"#N/A"}},{"$f":"IF(UF!$S$11=\"\",#N/A,UF!$S$11)","v":{"$error":"#N/A"}},{"$f":"IF(UF!$V$11=\"\",#N/A,UF!$V$11)","v":{"$error":"#N/A"}},{"$f":"IF(UF!$Y$11=\"\",#N/A,UF!$Y$11)","v":{"$error":"#N/A"}},{"$f":"IF(UF!$AB$11=\"\",#N/A,UF!$AB$11)","v":{"$error":"#N/A"}},{"$f":"IF(UF!$AE$11=\"\",#N/A,UF!$AE$11)","v":{"$error":"#N/A"}},{"$f":"IF(UF!$AH$11=\"\",#N/A,UF!$AH$11)","v":{"$error":"#N/A"}},{"$f":"IF(UF!$AK$11=\"\",#N/A,UF!$AK$11)","v":{"$error":"#N/A"}},{"$f":"IF(UF!$AN$11=\"\",#N/A,UF!$AN$11)","v":{"$error":"#N/A"}},{"$f":"IF(UF!$AQ$11=\"\",#N/A,UF!$AQ$11)","v":{"$error":"#N/A"}},null,"MS",{"$f":"IF(UF!H11=\"\",#N/A,UF!H11)","v":255},{"$f":"IF(UF!K11=\"\",#N/A,UF!K11)","v":{"$error":"#N/A"}},{"$f":"IF(UF!$N11=\"\",#N/A,UF!$N11)","v":{"$error":"#N/A"}},{"$f":"IF(UF!$Q11=\"\",#N/A,UF!$Q11)","v":{"$error":"#N/A"}},{"$f":"IF(UF!T11=\"\",#N/A,UF!T11)","v":{"$error":"#N/A"}},{"$f":"IF(UF!W11=\"\",#N/A,UF!W11)","v":{"$error":"#N/A"}},{"$f":"IF(UF!Z11=\"\",#N/A,UF!Z11)","v":{"$error":"#N/A"}},{"$f":"IF(UF!AC11=\"\",#N/A,UF!AC11)","v":{"$error":"#N/A"}},{"$f":"IF(UF!AF11=\"\",#N/A,UF!AF11)","v":{"$error":"#N/A"}},{"$f":"IF(UF!AI11=\"\",#N/A,UF!AI11)","v":{"$error":"#N/A"}},{"$f":"IF(UF!AL11=\"\",#N/A,UF!AL11)","v":{"$error":"#N/A"}},{"$f":"IF(UF!AO11=\"\",#N/A,UF!AO11)","v":{"$error":"#N/A"}},null,null,"MS",{"$f":"IF(UF!I11=\"\",#N/A,UF!I11)","v":112},{"$f":"IF(UF!L11=\"\",#N/A,UF!L11)","v":{"$error":"#N/A"}},{"$f":"IF(UF!O11=\"\",#N/A,UF!O11)","v":{"$error":"#N/A"}},{"$f":"IF(UF!R11=\"\",#N/A,UF!R11)","v":{"$error":"#N/A"}},{"$f":"IF(UF!U11=\"\",#N/A,UF!U11)","v":{"$error":"#N/A"}},{"$f":"IF(UF!X11=\"\",#N/A,UF!X11)","v":{"$error":"#N/A"}},{"$f":"IF(UF!AA11=\"\",#N/A,UF!AA11)","v":{"$error":"#N/A"}},{"$f":"IF(UF!AD11=\"\",#N/A,UF!AD11)","v":{"$error":"#N/A"}},{"$f":"IF(UF!AG11=\"\",#N/A,UF!AG11)","v":{"$error":"#N/A"}},{"$f":"IF(UF!AJ11=\"\",#N/A,UF!AJ11)","v":{"$error":"#N/A"}},{"$f":"IF(UF!AM11=\"\",#N/A,UF!AM11)","v":{"$error":"#N/A"}},{"$f":"IF(UF!AP11=\"\",#N/A,UF!AP11)","v":{"$error":"#N/A"}},null,{"$f":"UF!$AF$2","v":"SETEMBRO"},{"$f":"INDEX(Dados!$H$72:$P$83,ROW(AX12)-5,periodo)","v":{"$error":"#N/A"}},{"$f":"Dados!AU78","v":0}]
[null,"",12,"",0.29850746268656714,null,"MG",{"$f":"IF(UF!$J$12=\"\",#N/A,UF!$J$12)","v":0.35074626865671643},{"$f":"IF(UF!$M$12=\"\",#N/A,UF!$M$12)","v":{"$error":"#N/A"}},{"$f":"IF(UF!$P$12=\"\",#N/A,UF!$P$12)","v":{"$error":"#N/A"}},{"$f":"IF(UF!$S$12=\"\",#N/A,UF!$S$12)","v":{"$error":"#N/A"}},{"$f":"IF(UF!$V$12=\"\",#N/A,UF!$V$12)","v":{"$error":"#N/A"}},{"$f":"IF(UF!$Y$12=\"\",#N/A,UF!$Y$12)","v":{"$error":"#N/A"}},{"$f":"IF(UF!$AB$12=\"\",#N/A,UF!$AB$12)","v":{"$error":"#N/A"}},{"$f":"IF(UF!$AE$12=\"\",#N/A,UF!$AE$12)","v":{"$error":"#N/A"}},{"$f":"IF(UF!$AH$12=\"\",#N/A,UF!$AH$12)","v":{"$error":"#N/A"}},{"$f":"IF(UF!$AK$12=\"\",#N/A,UF!$AK$12)","v":{"$error":"#N/A"}},{"$f":"IF(UF!$AN$12=\"\",#N/A,UF!$AN$12)","v":{"$error":"#N/A"}},{"$f":"IF(UF!$AQ$12=\"\",#N/A,UF!$AQ$12)","v":{"$error":"#N/A"}},null,"MG",{"$f":"IF(UF!H12=\"\",#N/A,UF!H12)","v":134},{"$f":"IF(UF!K12=\"\",#N/A,UF!K12)","v":{"$error":"#N/A"}},{"$f":"IF(UF!$N12=\"\",#N/A,UF!$N12)","v":{"$error":"#N/A"}},{"$f":"IF(UF!$Q12=\"\",#N/A,UF!$Q12)","v":{"$error":"#N/A"}},{"$f":"IF(UF!T12=\"\",#N/A,UF!T12)","v":{"$error":"#N/A"}},{"$f":"IF(UF!W12=\"\",#N/A,UF!W12)","v":{"$error":"#N/A"}},{"$f":"IF(UF!Z12=\"\",#N/A,UF!Z12)","v":{"$error":"#N/A"}},{"$f":"IF(UF!AC12=\"\",#N/A,UF!AC12)","v":{"$error":"#N/A"}},{"$f":"IF(UF!AF12=\"\",#N/A,UF!AF12)","v":{"$error":"#N/A"}},{"$f":"IF(UF!AI12=\"\",#N/A,UF!AI12)","v":{"$error":"#N/A"}},{"$f":"IF(UF!AL12=\"\",#N/A,UF!AL12)","v":{"$error":"#N/A"}},{"$f":"IF(UF!AO12=\"\",#N/A,UF!AO12)","v":{"$error":"#N/A"}},null,null,"MG",{"$f":"IF(UF!I12=\"\",#N/A,UF!I12)","v":47},{"$f":"IF(UF!L12=\"\",#N/A,UF!L12)","v":{"$error":"#N/A"}},{"$f":"IF(UF!O12=\"\",#N/A,UF!O12)","v":{"$error":"#N/A"}},{"$f":"IF(UF!R12=\"\",#N/A,UF!R12)","v":{"$error":"#N/A"}},{"$f":"IF(UF!U12=\"\",#N/A,UF!U12)","v":{"$error":"#N/A"}},{"$f":"IF(UF!X12=\"\",#N/A,UF!X12)","v":{"$error":"#N/A"}},{"$f":"IF(UF!AA12=\"\",#N/A,UF!AA12)","v":{"$error":"#N/A"}},{"$f":"IF(UF!AD12=\"\",#N/A,UF!AD12)","v":{"$error":"#N/A"}},{"$f":"IF(UF!AG12=\"\",#N/A,UF!AG12)","v":{"$error":"#N/A"}},{"$f":"IF(UF!AJ12=\"\",#N/A,UF!AJ12)","v":{"$error":"#N/A"}},{"$f":"IF(UF!AM12=\"\",#N/A,UF!AM12)","v":{"$error":"#N/A"}},{"$f":"IF(UF!AP12=\"\",#N/A,UF!AP12)","v":{"$error":"#N/A"}},null,{"$f":"UF!$AI$2","v":"OUTUBRO"},{"$f":"INDEX(Dados!$H$72:$P$83,ROW(AX13)-5,periodo)","v":{"$error":"#N/A"}},{"$f":"Dados!AU79","v":0}]
[null,2,13,0,0,null,null,null,null,null,null,null,null,null,null,null,null,null,null,null,null,null,null,null,null,null,null,null,null,null,null,null,null,null,null,null,null,null,null,null,null,null,null,null,null,null,null,null,null,{"$f":"UF!$AL$2","v":"NOVEMBRO"},{"$f":"INDEX(Dados!$H$72:$P$83,ROW(AX14)-5,periodo)","v":{"$error":"#N/A"}},{"$f":"Dados!AU80","v":0}]
[null,2,14,0,0,null,null,null,null,null,null,null,null,null,null,null,null,null,null,null,null,null,null,null,null,null,null,null,null,null,null,null,null,null,null,null,null,null,null,null,null,null,null,null,null,null,null,null,null,{"$f":"UF!$AO$2","v":"DEZEMBRO"},{"$f":"INDEX(Dados!$H$72:$P$83,ROW(AX15)-5,periodo)","v":{"$error":"#N/A"}},{"$f":"Dados!AU81","v":0}]
[null,2,15,0,0]
[null,2,16,0,0]
[null,2,17,0,0]
[null,2,18,0,0]
[null,2,19,0,0]
[null,2,20,0,0]
[null,2,21,0,0]
[null,2,22,0,0]
[null,2,23,0,0]
[null,2,24,0,0]
[null,2,25,0,0]
[null,2,26,0,0]
[null,2,27,0,0]
[null,2,28,0,0]
[null,2,29,0,0]
[null,2,30,0,0]
[]
[null,5,"JANEIRO","ABRIL",16,null,null,null,null,null,1,"AM","AM"]
[null,6,"JANEIRO","ABRIL",15,null,null,null,null,null,2,"BA","BA",null,null,1,"JANEIRO","JAN"]
[null,7,"JANEIRO","ABRIL",14,null,null,null,null,null,3,"CE","CE",null,null,2,"FEVEREIRO","FEV"]
[null,8,"FEVEREIRO","AGOSTO",28,null,"REF",4,{"$f":"INDEX($K$33:$K$59,MATCH('Planilha (B)'!$C$4,Dados!$L$33:$L$59,0))","v":{"$error":"#N/A"}},null,4,"DF","DF",null,null,3,"MARÇO","MAR"]
[null,9,"FEVEREIRO","AGOSTO",27,null,"PERÍODO",{"$f":"VLOOKUP(periodo,Dados!$K$33:$L$59,2,0)","v":"DF"},null,null,5,"GO","GO",null,null,4,"ABRIL","ABR"]
[null,10,"FEVEREIRO","AGOSTO",26,null,null,null,null,null,6,"MA","MA",null,null,5,"MAIO","MAI"]
[null,11,"MARÇO","DEZEMBRO",40,null,null,null,null,null,9,"MG","MG",null,null,6,"JUNHO","JUN"]
[null,12,"MARÇO","DEZEMBRO",39,null,null,null,null,null,8,"MS","MS",null,null,7,"JULHO","JUL"]
[null,13,"MARÇO","DEZEMBRO",38,null,null,null,null,null,7,"MT","MT",null,null,8,"AGOSTO","AGO"]
[null,14,"ABRIL","FEVEREIRO",10,null,null,null,null,null,null,null,null,null,null,9,"SETEMBRO","SET"]
[null,15,"ABRIL","FEVEREIRO",9,null,null,{"$f":"CONCATENATE(H41,H42)","v":""},null,null,null,null,null,null,null,10,"OUTUBRO","OUT"]
[null,16,"ABRIL","FEVEREIRO",8,null,null,null,null,null,null,null,null,null,null,11,"NOVEMBRO","NOV"]
[null,17,"MAIO","JANEIRO",7,null,null,null,null,null,null,null,null,null,null,12,"DEZEMBRO","DEZ"]
[null,18,"MAIO","JANEIRO",6]
[null,19,"MAIO","JANEIRO",5]
[null,20,"JUNHO","JULHO",25]
[null,21,"JUNHO","JULHO",24]
[null,22,"JUNHO","JULHO",23]
[null,23,"JULHO","JUNHO",22]
[null,24,"JULHO","JUNHO",21]
[null,25,"JULHO","JUNHO",20]
[null,26,"AGOSTO","MAIO",19]
[null,27,"AGOSTO","MAIO",18]
[null,28,"AGOSTO","MAIO",17]
[null,29,"SETEMBRO","MARÇO",13]
[null,30,"SETEMBRO","MARÇO",12]
[null,31,"SETEMBRO","MARÇO",11]
[null,32,"OUTUBRO","NOVEMBRO",37]
[null,33,"OUTUBRO","NOVEMBRO",36]
[null,34,"OUTUBRO","NOVEMBRO",35]
[null,35,"NOVEMBRO","OUTUBRO",34]
[null,36,"NOVEMBRO","OUTUBRO",33]
[null,37,"NOVEMBRO","OUTUBRO",32]
[null,38,"DEZEMBRO","SETEMBRO",31]
[null,39,"DEZEMBRO","SETEMBRO",30]
[null,40,"DEZEMBRO","SETEMBRO",29]
[]
[null,null,null,null,null,null,"Estado","AM","BA","CE","DF","GO","MA","MG","MS","MT",null,"BRASIL"]
[null,null,null,null,null,null,2017,{"$f":"IF(UF!$G$4=\"\",#N/A,UF!$G$4)","v":0.4},{"$f":"IF(UF!$G$5=\"\",#N/A,UF!$G$5)","v":0.44389027431421446},{"$f":"IF(UF!$G$6=\"\",#N/A,UF!$G$6)","v":0.18850574712643678},{"$f":"IF(UF!$G$7=\"\",#N/A,UF!$G$7)","v":0.45251396648044695},{"$f":"IF(UF!$G$8=\"\",#N/A,UF!$G$8)","v":0.45454545454545453},{"$f":"IF(UF!$G$9=\"\",#N/A,UF!$G$9)","v":0.20921985815602837},{"$f":"IF(UF!$G$10=\"\",#N/A,UF!$G$10)","v":0.30555555555555558},{"$f":"IF(UF!$G$11=\"\",#N/A,UF!$G$11)","v":0.43529411764705883},{"$f":"IF(UF!$G$12=\"\",#N/A,UF!$G$12)","v":0.29850746268656714},null,{"$f":"AVERAGE(H71:P71)","v":0.35422582627908483}]
[null,null,null,null,null,null,{"$f":"UF!$H$2","v":"JANEIRO"},{"$f":"IF(UF!$J$4=\"\",#N/A,UF!$J$4)","v":0.5},{"$f":"IF(UF!$J$5=\"\",#N/A,UF!$J$5)","v":0.42394014962593518},{"$f":"IF(UF!$J$6=\"\",#N/A,UF!$J$6)","v":0.20229885057471264},{"$f":"IF(UF!$J$7=\"\",#N/A,UF!$J$7)","v":0.48044692737430167},{"$f":"IF(UF!$J$8=\"\",#N/A,UF!$J$8)","v":0.44805194805194803},{"$f":"IF(UF!$J$9=\"\",#N/A,UF!$J$9)","v":0.23758865248226951},{"$f":"IF(UF!$J$10=\"\",#N/A,UF!$J$10)","v":0.2986111111111111},{"$f":"IF(UF!$J$11=\"\",#N/A,UF!$J$11)","v":0.4392156862745098},{"$f":"IF(UF!$J$12=\"\",#N/A,UF!$J$12)","v":0.35074626865671643},null,{"$f":"AVERAGE(H72:P72)","v":0.37565551046127826}]
[null,null,null,null,null,null,{"$f":"UF!$K$2","v":"FEVEREIRO"},{"$f":"IF(UF!$M$4=\"\",#N/A,UF!$M$4)","v":{"$error":"#N/A"}},{"$f":"IF(UF!$M$5=\"\",#N/A,UF!$M$5)","v":{"$error":"#N/A"}},{"$f":"IF(UF!$M$6=\"\",#N/A,UF!$M$6)","v":{"$error":"#N/A"}},{"$f":"IF(UF!$M$7=\"\",#N/A,UF!$M$7)","v":{"$error":"#N/A"}},{"$f":"IF(UF!$M$8=\"\",#N/A,UF!$M$8)","v":{"$error":"#N/A"}},{"$f":"IF(UF!$M$9=\"\",#N/A,UF!$M$9)","v":{"$error":"#N/A"}},{"$f":"IF(UF!$M$10=\"\",#N/A,UF!$M$10)","v":{"$error":"#N/A"}},{"$f":"IF(UF!$M$11=\"\",#N/A,UF!$M$11)","v":{"$error":"#N/A"}},{"$f":"IF(UF!$M$12=\"\",#N/A,UF!$M$12)","v":{"$error":"#N/A"}},null,{"$f":"AVERAGE(H73:P73)","v":{"$error":"#N/A"}}]
[null,null,null,null,null,null,{"$f":"UF!$N$2","v":"MARÇO"},{"$f":"IF(UF!$P$4=\"\",#N/A,UF!$P$4)","v":{"$error":"#N/A"}},{"$f":"IF(UF!$P$5=\"\",#N/A,UF!$P$5)","v":{"$error":"#N/A"}},{"$f":"IF(UF!$P$6=\"\",#N/A,UF!$P$6)","v":{"$error":"#N/A"}},{"$f":"IF(UF!$P$7=\"\",#N/A,UF!$P$7)","v":{"$error":"#N/A"}},{"$f":"IF(UF!$P$8=\"\",#N/A,UF!$P$8)","v":{"$error":"#N/A"}},{"$f":"IF(UF!$P$9=\"\",#N/A,UF!$P$9)","v":{"$error":"#N/A"}},{"$f":"IF(UF!$P$10=\"\",#N/A,UF!$P$10)","v":{"$error":"#N/A"}},{"$f":"IF(UF!$P$11=\"\",#N/A,UF!$P$11)","v":{"$error":"#N/A"}},{"$f":"IF(UF!$P$12=\"\",#N/A,UF!$P$12)","v":{"$error":"#N/A"}},null,{"$f":"AVERAGE(H74:P74)","v":{"$error":"#N/A"}}]
[null,null,null,null,null,null,{"$f":"UF!$Q$2","v":"ABRIL"},{"$f":"IF(UF!$S$4=\"\",#N/A,UF!$S$4)","v":{"$error":"#N/A"}},{"$f":"IF(UF!$S$5=\"\",#N/A,UF!$S$5)","v":{"$error":"#N/A"}},{"$f":"IF(UF!$S$6=\"\",#N/A,UF!$S$6)","v":{"$error":"#N/A"}},{"$f":"IF(UF!$S$7=\"\",#N/A,UF!$S$7)","v":{"$error":"#N/A"}},{"$f":"IF(UF!$S$8=\"\",#N/A,UF!$S$8)","v":{"$error":"#N/A"}},{"$f":"IF(UF!$S$9=\"\",#N/A,UF!$S$9)","v":{"$error":"#N/A"}},{"$f":"IF(UF!$S$10=\"\",#N/A,UF!$S$10)","v":{"$error":"#N/A"}},{"$f":"IF(UF!$S$11=\"\",#N/A,UF!$S$11)","v":{"$error":"#N/A"}},{"$f":"IF(UF!$S$12=\"\",#N/A,UF!$S$12)","v":{"$error":"#N/A"}},null,{"$f":"AVERAGE(H75:P75)","v":{"$error":"#N/A"}}]
[null,null,null,null,null,null,{"$f":"UF!$T$2","v":"MAIO"},{"$f":"IF(UF!$V$4=\"\",#N/A,UF!$V$4)","v":{"$error":"#N/A"}},{"$f":"IF(UF!$V$5=\"\",#N/A,UF!$V$5)","v":{"$error":"#N/A"}},{"$f":"IF(UF!$V$6=\"\",#N/A,UF!$V$6)","v":{"$error":"#N/A"}},{"$f":"IF(UF!$V$7=\"\",#N/A,UF!$V$7)","v":{"$error":"#N/A"}},{"$f":"IF(UF!$V$8=\"\",#N/A,UF!$V$8)","v":{"$error":"#N/A"}},{"$f":"IF(UF!$V$9=\"\",#N/A,UF!$V$9)","v":{"$error":"#N/A"}},{"$f":"IF(UF!$V$10=\"\",#N/A,UF!$V$10)","v":{"$error":"#N/A"}},{"$f":"IF(UF!$V$11=\"\",#N/A,UF!$V$11)","v":{"$error":"#N/A"}},{"$f":"IF(UF!$V$12=\"\",#N/A,UF!$V$12)","v":{"$error":"#N/A"}},null,{"$f":"AVERAGE(H76:P76)","v":{"$error":"#N/A"}}]
[null,null,null,null,null,null,{"$f":"UF!$W$2","v":"JUNHO"},{"$f":"IF(UF!$Y$4=\"\",#N/A,UF!$Y$4)","v":{"$error":"#N/A"}},{"$f":"IF(UF!$Y$5=\"\",#N/A,UF!$Y$5)","v":{"$error":"#N/A"}},{"$f":"IF(UF!$Y$6=\"\",#N/A,UF!$Y$6)","v":{"$error":"#N/A"}},{"$f":"IF(UF!$Y$7=\"\",#N/A,UF!$Y$7)","v":{"$error":"#N/A"}},{"$f":"IF(UF!$Y$8=\"\",#N/A,UF!$Y$8)","v":{"$error":"#N/A"}},{"$f":"IF(UF!$Y$9=\"\",#N/A,UF!$Y$9)","v":{"$error":"#N/A"}},{"$f":"IF(UF!$Y$10=\"\",#N/A,UF!$Y$10)","v":{"$error":"#N/A"}},{"$f":"IF(UF!$Y$11=\"\",#N/A,UF!$Y$11)","v":{"$error":"#N/A"}},{"$f":"IF(UF!$Y$12=\"\",#N/A,UF!$Y$12)","v":{"$error":"#N/A"}},null,{"$f":"AVERAGE(H77:P77)","v":{"$error":"#N/A"}}]
[null,null,null,null,null,null,{"$f":"UF!$Z$2","v":"JULHO"},{"$f":"IF(UF!$AB$4=\"\",#N/A,UF!$AB$4)","v":{"$error":"#N/A"}},{"$f":"IF(UF!$AB$5=\"\",#N/A,UF!$AB$5)","v":{"$error":"#N/A"}},{"$f":"IF(UF!$AB$6=\"\",#N/A,UF!$AB$6)","v":{"$error":"#N/A"}},{"$f":"IF(UF!$AB$7=\"\",#N/A,UF!$AB$7)","v":{"$error":"#N/A"}},{"$f":"IF(UF!$AB$8=\"\",#N/A,UF!$AB$8)","v":{"$error":"#N/A"}},{"$f":"IF(UF!$AB$9=\"\",#N/A,UF!$AB$9)","v":{"$error":"#N/A"}},{"$f":"IF(UF!$AB$10=\"\",#N/A,UF!$AB$10)","v":{"$error":"#N/A"}},{"$f":"IF(UF!$AB$11=\"\",#N/A,UF!$AB$11)","v":{"$error":"#N/A"}},{"$f":"IF(UF!$AB$12=\"\",#N/A,UF!$AB$12)","v":{"$error":"#N/A"}},null,{"$f":"AVERAGE(H78:P78)","v":{"$error":"#N/A"}}]
[null,null,null,null,null,null,{"$f":"UF!$AC$2","v":"AGOSTO"},{"$f":"IF(UF!$AE$4=\"\",#N/A,UF!$AE$4)","v":{"$error":"#N/A"}},{"$f":"IF(UF!$AE$5=\"\",#N/A,UF!$AE$5)","v":{"$error":"#N/A"}},{"$f":"IF(UF!$AE$6=\"\",#N/A,UF!$AE$6)","v":{"$error":"#N/A"}},{"$f":"IF(UF!$AE$7=\"\",#N/A,UF!$AE$7)","v":{"$error":"#N/A"}},{"$f":"IF(UF!$AE$8=\"\",#N/A,UF!$AE$8)","v":{"$error":"#N/A"}},{"$f":"IF(UF!$AE$9=\"\",#N/A,UF!$AE$9)","v":{"$error":"#N/A"}},{"$f":"IF(UF!$AE$10=\"\",#N/A,UF!$AE$10)","v":{"$error":"#N/A"}},{"$f":"IF(UF!$AE$11=\"\",#N/A,UF!$AE$11)","v":{"$error":"#N/A"}},{"$f":"IF(UF!$AE$12=\"\",#N/A,UF!$AE$12)","v":{"$error":"#N/A"}},null,{"$f":"AVERAGE(H79:P79)","v":{"$error":"#N/A"}}]
[null,null,null,null,null,null,{"$f":"UF!$AF$2","v":"SETEMBRO"},{"$f":"IF(UF!$AH$4=\"\",#N/A,UF!$AH$4)","v":{"$error":"#N/A"}},{"$f":"IF(UF!$AH$5=\"\",#N/A,UF!$AH$5)","v":{"$error":"#N/A"}},{"$f":"IF(UF!$AH$6=\"\",#N/A,UF!$AH$6)","v":{"$error":"#N/A"}},{"$f":"IF(UF!$AH$7=\"\",#N/A,UF!$AH$7)","v":{"$error":"#N/A"}},{"$f":"IF(UF!$AH$8=\"\",#N/A,UF!$AH$8)","v":{"$error":"#N/A"}},{"$f":"IF(UF!$AH$9=\"\",#N/A,UF!$AH$9)","v":{"$error":"#N/A"}},{"$f":"IF(UF!$AH$10=\"\",#N/A,UF!$AH$10)","v":{"$error":"#N/A"}},{"$f":"IF(UF!$AH$11=\"\",#N/A,UF!$AH$11)","v":{"$error":"#N/A"}},{"$f":"IF(UF!$AH$12=\"\",#N/A,UF!$AH$12)","v":{"$error":"#N/A"}},null,{"$f":"AVERAGE(H80:P80)","v":{"$error":"#N/A"}}]
[null,null,null,null,null,null,{"$f":"UF!$AI$2","v":"OUTUBRO"},{"$f":"IF(UF!$AK$4=\"\",#N/A,UF!$AK$4)","v":{"$error":"#N/A"}},{"$f":"IF(UF!$AK$5=\"\",#N/A,UF!$AK$5)","v":{"$error":"#N/A"}},{"$f":"IF(UF!$AK$6=\"\",#N/A,UF!$AK$6)","v":{"$error":"#N/A"}},{"$f":"IF(UF!$AK$7=\"\",#N/A,UF!$AK$7)","v":{"$error":"#N/A"}},{"$f":"IF(UF!$AK$8=\"\",#N/A,UF!$AK$8)","v":{"$error":"#N/A"}},{"$f":"IF(UF!$AK$9=\"\",#N/A,UF!$AK$9)","v":{"$error":"#N/A"}},{"$f":"IF(UF!$AK$10=\"\",#N/A,UF!$AK$10)","v":{"$error":"#N/A"}},{"$f":"IF(UF!$AK$11=\"\",#N/A,UF!$AK$11)","v":{"$error":"#N/A"}},{"$f":"IF(UF!$AK$12=\"\",#N/A,UF!$AK$12)","v":{"$error":"#N/A"}},null,{"$f":"AVERAGE(H81:P81)","v":{"$error":"#N/A"}}]
[null,null,null,null,null,null,{"$f":"UF!$AL$2","v":"NOVEMBRO"},{"$f":"IF(UF!$AN$4=\"\",#N/A,UF!$AN$4)","v":{"$error":"#N/A"}},{"$f":"IF(UF!$AN$5=\"\",#N/A,UF!$AN$5)","v":{"$error":"#N/A"}},{"$f":"IF(UF!$AN$6=\"\",#N/A,UF!$AN$6)","v":{"$error":"#N/A"}},{"$f":"IF(UF!$AN$7=\"\",#N/A,UF!$AN$7)","v":{"$error":"#N/A"}},{"$f":"IF(UF!$AN$8=\"\",#N/A,UF!$AN$8)","v":{"$error":"#N/A"}},{"$f":"IF(UF!$AN$9=\"\",#N/A,UF!$AN$9)","v":{"$error":"#N/A"}},{"$f":"IF(UF!$AN$10=\"\",#N/A,UF!$AN$10)","v":{"$error":"#N/A"}},{"$f":"IF(UF!$AN$11=\"\",#N/A,UF!$AN$11)","v":{"$error":"#N/A"}},{"$f":"IF(UF!$AN$12=\"\",#N/A,UF!$AN$12)","v":{"$error":"#N/A"}},null,{"$f":"AVERAGE(H82:P82)","v":{"$error":"#N/A"}}]
[null,null,null,null,null,null,{"$f":"UF!$AO$2","v":"DEZEMBRO"},{"$f":"IF(UF!$AQ$4=\"\",#N/A,UF!$AQ$4)","v":{"$error":"#N/A"}},{"$f":"IF(UF!$AQ$5=\"\",#N/A,UF!$AQ$5)","v":{"$error":"#N/A"}},{"$f":"IF(UF!$AQ$6=\"\",#N/A,UF!$AQ$6)","v":{"$error":"#N/A"}},{"$f":"IF(UF!$AQ$7=\"\",#N/A,UF!$AQ$7)","v":{"$error":"#N/A"}},{"$f":"IF(UF!$AQ$8=\"\",#N/A,UF!$AQ$8)","v":{"$error":"#N/A"}},{"$f":"IF(UF!$AQ$9=\"\",#N/A,UF!$AQ$9)","v":{"$error":"#N/A"}},{"$f":"IF(UF!$AQ$10=\"\",#N/A,UF!$AQ$10)","v":{"$error":"#N/A"}},{"$f":"IF(UF!$AQ$11=\"\",#N/A,UF!$AQ$11)","v":{"$error":"#N/A"}},{"$f":"IF(UF!$AQ$12=\"\",#N/A,UF!$AQ$12)","v":{"$error":"#N/A"}},null,{"$f":"AVERAGE(H83:P83)","v":{"$error":"#N/A"}}]
[]
[null,null,null,null,null,null,"EMPRESA","COD",{"$f":"UF!$E$2","v":2017},{"$f":"UF!$H$2","v":"JANEIRO"},{"$f":"UF!$K$2","v":"FEVEREIRO"},{"$f":"UF!$N$2","v":"MARÇO"},{"$f":"UF!$Q$2","v":"ABRIL"},{"$f":"UF!$T$2","v":"MAIO"},{"$f":"UF!$W$2","v":"JUNHO"},{"$f":"UF!$Z$2","v":"JULHO"},{"$f":"UF!$AC$2","v":"AGOSTO"},{"$f":"UF!$AF$2","v":"SETEMBRO"},{"$f":"UF!$AI$2","v":"OUTUBRO"},{"$f":"UF!$AL$2","v":"NOVEMBRO"},{"$f":"UF!$AO$2","v":"DEZEMBRO"}]
[null,null,null,null,null,1,{"$f":"'Planilha (A)'!C25","v":"EMPRESA 13"},{"$f":"'Planilha (A)'!B25","v":13},{"$f":"IF('Planilha (A)'!G25=\"\",#N/A,'Planilha (A)'!G25)","v":0.25},{"$f":"IF('Planilha (A)'!J25=\"\",#N/A,'Planilha (A)'!J25)","v":0.40277777777777779},{"$f":"IF('Planilha (A)'!M25=\"\",#N/A,'Planilha (A)'!M25)","v":{"$error":"#N/A"}},{"$f":"IF('Planilha (A)'!P25=\"\",#N/A,'Planilha (A)'!P25)","v":{"$error":"#N/A"}},{"$f":"IF('Planilha (A)'!S25=\"\",#N/A,'Planilha (A)'!S25)","v":{"$error":"#N/A"}},{"$f":"IF('Planilha (A)'!V25=\"\",#N/A,'Planilha (A)'!V25)","v":{"$error":"#N/A"}},{"$f":"IF('Planilha (A)'!Y25=\"\",#N/A,'Planilha (A)'!Y25)","v":{"$error":"#N/A"}},{"$f":"IF('Planilha (A)'!AB25=\"\",#N/A,'Planilha (A)'!AB25)","v":{"$error":"#N/A"}},{"$f":"IF('Planilha (A)'!AE25=\"\",#N/A,'Planilha (A)'!AE25)","v":{"$error":"#N/A"}},{"$f":"IF('Planilha (A)'!AH25=\"\",#N/A,'Planilha (A)'!AH25)","v":{"$error":"#N/A"}},{"$f":"IF('Planilha (A)'!AK25=\"\",#N/A,'Planilha (A)'!AK25)","v":{"$error":"#N/A"}},{"$f":"IF('Planilha (A)'!AN25=\"\",#N/A,'Planilha (A)'!AN25)","v":{"$error":"#N/A"}},{"$f":"IF('Planilha (A)'!AQ25=\"\",#N/A,'Planilha (A)'!AQ25)","v":{"$error":"#N/A"}}]
[null,null,null,null,null,2,{"$f":"'Planilha (A)'!C26","v":"EMPRESA 14"},{"$f":"'Planilha (A)'!B26","v":14},{"$f":"IF('Planilha (A)'!G26=\"\",#N/A,'Planilha (A)'!G26)","v":0.43283582089552236},{"$f":"IF('Planilha (A)'!J26=\"\",#N/A,'Planilha (A)'!J26)","v":0.41791044776119401},{"$f":"IF('Planilha (A)'!M26=\"\",#N/A,'Planilha (A)'!M26)","v":{"$error":"#N/A"}},{"$f":"IF('Planilha (A)'!P26=\"\",#N/A,'Planilha (A)'!P26)","v":{"$error":"#N/A"}},{"$f":"IF('Planilha (A)'!S26=\"\",#N/A,'Planilha (A)'!S26)","v":{"$error":"#N/A"}},{"$f":"IF('Planilha (A)'!V26=\"\",#N/A,'Planilha (A)'!V26)","v":{"$error":"#N/A"}},{"$f":"IF('Planilha (A)'!Y26=\"\",#N/A,'Planilha (A)'!Y26)","v":{"$error":"#N/A"}},{"$f":"IF('Planilha (A)'!AB26=\"\",#N/A,'Planilha (A)'!AB26)","v":{"$error":"#N/A"}},{"$f":"IF('Planilha (A)'!AE26=\"\",#N/A,'Planilha (A)'!AE26)","v":{"$error":"#N/A"}},{"$f":"IF('Planilha (A)'!AH26=\"\",#N/A,'Planilha (A)'!AH26)","v":{"$error":"#N/A"}},{"$f":"IF('Planilha (A)'!AK26=\"\",#N/A,'Planilha (A)'!AK26)","v":{"$error":"#N/A"}},{"$f":"IF('Planilha (A)'!AN26=\"\",#N/A,'Planilha (A)'!AN26)","v":{"$error":"#N/A"}},{"$f":"IF('Planilha (A)'!AQ26=\"\",#N/A,'Planilha (A)'!AQ26)","v":{"$error":"#N/A"}}]
[null,null,null,null,null,3,{"$f":"'Planilha (A)'!C27","v":"EMPRESA 15"},{"$f":"'Planilha (A)'!B27","v":15},{"$f":"IF('Planilha (A)'!G27=\"\",#N/A,'Planilha (A)'!G27)","v":0.1702127659574468},{"$f":"IF('Planilha (A)'!J27=\"\",#N/A,'Planilha (A)'!J27)","v":0.25531914893617019},{"$f":"IF('Planilha (A)'!M27=\"\",#N/A,'Planilha (A)'!M27)","v":{"$error":"#N/A"}},{"$f":"IF('Planilha (A)'!P27=\"\",#N/A,'Planilha (A)'!P27)","v":{"$error":"#N/A"}},{"$f":"IF('Planilha (A)'!S27=\"\",#N/A,'Planilha (A)'!S27)","v":{"$error":"#N/A"}},{"$f":"IF('Planilha (A)'!V27=\"\",#N/A,'Planilha (A)'!V27)","v":{"$error":"#N/A"}},{"$f":"IF('Planilha (A)'!Y27=\"\",#N/A,'Planilha (A)'!Y27)","v":{"$error":"#N/A"}},{"$f":"IF('Planilha (A)'!AB27=\"\",#N/A,'Planilha (A)'!AB27)","v":{"$error":"#N/A"}},{"$f":"IF('Planilha (A)'!AE27=\"\",#N/A,'Planilha (A)'!AE27)","v":{"$error":"#N/A"}},{"$f":"IF('Planilha (A)'!AH27=\"\",#N/A,'Planilha (A)'!AH27)","v":{"$error":"#N/A"}},{"$f":"IF('Planilha (A)'!AK27=\"\",#N/A,'Planilha (A)'!AK27)","v":{"$error":"#N/A"}},{"$f":"IF('Planilha (A)'!AN27=\"\",#N/A,'Planilha (A)'!AN27)","v":{"$error":"#N/A"}},{"$f":"IF('Planilha (A)'!AQ27=\"\",#N/A,'Planilha (A)'!AQ27)","v":{"$error":"#N/A"}}]
[null,null,null,null,null,4,{"$f":"'Planilha (A)'!C28","v":"EMPRESA 16"},{"$f":"'Planilha (A)'!B28","v":16},{"$f":"IF('Planilha (A)'!G28=\"\",#N/A,'Planilha (A)'!G28)","v":0.94117647058823528},{"$f":"IF('Planilha (A)'!J28=\"\",#N/A,'Planilha (A)'!J28)","v":0.77647058823529413},{"$f":"IF('Planilha (A)'!M28=\"\",#N/A,'Planilha (A)'!M28)","v":{"$error":"#N/A"}},{"$f":"IF('Planilha (A)'!P28=\"\",#N/A,'Planilha (A)'!P28)","v":{"$error":"#N/A"}},{"$f":"IF('Planilha (A)'!S28=\"\",#N/A,'Planilha (A)'!S28)","v":{"$error":"#N/A"}},{"$f":"IF('Planilha (A)'!V28=\"\",#N/A,'Planilha (A)'!V28)","v":{"$error":"#N/A"}},{"$f":"IF('Planilha (A)'!Y28=\"\",#N/A,'Planilha (A)'!Y28)","v":{"$error":"#N/A"}},{"$f":"IF('Planilha (A)'!AB28=\"\",#N/A,'Planilha (A)'!AB28)","v":{"$error":"#N/A"}},{"$f":"IF('Planilha (A)'!AE28=\"\",#N/A,'Planilha (A)'!AE28)","v":{"$error":"#N/A"}},{"$f":"IF('Planilha (A)'!AH28=\"\",#N/A,'Planilha (A)'!AH28)","v":{"$error":"#N/A"}},{"$f":"IF('Planilha (A)'!AK28=\"\",#N/A,'Planilha (A)'!AK28)","v":{"$error":"#N/A"}},{"$f":"IF('Planilha (A)'!AN28=\"\",#N/A,'Planilha (A)'!AN28)","v":{"$error":"#N/A"}},{"$f":"IF('Planilha (A)'!AQ28=\"\",#N/A,'Planilha (A)'!AQ28)","v":{"$error":"#N/A"}}]
[null,null,null,null,null,5,{"$f":"'Planilha (A)'!C29","v":"EMPRESA 17"},{"$f":"'Planilha (A)'!B29","v":17},{"$f":"IF('Planilha (A)'!G29=\"\",#N/A,'Planilha (A)'!G29)","v":0.31034482758620691},{"$f":"IF('Planilha (A)'!J29=\"\",#N/A,'Planilha (A)'!J29)","v":0.42528735632183906},{"$f":"IF('Planilha (A)'!M29=\"\",#N/A,'Planilha (A)'!M29)","v":{"$error":"#N/A"}},{"$f":"IF('Planilha (A)'!P29=\"\",#N/A,'Planilha (A)'!P29)","v":{"$error":"#N/A"}},{"$f":"IF('Planilha (A)'!S29=\"\",#N/A,'Planilha (A)'!S29)","v":{"$error":"#N/A"}},{"$f":"IF('Planilha (A)'!V29=\"\",#N/A,'Planilha (A)'!V29)","v":{"$error":"#N/A"}},{"$f":"IF('Planilha (A)'!Y29=\"\",#N/A,'Planilha (A)'!Y29)","v":{"$error":"#N/A"}},{"$f":"IF('Planilha (A)'!AB29=\"\",#N/A,'Planilha (A)'!AB29)","v":{"$error":"#N/A"}},{"$f":"IF('Planilha (A)'!AE29=\"\",#N/A,'Planilha (A)'!AE29)","v":{"$error":"#N/A"}},{"$f":"IF('Planilha (A)'!AH29=\"\",#N/A,'Planilha (A)'!AH29)","v":{"$error":"#N/A"}},{"$f":"IF('Planilha (A)'!AK29=\"\",#N/A,'Planilha (A)'!AK29)","v":{"$error":"#N/A"}},{"$f":"IF('Planilha (A)'!AN29=\"\",#N/A,'Planilha (A)'!AN29)","v":{"$error":"#N/A"}},{"$f":"IF('Planilha (A)'!AQ29=\"\",#N/A,'Planilha (A)'!AQ29)","v":{"$error":"#N/A"}}]
[null,null,null,null,null,6,{"$f":"'Planilha (A)'!C30","v":""},{"$f":"'Planilha (A)'!B30","v":""},{"$f":"IF('Planilha (A)'!G30=\"\",#N/A,'Planilha (A)'!G30)","v":{"$error":"#N/A"}},{"$f":"IF('Planilha (A)'!J30=\"\",#N/A,'Planilha (A)'!J30)","v":{"$error":"#N/A"}},{"$f":"IF('Planilha (A)'!M30=\"\",#N/A,'Planilha (A)'!M30)","v":{"$error":"#N/A"}},{"$f":"IF('Planilha (A)'!P30=\"\",#N/A,'Planilha (A)'!P30)","v":{"$error":"#N/A"}},{"$f":"IF('Planilha (A)'!S30=\"\",#N/A,'Planilha (A)'!S30)","v":{"$error":"#N/A"}},{"$f":"IF('Planilha (A)'!V30=\"\",#N/A,'Planilha (A)'!V30)","v":{"$error":"#N/A"}},{"$f":"IF('Planilha (A)'!Y30=\"\",#N/A,'Planilha (A)'!Y30)","v":{"$error":"#N/A"}},{"$f":"IF('Planilha (A)'!AB30=\"\",#N/A,'Planilha (A)'!AB30)","v":{"$error":"#N/A"}},{"$f":"IF('Planilha (A)'!AE30=\"\",#N/A,'Planilha (A)'!AE30)","v":{"$error":"#N/A"}},{"$f":"IF('Planilha (A)'!AH30=\"\",#N/A,'Planilha (A)'!AH30)","v":{"$error":"#N/A"}},{"$f":"IF('Planilha (A)'!AK30=\"\",#N/A,'Planilha (A)'!AK30)","v":{"$error":"#N/A"}},{"$f":"IF('Planilha (A)'!AN30=\"\",#N/A,'Planilha (A)'!AN30)","v":{"$error":"#N/A"}},{"$f":"IF('Planilha (A)'!AQ30=\"\",#N/A,'Planilha (A)'!AQ30)","v":{"$error":"#N/A"}}]
[null,null,null,null,null,7,{"$f":"'Planilha (A)'!C31","v":""},{"$f":"'Planilha (A)'!B31","v":""},{"$f":"IF('Planilha (A)'!G31=\"\",#N/A,'Planilha (A)'!G31)","v":{"$error":"#N/A"}},{"$f":"IF('Planilha (A)'!J31=\"\",#N/A,'Planilha (A)'!J31)","v":{"$error":"#N/A"}},{"$f":"IF('Planilha (A)'!M31=\"\",#N/A,'Planilha (A)'!M31)","v":{"$error":"#N/A"}},{"$f":"IF('Planilha (A)'!P31=\"\",#N/A,'Planilha (A)'!P31)","v":{"$error":"#N/A"}},{"$f":"IF('Planilha (A)'!S31=\"\",#N/A,'Planilha (A)'!S31)","v":{"$error":"#N/A"}},{"$f":"IF('Planilha (A)'!V31=\"\",#N/A,'Planilha (A)'!V31)","v":{"$error":"#N/A"}},{"$f":"IF('Planilha (A)'!Y31=\"\",#N/A,'Planilha (A)'!Y31)","v":{"$error":"#N/A"}},{"$f":"IF('Planilha (A)'!AB31=\"\",#N/A,'Planilha (A)'!AB31)","v":{"$error":"#N/A"}},{"$f":"IF('Planilha (A)'!AE31=\"\",#N/A,'Planilha (A)'!AE31)","v":{"$error":"#N/A"}},{"$f":"IF('Planilha (A)'!AH31=\"\",#N/A,'Planilha (A)'!AH31)","v":{"$error":"#N/A"}},{"$f":"IF('Planilha (A)'!AK31=\"\",#N/A,'Planilha (A)'!AK31)","v":{"$error":"#N/A"}},{"$f":"IF('Planilha (A)'!AN31=\"\",#N/A,'Planilha (A)'!AN31)","v":{"$error":"#N/A"}},{"$f":"IF('Planilha (A)'!AQ31=\"\",#N/A,'Planilha (A)'!AQ31)","v":{"$error":"#N/A"}}]
[null,null,null,null,null,8,{"$f":"'Planilha (A)'!C32","v":""},{"$f":"'Planilha (A)'!B32","v":""},{"$f":"IF('Planilha (A)'!G32=\"\",#N/A,'Planilha (A)'!G32)","v":{"$error":"#N/A"}},{"$f":"IF('Planilha (A)'!J32=\"\",#N/A,'Planilha (A)'!J32)","v":{"$error":"#N/A"}},{"$f":"IF('Planilha (A)'!M32=\"\",#N/A,'Planilha (A)'!M32)","v":{"$error":"#N/A"}},{"$f":"IF('Planilha (A)'!P32=\"\",#N/A,'Planilha (A)'!P32)","v":{"$error":"#N/A"}},{"$f":"IF('Planilha (A)'!S32=\"\",#N/A,'Planilha (A)'!S32)","v":{"$error":"#N/A"}},{"$f":"IF('Planilha (A)'!V32=\"\",#N/A,'Planilha (A)'!V32)","v":{"$error":"#N/A"}},{"$f":"IF('Planilha (A)'!Y32=\"\",#N/A,'Planilha (A)'!Y32)","v":{"$error":"#N/A"}},{"$f":"IF('Planilha (A)'!AB32=\"\",#N/A,'Planilha (A)'!AB32)","v":{"$error":"#N/A"}},{"$f":"IF('Planilha (A)'!AE32=\"\",#N/A,'Planilha (A)'!AE32)","v":{"$error":"#N/A"}},{"$f":"IF('Planilha (A)'!AH32=\"\",#N/A,'Planilha (A)'!AH32)","v":{"$error":"#N/A"}},{"$f":"IF('Planilha (A)'!AK32=\"\",#N/A,'Planilha (A)'!AK32)","v":{"$error":"#N/A"}},{"$f":"IF('Planilha (A)'!AN32=\"\",#N/A,'Planilha (A)'!AN32)","v":{"$error":"#N/A"}},{"$f":"IF('Planilha (A)'!AQ32=\"\",#N/A,'Planilha (A)'!AQ32)","v":{"$error":"#N/A"}}]
[null,null,null,null,null,9,{"$f":"'Planilha (A)'!C33","v":""},{"$f":"'Planilha (A)'!B33","v":""},{"$f":"IF('Planilha (A)'!G33=\"\",#N/A,'Planilha (A)'!G33)","v":{"$error":"#N/A"}},{"$f":"IF('Planilha (A)'!J33=\"\",#N/A,'Planilha (A)'!J33)","v":{"$error":"#N/A"}},{"$f":"IF('Planilha (A)'!M33=\"\",#N/A,'Planilha (A)'!M33)","v":{"$error":"#N/A"}},{"$f":"IF('Planilha (A)'!P33=\"\",#N/A,'Planilha (A)'!P33)","v":{"$error":"#N/A"}},{"$f":"IF('Planilha (A)'!S33=\"\",#N/A,'Planilha (A)'!S33)","v":{"$error":"#N/A"}},{"$f":"IF('Planilha (A)'!V33=\"\",#N/A,'Planilha (A)'!V33)","v":{"$error":"#N/A"}},{"$f":"IF('Planilha (A)'!Y33=\"\",#N/A,'Planilha (A)'!Y33)","v":{"$error":"#N/A"}},{"$f":"IF('Planilha (A)'!AB33=\"\",#N/A,'Planilha (A)'!AB33)","v":{"$error":"#N/A"}},{"$f":"IF('Planilha (A)'!AE33=\"\",#N/A,'Planilha (A)'!AE33)","v":{"$error":"#N/A"}},{"$f":"IF('Planilha (A)'!AH33=\"\",#N/A,'Planilha (A)'!AH33)","v":{"$error":"#N/A"}},{"$f":"IF('Planilha (A)'!AK33=\"\",#N/A,'Planilha (A)'!AK33)","v":{"$error":"#N/A"}},{"$f":"IF('Planilha (A)'!AN33=\"\",#N/A,'Planilha (A)'!AN33)","v":{"$error":"#N/A"}},{"$f":"IF('Planilha (A)'!AQ33=\"\",#N/A,'Planilha (A)'!AQ33)","v":{"$error":"#N/A"}}]
[null,null,null,null,null,10,{"$f":"'Planilha (A)'!C34","v":""},{"$f":"'Planilha (A)'!B34","v":""},{"$f":"IF('Planilha (A)'!G34=\"\",#N/A,'Planilha (A)'!G34)","v":{"$error":"#N/A"}},{"$f":"IF('Planilha (A)'!J34=\"\",#N/A,'Planilha (A)'!J34)","v":{"$error":"#N/A"}},{"$f":"IF('Planilha (A)'!M34=\"\",#N/A,'Planilha (A)'!M34)","v":{"$error":"#N/A"}},{"$f":"IF('Planilha (A)'!P34=\"\",#N/A,'Planilha (A)'!P34)","v":{"$error":"#N/A"}},{"$f":"IF('Planilha (A)'!S34=\"\",#N/A,'Planilha (A)'!S34)","v":{"$error":"#N/A"}},{"$f":"IF('Planilha (A)'!V34=\"\",#N/A,'Planilha (A)'!V34)","v":{"$error":"#N/A"}},{"$f":"IF('Planilha (A)'!Y34=\"\",#N/A,'Planilha (A)'!Y34)","v":{"$error":"#N/A"}},{"$f":"IF('Planilha (A)'!AB34=\"\",#N/A,'Planilha (A)'!AB34)","v":{"$error":"#N/A"}},{"$f":"IF('Planilha (A)'!AE34=\"\",#N/A,'Planilha (A)'!AE34)","v":{"$error":"#N/A"}},{"$f":"IF('Planilha (A)'!AH34=\"\",#N/A,'Planilha (A)'!AH34)","v":{"$error":"#N/A"}},{"$f":"IF('Planilha (A)'!AK34=\"\",#N/A,'Planilha (A)'!AK34)","v":{"$error":"#N/A"}},{"$f":"IF('Planilha (A)'!AN34=\"\",#N/A,'Planilha (A)'!AN34)","v":{"$error":"#N/A"}},{"$f":"IF('Planilha (A)'!AQ34=\"\",#N/A,'Planilha (A)'!AQ34)","v":{"$error":"#N/A"}}]
[null,null,null,null,null,11,{"$f":"'Planilha (A)'!C35","v":""},{"$f":"'Planilha (A)'!B35","v":""},{"$f":"IF('Planilha (A)'!G35=\"\",#N/A,'Planilha (A)'!G35)","v":{"$error":"#N/A"}},{"$f":"IF('Planilha (A)'!J35=\"\",#N/A,'Planilha (A)'!J35)","v":{"$error":"#N/A"}},{"$f":"IF('Planilha (A)'!M35=\"\",#N/A,'Planilha (A)'!M35)","v":{"$error":"#N/A"}},{"$f":"IF('Planilha (A)'!P35=\"\",#N/A,'Planilha (A)'!P35)","v":{"$error":"#N/A"}},{"$f":"IF('Planilha (A)'!S35=\"\",#N/A,'Planilha (A)'!S35)","v":{"$error":"#N/A"}},{"$f":"IF('Planilha (A)'!V35=\"\",#N/A,'Planilha (A)'!V35)","v":{"$error":"#N/A"}},{"$f":"IF('Planilha (A)'!Y35=\"\",#N/A,'Planilha (A)'!Y35)","v":{"$error":"#N/A"}},{"$f":"IF('Planilha (A)'!AB35=\"\",#N/A,'Planilha (A)'!AB35)","v":{"$error":"#N/A"}},{"$f":"IF('Planilha (A)'!AE35=\"\",#N/A,'Planilha (A)'!AE35)","v":{"$error":"#N/A"}},{"$f":"IF('Planilha (A)'!AH35=\"\",#N/A,'Planilha (A)'!AH35)","v":{"$error":"#N/A"}},{"$f":"IF('Planilha (A)'!AK35=\"\",#N/A,'Planilha (A)'!AK35)","v":{"$error":"#N/A"}},{"$f":"IF('Planilha (A)'!AN35=\"\",#N/A,'Planilha (A)'!AN35)","v":{"$error":"#N/A"}},{"$f":"IF('Planilha (A)'!AQ35=\"\",#N/A,'Planilha (A)'!AQ35)","v":{"$error":"#N/A"}}]
[null,null,null,null,null,12,{"$f":"'Planilha (A)'!C36","v":""},{"$f":"'Planilha (A)'!B36","v":""},{"$f":"IF('Planilha (A)'!G36=\"\",#N/A,'Planilha (A)'!G36)","v":{"$error":"#N/A"}},{"$f":"IF('Planilha (A)'!J36=\"\",#N/A,'Planilha (A)'!J36)","v":{"$error":"#N/A"}},{"$f":"IF('Planilha (A)'!M36=\"\",#N/A,'Planilha (A)'!M36)","v":{"$error":"#N/A"}},{"$f":"IF('Planilha (A)'!P36=\"\",#N/A,'Planilha (A)'!P36)","v":{"$error":"#N/A"}},{"$f":"IF('Planilha (A)'!S36=\"\",#N/A,'Planilha (A)'!S36)","v":{"$error":"#N/A"}},{"$f":"IF('Planilha (A)'!V36=\"\",#N/A,'Planilha (A)'!V36)","v":{"$error":"#N/A"}},{"$f":"IF('Planilha (A)'!Y36=\"\",#N/A,'Planilha (A)'!Y36)","v":{"$error":"#N/A"}},{"$f":"IF('Planilha (A)'!AB36=\"\",#N/A,'Planilha (A)'!AB36)","v":{"$error":"#N/A"}},{"$f":"IF('Planilha (A)'!AE36=\"\",#N/A,'Planilha (A)'!AE36)","v":{"$error":"#N/A"}},{"$f":"IF('Planilha (A)'!AH36=\"\",#N/A,'Planilha (A)'!AH36)","v":{"$error":"#N/A"}},{"$f":"IF('Planilha (A)'!AK36=\"\",#N/A,'Planilha (A)'!AK36)","v":{"$error":"#N/A"}},{"$f":"IF('Planilha (A)'!AN36=\"\",#N/A,'Planilha (A)'!AN36)","v":{"$error":"#N/A"}},{"$f":"IF('Planilha (A)'!AQ36=\"\",#N/A,'Planilha (A)'!AQ36)","v":{"$error":"#N/A"}}]
[null,null,null,null,null,13,{"$f":"'Planilha (A)'!C37","v":""},{"$f":"'Planilha (A)'!B37","v":""},{"$f":"IF('Planilha (A)'!G37=\"\",#N/A,'Planilha (A)'!G37)","v":{"$error":"#N/A"}},{"$f":"IF('Planilha (A)'!J37=\"\",#N/A,'Planilha (A)'!J37)","v":{"$error":"#N/A"}},{"$f":"IF('Planilha (A)'!M37=\"\",#N/A,'Planilha (A)'!M37)","v":{"$error":"#N/A"}},{"$f":"IF('Planilha (A)'!P37=\"\",#N/A,'Planilha (A)'!P37)","v":{"$error":"#N/A"}},{"$f":"IF('Planilha (A)'!S37=\"\",#N/A,'Planilha (A)'!S37)","v":{"$error":"#N/A"}},{"$f":"IF('Planilha (A)'!V37=\"\",#N/A,'Planilha (A)'!V37)","v":{"$error":"#N/A"}},{"$f":"IF('Planilha (A)'!Y37=\"\",#N/A,'Planilha (A)'!Y37)","v":{"$error":"#N/A"}},{"$f":"IF('Planilha (A)'!AB37=\"\",#N/A,'Planilha (A)'!AB37)","v":{"$error":"#N/A"}},{"$f":"IF('Planilha (A)'!AE37=\"\",#N/A,'Planilha (A)'!AE37)","v":{"$error":"#N/A"}},{"$f":"IF('Planilha (A)'!AH37=\"\",#N/A,'Planilha (A)'!AH37)","v":{"$error":"#N/A"}},{"$f":"IF('Planilha (A)'!AK37=\"\",#N/A,'Planilha (A)'!AK37)","v":{"$error":"#N/A"}},{"$f":"IF('Planilha (A)'!AN37=\"\",#N/A,'Planilha (A)'!AN37)","v":{"$error":"#N/A"}},{"$f":"IF('Planilha (A)'!AQ37=\"\",#N/A,'Planilha (A)'!AQ37)","v":{"$error":"#N/A"}}]
[null,null,null,null,null,14,{"$f":"'Planilha (A)'!C38","v":""},{"$f":"'Planilha (A)'!B38","v":""},{"$f":"IF('Planilha (A)'!G38=\"\",#N/A,'Planilha (A)'!G38)","v":{"$error":"#N/A"}},{"$f":"IF('Planilha (A)'!J38=\"\",#N/A,'Planilha (A)'!J38)","v":{"$error":"#N/A"}},{"$f":"IF('Planilha (A)'!M38=\"\",#N/A,'Planilha (A)'!M38)","v":{"$error":"#N/A"}},{"$f":"IF('Planilha (A)'!P38=\"\",#N/A,'Planilha (A)'!P38)","v":{"$error":"#N/A"}},{"$f":"IF('Planilha (A)'!S38=\"\",#N/A,'Planilha (A)'!S38)","v":{"$error":"#N/A"}},{"$f":"IF('Planilha (A)'!V38=\"\",#N/A,'Planilha (A)'!V38)","v":{"$error":"#N/A"}},{"$f":"IF('Planilha (A)'!Y38=\"\",#N/A,'Planilha (A)'!Y38)","v":{"$error":"#N/A"}},{"$f":"IF('Planilha (A)'!AB38=\"\",#N/A,'Planilha (A)'!AB38)","v":{"$error":"#N/A"}},{"$f":"IF('Planilha (A)'!AE38=\"\",#N/A,'Planilha (A)'!AE38)","v":{"$error":"#N/A"}},{"$f":"IF('Planilha (A)'!AH38=\"\",#N/A,'Planilha (A)'!AH38)","v":{"$error":"#N/A"}},{"$f":"IF('Planilha (A)'!AK38=\"\",#N/A,'Planilha (A)'!AK38)","v":{"$error":"#N/A"}},{"$f":"IF('Planilha (A)'!AN38=\"\",#N/A,'Planilha (A)'!AN38)","v":{"$error":"#N/A"}},{"$f":"IF('Planilha (A)'!AQ38=\"\",#N/A,'Planilha (A)'!AQ38)","v":{"$error":"#N/A"}}]
[null,null,null,null,null,15,{"$f":"'Planilha (A)'!C39","v":""},{"$f":"'Planilha (A)'!B39","v":""},{"$f":"IF('Planilha (A)'!G39=\"\",#N/A,'Planilha (A)'!G39)","v":{"$error":"#N/A"}},{"$f":"IF('Planilha (A)'!J39=\"\",#N/A,'Planilha (A)'!J39)","v":{"$error":"#N/A"}},{"$f":"IF('Planilha (A)'!M39=\"\",#N/A,'Planilha (A)'!M39)","v":{"$error":"#N/A"}},{"$f":"IF('Planilha (A)'!P39=\"\",#N/A,'Planilha (A)'!P39)","v":{"$error":"#N/A"}},{"$f":"IF('Planilha (A)'!S39=\"\",#N/A,'Planilha (A)'!S39)","v":{"$error":"#N/A"}},{"$f":"IF('Planilha (A)'!V39=\"\",#N/A,'Planilha (A)'!V39)","v":{"$error":"#N/A"}},{"$f":"IF('Planilha (A)'!Y39=\"\",#N/A,'Planilha (A)'!Y39)","v":{"$error":"#N/A"}},{"$f":"IF('Planilha (A)'!AB39=\"\",#N/A,'Planilha (A)'!AB39)","v":{"$error":"#N/A"}},{"$f":"IF('Planilha (A)'!AE39=\"\",#N/A,'Planilha (A)'!AE39)","v":{"$error":"#N/A"}},{"$f":"IF('Planilha (A)'!AH39=\"\",#N/A,'Planilha (A)'!AH39)","v":{"$error":"#N/A"}},{"$f":"IF('Planilha (A)'!AK39=\"\",#N/A,'Planilha (A)'!AK39)","v":{"$error":"#N/A"}},{"$f":"IF('Planilha (A)'!AN39=\"\",#N/A,'Planilha (A)'!AN39)","v":{"$error":"#N/A"}},{"$f":"IF('Planilha (A)'!AQ39=\"\",#N/A,'Planilha (A)'!AQ39)","v":{"$error":"#N/A"}}]
[null,null,null,null,null,16,{"$f":"'Planilha (A)'!C40","v":""},{"$f":"'Planilha (A)'!B40","v":""},{"$f":"IF('Planilha (A)'!G40=\"\",#N/A,'Planilha (A)'!G40)","v":{"$error":"#N/A"}},{"$f":"IF('Planilha (A)'!J40=\"\",#N/A,'Planilha (A)'!J40)","v":{"$error":"#N/A"}},{"$f":"IF('Planilha (A)'!M40=\"\",#N/A,'Planilha (A)'!M40)","v":{"$error":"#N/A"}},{"$f":"IF('Planilha (A)'!P40=\"\",#N/A,'Planilha (A)'!P40)","v":{"$error":"#N/A"}},{"$f":"IF('Planilha (A)'!S40=\"\",#N/A,'Planilha (A)'!S40)","v":{"$error":"#N/A"}},{"$f":"IF('Planilha (A)'!V40=\"\",#N/A,'Planilha (A)'!V40)","v":{"$error":"#N/A"}},{"$f":"IF('Planilha (A)'!Y40=\"\",#N/A,'Planilha (A)'!Y40)","v":{"$error":"#N/A"}},{"$f":"IF('Planilha (A)'!AB40=\"\",#N/A,'Planilha (A)'!AB40)","v":{"$error":"#N/A"}},{"$f":"IF('Planilha (A)'!AE40=\"\",#N/A,'Planilha (A)'!AE40)","v":{"$error":"#N/A"}},{"$f":"IF('Planilha (A)'!AH40=\"\",#N/A,'Planilha (A)'!AH40)","v":{"$error":"#N/A"}},{"$f":"IF('Planilha (A)'!AK40=\"\",#N/A,'Planilha (A)'!AK40)","v":{"$error":"#N/A"}},{"$f":"IF('Planilha (A)'!AN40=\"\",#N/A,'Planilha (A)'!AN40)","v":{"$error":"#N/A"}},{"$f":"IF('Planilha (A)'!AQ40=\"\",#N/A,'Planilha (A)'!AQ40)","v":{"$error":"#N/A"}}]
[null,null,null,null,null,17,{"$f":"'Planilha (A)'!C41","v":""},{"$f":"'Planilha (A)'!B41","v":""},{"$f":"IF('Planilha (A)'!G41=\"\",#N/A,'Planilha (A)'!G41)","v":{"$error":"#N/A"}},{"$f":"IF('Planilha (A)'!J41=\"\",#N/A,'Planilha (A)'!J41)","v":{"$error":"#N/A"}},{"$f":"IF('Planilha (A)'!M41=\"\",#N/A,'Planilha (A)'!M41)","v":{"$error":"#N/A"}},{"$f":"IF('Planilha (A)'!P41=\"\",#N/A,'Planilha (A)'!P41)","v":{"$error":"#N/A"}},{"$f":"IF('Planilha (A)'!S41=\"\",#N/A,'Planilha (A)'!S41)","v":{"$error":"#N/A"}},{"$f":"IF('Planilha (A)'!V41=\"\",#N/A,'Planilha (A)'!V41)","v":{"$error":"#N/A"}},{"$f":"IF('Planilha (A)'!Y41=\"\",#N/A,'Planilha (A)'!Y41)","v":{"$error":"#N/A"}},{"$f":"IF('Planilha (A)'!AB41=\"\",#N/A,'Planilha (A)'!AB41)","v":{"$error":"#N/A"}},{"$f":"IF('Planilha (A)'!AE41=\"\",#N/A,'Planilha (A)'!AE41)","v":{"$error":"#N/A"}},{"$f":"IF('Planilha (A)'!AH41=\"\",#N/A,'Planilha (A)'!AH41)","v":{"$error":"#N/A"}},{"$f":"IF('Planilha (A)'!AK41=\"\",#N/A,'Planilha (A)'!AK41)","v":{"$error":"#N/A"}},{"$f":"IF('Planilha (A)'!AN41=\"\",#N/A,'Planilha (A)'!AN41)","v":{"$error":"#N/A"}},{"$f":"IF('Planilha (A)'!AQ41=\"\",#N/A,'Planilha (A)'!AQ41)","v":{"$error":"#N/A"}}]
[null,null,null,null,null,18,{"$f":"'Planilha (A)'!C42","v":""},{"$f":"'Planilha (A)'!B42","v":""},{"$f":"IF('Planilha (A)'!G42=\"\",#N/A,'Planilha (A)'!G42)","v":{"$error":"#N/A"}},{"$f":"IF('Planilha (A)'!J42=\"\",#N/A,'Planilha (A)'!J42)","v":{"$error":"#N/A"}},{"$f":"IF('Planilha (A)'!M42=\"\",#N/A,'Planilha (A)'!M42)","v":{"$error":"#N/A"}},{"$f":"IF('Planilha (A)'!P42=\"\",#N/A,'Planilha (A)'!P42)","v":{"$error":"#N/A"}},{"$f":"IF('Planilha (A)'!S42=\"\",#N/A,'Planilha (A)'!S42)","v":{"$error":"#N/A"}},{"$f":"IF('Planilha (A)'!V42=\"\",#N/A,'Planilha (A)'!V42)","v":{"$error":"#N/A"}},{"$f":"IF('Planilha (A)'!Y42=\"\",#N/A,'Planilha (A)'!Y42)","v":{"$error":"#N/A"}},{"$f":"IF('Planilha (A)'!AB42=\"\",#N/A,'Planilha (A)'!AB42)","v":{"$error":"#N/A"}},{"$f":"IF('Planilha (A)'!AE42=\"\",#N/A,'Planilha (A)'!AE42)","v":{"$error":"#N/A"}},{"$f":"IF('Planilha (A)'!AH42=\"\",#N/A,'Planilha (A)'!AH42)","v":{"$error":"#N/A"}},{"$f":"IF('Planilha (A)'!AK42=\"\",#N/A,'Planilha (A)'!AK42)","v":{"$error":"#N/A"}},{"$f":"IF('Planilha (A)'!AN42=\"\",#N/A,'Planilha (A)'!AN42)","v":{"$error":"#N/A"}},{"$f":"IF('Planilha (A)'!AQ42=\"\",#N/A,'Planilha (A)'!AQ42)","v":{"$error":"#N/A"}}]
[null,null,null,null,null,19,{"$f":"'Planilha (A)'!C43","v":""},{"$f":"'Planilha (A)'!B43","v":""},{"$f":"IF('Planilha (A)'!G43=\"\",#N/A,'Planilha (A)'!G43)","v":{"$error":"#N/A"}},{"$f":"IF('Planilha (A)'!J43=\"\",#N/A,'Planilha (A)'!J43)","v":{"$error":"#N/A"}},{"$f":"IF('Planilha (A)'!M43=\"\",#N/A,'Planilha (A)'!M43)","v":{"$error":"#N/A"}},{"$f":"IF('Planilha (A)'!P43=\"\",#N/A,'Planilha (A)'!P43)","v":{"$error":"#N/A"}},{"$f":"IF('Planilha (A)'!S43=\"\",#N/A,'Planilha (A)'!S43)","v":{"$error":"#N/A"}},{"$f":"IF('Planilha (A)'!V43=\"\",#N/A,'Planilha (A)'!V43)","v":{"$error":"#N/A"}},{"$f":"IF('Planilha (A)'!Y43=\"\",#N/A,'Planilha (A)'!Y43)","v":{"$error":"#N/A"}},{"$f":"IF('Planilha (A)'!AB43=\"\",#N/A,'Planilha (A)'!AB43)","v":{"$error":"#N/A"}},{"$f":"IF('Planilha (A)'!AE43=\"\",#N/A,'Planilha (A)'!AE43)","v":{"$error":"#N/A"}},{"$f":"IF('Planilha (A)'!AH43=\"\",#N/A,'Planilha (A)'!AH43)","v":{"$error":"#N/A"}},{"$f":"IF('Planilha (A)'!AK43=\"\",#N/A,'Planilha (A)'!AK43)","v":{"$error":"#N/A"}},{"$f":"IF('Planilha (A)'!AN43=\"\",#N/A,'Planilha (A)'!AN43)","v":{"$error":"#N/A"}},{"$f":"IF('Planilha (A)'!AQ43=\"\",#N/A,'Planilha (A)'!AQ43)","v":{"$error":"#N/A"}}]
[null,null,null,null,null,20,{"$f":"'Planilha (A)'!C44","v":""},{"$f":"'Planilha (A)'!B44","v":""},{"$f":"IF('Planilha (A)'!G44=\"\",#N/A,'Planilha (A)'!G44)","v":{"$error":"#N/A"}},{"$f":"IF('Planilha (A)'!J44=\"\",#N/A,'Planilha (A)'!J44)","v":{"$error":"#N/A"}},{"$f":"IF('Planilha (A)'!M44=\"\",#N/A,'Planilha (A)'!M44)","v":{"$error":"#N/A"}},{"$f":"IF('Planilha (A)'!P44=\"\",#N/A,'Planilha (A)'!P44)","v":{"$error":"#N/A"}},{"$f":"IF('Planilha (A)'!S44=\"\",#N/A,'Planilha (A)'!S44)","v":{"$error":"#N/A"}},{"$f":"IF('Planilha (A)'!V44=\"\",#N/A,'Planilha (A)'!V44)","v":{"$error":"#N/A"}},{"$f":"IF('Planilha (A)'!Y44=\"\",#N/A,'Planilha (A)'!Y44)","v":{"$error":"#N/A"}},{"$f":"IF('Planilha (A)'!AB44=\"\",#N/A,'Planilha (A)'!AB44)","v":{"$error":"#N/A"}},{"$f":"IF('Planilha (A)'!AE44=\"\",#N/A,'Planilha (A)'!AE44)","v":{"$error":"#N/A"}},{"$f":"IF('Planilha (A)'!AH44=\"\",#N/A,'Planilha (A)'!AH44)","v":{"$error":"#N/A"}},{"$f":"IF('Planilha (A)'!AK44=\"\",#N/A,'Planilha (A)'!AK44)","v":{"$error":"#N/A"}},{"$f":"IF('Planilha (A)'!AN44=\"\",#N/A,'Planilha (A)'!AN44)","v":{"$error":"#N/A"}},{"$f":"IF('Planilha (A)'!AQ44=\"\",#N/A,'Planilha (A)'!AQ44)","v":{"$error":"#N/A"}}]
[null,null,null,null,null,21,{"$f":"'Planilha (A)'!C45","v":""},{"$f":"'Planilha (A)'!B45","v":""},{"$f":"IF('Planilha (A)'!G45=\"\",#N/A,'Planilha (A)'!G45)","v":{"$error":"#N/A"}},{"$f":"IF('Planilha (A)'!J45=\"\",#N/A,'Planilha (A)'!J45)","v":{"$error":"#N/A"}},{"$f":"IF('Planilha (A)'!M45=\"\",#N/A,'Planilha (A)'!M45)","v":{"$error":"#N/A"}},{"$f":"IF('Planilha (A)'!P45=\"\",#N/A,'Planilha (A)'!P45)","v":{"$error":"#N/A"}},{"$f":"IF('Planilha (A)'!S45=\"\",#N/A,'Planilha (A)'!S45)","v":{"$error":"#N/A"}},{"$f":"IF('Planilha (A)'!V45=\"\",#N/A,'Planilha (A)'!V45)","v":{"$error":"#N/A"}},{"$f":"IF('Planilha (A)'!Y45=\"\",#N/A,'Planilha (A)'!Y45)","v":{"$error":"#N/A"}},{"$f":"IF('Planilha (A)'!AB45=\"\",#N/A,'Planilha (A)'!AB45)","v":{"$error":"#N/A"}},{"$f":"IF('Planilha (A)'!AE45=\"\",#N/A,'Planilha (A)'!AE45)","v":{"$error":"#N/A"}},{"$f":"IF('Planilha (A)'!AH45=\"\",#N/A,'Planilha (A)'!AH45)","v":{"$error":"#N/A"}},{"$f":"IF('Planilha (A)'!AK45=\"\",#N/A,'Planilha (A)'!AK45)","v":{"$error":"#N/A"}},{"$f":"IF('Planilha (A)'!AN45=\"\",#N/A,'Planilha (A)'!AN45)","v":{"$error":"#N/A"}},{"$f":"IF('Planilha (A)'!AQ45=\"\",#N/A,'Planilha (A)'!AQ45)","v":{"$error":"#N/A"}}]
[null,null,null,null,null,22,{"$f":"'Planilha (A)'!C46","v":""},{"$f":"'Planilha (A)'!B46","v":""},{"$f":"IF('Planilha (A)'!G46=\"\",#N/A,'Planilha (A)'!G46)","v":{"$error":"#N/A"}},{"$f":"IF('Planilha (A)'!J46=\"\",#N/A,'Planilha (A)'!J46)","v":{"$error":"#N/A"}},{"$f":"IF('Planilha (A)'!M46=\"\",#N/A,'Planilha (A)'!M46)","v":{"$error":"#N/A"}},{"$f":"IF('Planilha (A)'!P46=\"\",#N/A,'Planilha (A)'!P46)","v":{"$error":"#N/A"}},{"$f":"IF('Planilha (A)'!S46=\"\",#N/A,'Planilha (A)'!S46)","v":{"$error":"#N/A"}},{"$f":"IF('Planilha (A)'!V46=\"\",#N/A,'Planilha (A)'!V46)","v":{"$error":"#N/A"}},{"$f":"IF('Planilha (A)'!Y46=\"\",#N/A,'Planilha (A)'!Y46)","v":{"$error":"#N/A"}},{"$f":"IF('Planilha (A)'!AB46=\"\",#N/A,'Planilha (A)'!AB46)","v":{"$error":"#N/A"}},{"$f":"IF('Planilha (A)'!AE46=\"\",#N/A,'Planilha (A)'!AE46)","v":{"$error":"#N/A"}},{"$f":"IF('Planilha (A)'!AH46=\"\",#N/A,'Planilha (A)'!AH46)","v":{"$error":"#N/A"}},{"$f":"IF('Planilha (A)'!AK46=\"\",#N/A,'Planilha (A)'!AK46)","v":{"$error":"#N/A"}},{"$f":"IF('Planilha (A)'!AN46=\"\",#N/A,'Planilha (A)'!AN46)","v":{"$error":"#N/A"}},{"$f":"IF('Planilha (A)'!AQ46=\"\",#N/A,'Planilha (A)'!AQ46)","v":{"$error":"#N/A"}}]
[null,null,null,null,null,23,{"$f":"'Planilha (A)'!C47","v":""},{"$f":"'Planilha (A)'!B47","v":""},{"$f":"IF('Planilha (A)'!G47=\"\",#N/A,'Planilha (A)'!G47)","v":{"$error":"#N/A"}},{"$f":"IF('Planilha (A)'!J47=\"\",#N/A,'Planilha (A)'!J47)","v":{"$error":"#N/A"}},{"$f":"IF('Planilha (A)'!M47=\"\",#N/A,'Planilha (A)'!M47)","v":{"$error":"#N/A"}},{"$f":"IF('Planilha (A)'!P47=\"\",#N/A,'Planilha (A)'!P47)","v":{"$error":"#N/A"}},{"$f":"IF('Planilha (A)'!S47=\"\",#N/A,'Planilha (A)'!S47)","v":{"$error":"#N/A"}},{"$f":"IF('Planilha (A)'!V47=\"\",#N/A,'Planilha (A)'!V47)","v":{"$error":"#N/A"}},{"$f":"IF('Planilha (A)'!Y47=\"\",#N/A,'Planilha (A)'!Y47)","v":{"$error":"#N/A"}},{"$f":"IF('Planilha (A)'!AB47=\"\",#N/A,'Planilha (A)'!AB47)","v":{"$error":"#N/A"}},{"$f":"IF('Planilha (A)'!AE47=\"\",#N/A,'Planilha (A)'!AE47)","v":{"$error":"#N/A"}},{"$f":"IF('Planilha (A)'!AH47=\"\",#N/A,'Planilha (A)'!AH47)","v":{"$error":"#N/A"}},{"$f":"IF('Planilha (A)'!AK47=\"\",#N/A,'Planilha (A)'!AK47)","v":{"$error":"#N/A"}},{"$f":"IF('Planilha (A)'!AN47=\"\",#N/A,'Planilha (A)'!AN47)","v":{"$error":"#N/A"}},{"$f":"IF('Planilha (A)'!AQ47=\"\",#N/A,'Planilha (A)'!AQ47)","v":{"$error":"#N/A"}}]
[null,null,null,null,null,24,{"$f":"'Planilha (A)'!C48","v":""},{"$f":"'Planilha (A)'!B48","v":""},{"$f":"IF('Planilha (A)'!G48=\"\",#N/A,'Planilha (A)'!G48)","v":{"$error":"#N/A"}},{"$f":"IF('Planilha (A)'!J48=\"\",#N/A,'Planilha (A)'!J48)","v":{"$error":"#N/A"}},{"$f":"IF('Planilha (A)'!M48=\"\",#N/A,'Planilha (A)'!M48)","v":{"$error":"#N/A"}},{"$f":"IF('Planilha (A)'!P48=\"\",#N/A,'Planilha (A)'!P48)","v":{"$error":"#N/A"}},{"$f":"IF('Planilha (A)'!S48=\"\",#N/A,'Planilha (A)'!S48)","v":{"$error":"#N/A"}},{"$f":"IF('Planilha (A)'!V48=\"\",#N/A,'Planilha (A)'!V48)","v":{"$error":"#N/A"}},{"$f":"IF('Planilha (A)'!Y48=\"\",#N/A,'Planilha (A)'!Y48)","v":{"$error":"#N/A"}},{"$f":"IF('Planilha (A)'!AB48=\"\",#N/A,'Planilha (A)'!AB48)","v":{"$error":"#N/A"}},{"$f":"IF('Planilha (A)'!AE48=\"\",#N/A,'Planilha (A)'!AE48)","v":{"$error":"#N/A"}},{"$f":"IF('Planilha (A)'!AH48=\"\",#N/A,'Planilha (A)'!AH48)","v":{"$error":"#N/A"}},{"$f":"IF('Planilha (A)'!AK48=\"\",#N/A,'Planilha (A)'!AK48)","v":{"$error":"#N/A"}},{"$f":"IF('Planilha (A)'!AN48=\"\",#N/A,'Planilha (A)'!AN48)","v":{"$error":"#N/A"}},{"$f":"IF('Planilha (A)'!AQ48=\"\",#N/A,'Planilha (A)'!AQ48)","v":{"$error":"#N/A"}}]
[null,null,null,null,null,25,{"$f":"'Planilha (A)'!C49","v":""},{"$f":"'Planilha (A)'!B49","v":""},{"$f":"IF('Planilha (A)'!G49=\"\",#N/A,'Planilha (A)'!G49)","v":{"$error":"#N/A"}},{"$f":"IF('Planilha (A)'!J49=\"\",#N/A,'Planilha (A)'!J49)","v":{"$error":"#N/A"}},{"$f":"IF('Planilha (A)'!M49=\"\",#N/A,'Planilha (A)'!M49)","v":{"$error":"#N/A"}},{"$f":"IF('Planilha (A)'!P49=\"\",#N/A,'Planilha (A)'!P49)","v":{"$error":"#N/A"}},{"$f":"IF('Planilha (A)'!S49=\"\",#N/A,'Planilha (A)'!S49)","v":{"$error":"#N/A"}},{"$f":"IF('Planilha (A)'!V49=\"\",#N/A,'Planilha (A)'!V49)","v":{"$error":"#N/A"}},{"$f":"IF('Planilha (A)'!Y49=\"\",#N/A,'Planilha (A)'!Y49)","v":{"$error":"#N/A"}},{"$f":"IF('Planilha (A)'!AB49=\"\",#N/A,'Planilha (A)'!AB49)","v":{"$error":"#N/A"}},{"$f":"IF('Planilha (A)'!AE49=\"\",#N/A,'Planilha (A)'!AE49)","v":{"$error":"#N/A"}},{"$f":"IF('Planilha (A)'!AH49=\"\",#N/A,'Planilha (A)'!AH49)","v":{"$error":"#N/A"}},{"$f":"IF('Planilha (A)'!AK49=\"\",#N/A,'Planilha (A)'!AK49)","v":{"$error":"#N/A"}},{"$f":"IF('Planilha (A)'!AN49=\"\",#N/A,'Planilha (A)'!AN49)","v":{"$error":"#N/A"}},{"$f":"IF('Planilha (A)'!AQ49=\"\",#N/A,'Planilha (A)'!AQ49)","v":{"$error":"#N/A"}}]
[null,null,null,null,null,26,{"$f":"'Planilha (A)'!C50","v":""},{"$f":"'Planilha (A)'!B50","v":""},{"$f":"IF('Planilha (A)'!G50=\"\",#N/A,'Planilha (A)'!G50)","v":{"$error":"#N/A"}},{"$f":"IF('Planilha (A)'!J50=\"\",#N/A,'Planilha (A)'!J50)","v":{"$error":"#N/A"}},{"$f":"IF('Planilha (A)'!M50=\"\",#N/A,'Planilha (A)'!M50)","v":{"$error":"#N/A"}},{"$f":"IF('Planilha (A)'!P50=\"\",#N/A,'Planilha (A)'!P50)","v":{"$error":"#N/A"}},{"$f":"IF('Planilha (A)'!S50=\"\",#N/A,'Planilha (A)'!S50)","v":{"$error":"#N/A"}},{"$f":"IF('Planilha (A)'!V50=\"\",#N/A,'Planilha (A)'!V50)","v":{"$error":"#N/A"}},{"$f":"IF('Planilha (A)'!Y50=\"\",#N/A,'Planilha (A)'!Y50)","v":{"$error":"#N/A"}},{"$f":"IF('Planilha (A)'!AB50=\"\",#N/A,'Planilha (A)'!AB50)","v":{"$error":"#N/A"}},{"$f":"IF('Planilha (A)'!AE50=\"\",#N/A,'Planilha (A)'!AE50)","v":{"$error":"#N/A"}},{"$f":"IF('Planilha (A)'!AH50=\"\",#N/A,'Planilha (A)'!AH50)","v":{"$error":"#N/A"}},{"$f":"IF('Planilha (A)'!AK50=\"\",#N/A,'Planilha (A)'!AK50)","v":{"$error":"#N/A"}},{"$f":"IF('Planilha (A)'!AN50=\"\",#N/A,'Planilha (A)'!AN50)","v":{"$error":"#N/A"}},{"$f":"IF('Planilha (A)'!AQ50=\"\",#N/A,'Planilha (A)'!AQ50)","v":{"$error":"#N/A"}}]
[null,null,null,null,null,27,{"$f":"'Planilha (A)'!C51","v":""},{"$f":"'Planilha (A)'!B51","v":""},{"$f":"IF('Planilha (A)'!G51=\"\",#N/A,'Planilha (A)'!G51)","v":{"$error":"#N/A"}},{"$f":"IF('Planilha (A)'!J51=\"\",#N/A,'Planilha (A)'!J51)","v":{"$error":"#N/A"}},{"$f":"IF('Planilha (A)'!M51=\"\",#N/A,'Planilha (A)'!M51)","v":{"$error":"#N/A"}},{"$f":"IF('Planilha (A)'!P51=\"\",#N/A,'Planilha (A)'!P51)","v":{"$error":"#N/A"}},{"$f":"IF('Planilha (A)'!S51=\"\",#N/A,'Planilha (A)'!S51)","v":{"$error":"#N/A"}},{"$f":"IF('Planilha (A)'!V51=\"\",#N/A,'Planilha (A)'!V51)","v":{"$error":"#N/A"}},{"$f":"IF('Planilha (A)'!Y51=\"\",#N/A,'Planilha (A)'!Y51)","v":{"$error":"#N/A"}},{"$f":"IF('Planilha (A)'!AB51=\"\",#N/A,'Planilha (A)'!AB51)","v":{"$error":"#N/A"}},{"$f":"IF('Planilha (A)'!AE51=\"\",#N/A,'Planilha (A)'!AE51)","v":{"$error":"#N/A"}},{"$f":"IF('Planilha (A)'!AH51=\"\",#N/A,'Planilha (A)'!AH51)","v":{"$error":"#N/A"}},{"$f":"IF('Planilha (A)'!AK51=\"\",#N/A,'Planilha (A)'!AK51)","v":{"$error":"#N/A"}},{"$f":"IF('Planilha (A)'!AN51=\"\",#N/A,'Planilha (A)'!AN51)","v":{"$error":"#N/A"}},{"$f":"IF('Planilha (A)'!AQ51=\"\",#N/A,'Planilha (A)'!AQ51)","v":{"$error":"#N/A"}}]
[null,null,null,null,null,28,{"$f":"'Planilha (A)'!C52","v":""},{"$f":"'Planilha (A)'!B52","v":""},{"$f":"IF('Planilha (A)'!G52=\"\",#N/A,'Planilha (A)'!G52)","v":{"$error":"#N/A"}},{"$f":"IF('Planilha (A)'!J52=\"\",#N/A,'Planilha (A)'!J52)","v":{"$error":"#N/A"}},{"$f":"IF('Planilha (A)'!M52=\"\",#N/A,'Planilha (A)'!M52)","v":{"$error":"#N/A"}},{"$f":"IF('Planilha (A)'!P52=\"\",#N/A,'Planilha (A)'!P52)","v":{"$error":"#N/A"}},{"$f":"IF('Planilha (A)'!S52=\"\",#N/A,'Planilha (A)'!S52)","v":{"$error":"#N/A"}},{"$f":"IF('Planilha (A)'!V52=\"\",#N/A,'Planilha (A)'!V52)","v":{"$error":"#N/A"}},{"$f":"IF('Planilha (A)'!Y52=\"\",#N/A,'Planilha (A)'!Y52)","v":{"$error":"#N/A"}},{"$f":"IF('Planilha (A)'!AB52=\"\",#N/A,'Planilha (A)'!AB52)","v":{"$error":"#N/A"}},{"$f":"IF('Planilha (A)'!AE52=\"\",#N/A,'Planilha (A)'!AE52)","v":{"$error":"#N/A"}},{"$f":"IF('Planilha (A)'!AH52=\"\",#N/A,'Planilha (A)'!AH52)","v":{"$error":"#N/A"}},{"$f":"IF('Planilha (A)'!AK52=\"\",#N/A,'Planilha (A)'!AK52)","v":{"$error":"#N/A"}},{"$f":"IF('Planilha (A)'!AN52=\"\",#N/A,'Planilha (A)'!AN52)","v":{"$error":"#N/A"}},{"$f":"IF('Planilha (A)'!AQ52=\"\",#N/A,'Planilha (A)'!AQ52)","v":{"$error":"#N/A"}}]
[null,null,null,null,null,29,{"$f":"'Planilha (A)'!C53","v":""},{"$f":"'Planilha (A)'!B53","v":""},{"$f":"IF('Planilha (A)'!G53=\"\",#N/A,'Planilha (A)'!G53)","v":{"$error":"#N/A"}},{"$f":"IF('Planilha (A)'!J53=\"\",#N/A,'Planilha (A)'!J53)","v":{"$error":"#N/A"}},{"$f":"IF('Planilha (A)'!M53=\"\",#N/A,'Planilha (A)'!M53)","v":{"$error":"#N/A"}},{"$f":"IF('Planilha (A)'!P53=\"\",#N/A,'Planilha (A)'!P53)","v":{"$error":"#N/A"}},{"$f":"IF('Planilha (A)'!S53=\"\",#N/A,'Planilha (A)'!S53)","v":{"$error":"#N/A"}},{"$f":"IF('Planilha (A)'!V53=\"\",#N/A,'Planilha (A)'!V53)","v":{"$error":"#N/A"}},{"$f":"IF('Planilha (A)'!Y53=\"\",#N/A,'Planilha (A)'!Y53)","v":{"$error":"#N/A"}},{"$f":"IF('Planilha (A)'!AB53=\"\",#N/A,'Planilha (A)'!AB53)","v":{"$error":"#N/A"}},{"$f":"IF('Planilha (A)'!AE53=\"\",#N/A,'Planilha (A)'!AE53)","v":{"$error":"#N/A"}},{"$f":"IF('Planilha (A)'!AH53=\"\",#N/A,'Planilha (A)'!AH53)","v":{"$error":"#N/A"}},{"$f":"IF('Planilha (A)'!AK53=\"\",#N/A,'Planilha (A)'!AK53)","v":{"$error":"#N/A"}},{"$f":"IF('Planilha (A)'!AN53=\"\",#N/A,'Planilha (A)'!AN53)","v":{"$error":"#N/A"}},{"$f":"IF('Planilha (A)'!AQ53=\"\",#N/A,'Planilha (A)'!AQ53)","v":{"$error":"#N/A"}}]
[null,null,null,null,null,30,{"$f":"'Planilha (A)'!C54","v":""},{"$f":"'Planilha (A)'!B54","v":""},{"$f":"IF('Planilha (A)'!G54=\"\",#N/A,'Planilha (A)'!G54)","v":{"$error":"#N/A"}},{"$f":"IF('Planilha (A)'!J54=\"\",#N/A,'Planilha (A)'!J54)","v":{"$error":"#N/A"}},{"$f":"IF('Planilha (A)'!M54=\"\",#N/A,'Planilha (A)'!M54)","v":{"$error":"#N/A"}},{"$f":"IF('Planilha (A)'!P54=\"\",#N/A,'Planilha (A)'!P54)","v":{"$error":"#N/A"}},{"$f":"IF('Planilha (A)'!S54=\"\",#N/A,'Planilha (A)'!S54)","v":{"$error":"#N/A"}},{"$f":"IF('Planilha (A)'!V54=\"\",#N/A,'Planilha (A)'!V54)","v":{"$error":"#N/A"}},{"$f":"IF('Planilha (A)'!Y54=\"\",#N/A,'Planilha (A)'!Y54)","v":{"$error":"#N/A"}},{"$f":"IF('Planilha (A)'!AB54=\"\",#N/A,'Planilha (A)'!AB54)","v":{"$error":"#N/A"}},{"$f":"IF('Planilha (A)'!AE54=\"\",#N/A,'Planilha (A)'!AE54)","v":{"$error":"#N/A"}},{"$f":"IF('Planilha (A)'!AH54=\"\",#N/A,'Planilha (A)'!AH54)","v":{"$error":"#N/A"}},{"$f":"IF('Planilha (A)'!AK54=\"\",#N/A,'Planilha (A)'!AK54)","v":{"$error":"#N/A"}},{"$f":"IF('Planilha (A)'!AN54=\"\",#N/A,'Planilha (A)'!AN54)","v":{"$error":"#N/A"}},{"$f":"IF('Planilha (A)'!AQ54=\"\",#N/A,'Planilha (A)'!AQ54)","v":{"$error":"#N/A"}}]
[null,null,null,null,null,31,{"$f":"'Planilha (A)'!C55","v":""},{"$f":"'Planilha (A)'!B55","v":""},{"$f":"IF('Planilha (A)'!G55=\"\",#N/A,'Planilha (A)'!G55)","v":{"$error":"#N/A"}},{"$f":"IF('Planilha (A)'!J55=\"\",#N/A,'Planilha (A)'!J55)","v":{"$error":"#N/A"}},{"$f":"IF('Planilha (A)'!M55=\"\",#N/A,'Planilha (A)'!M55)","v":{"$error":"#N/A"}},{"$f":"IF('Planilha (A)'!P55=\"\",#N/A,'Planilha (A)'!P55)","v":{"$error":"#N/A"}},{"$f":"IF('Planilha (A)'!S55=\"\",#N/A,'Planilha (A)'!S55)","v":{"$error":"#N/A"}},{"$f":"IF('Planilha (A)'!V55=\"\",#N/A,'Planilha (A)'!V55)","v":{"$error":"#N/A"}},{"$f":"IF('Planilha (A)'!Y55=\"\",#N/A,'Planilha (A)'!Y55)","v":{"$error":"#N/A"}},{"$f":"IF('Planilha (A)'!AB55=\"\",#N/A,'Planilha (A)'!AB55)","v":{"$error":"#N/A"}},{"$f":"IF('Planilha (A)'!AE55=\"\",#N/A,'Planilha (A)'!AE55)","v":{"$error":"#N/A"}},{"$f":"IF('Planilha (A)'!AH55=\"\",#N/A,'Planilha (A)'!AH55)","v":{"$error":"#N/A"}},{"$f":"IF('Planilha (A)'!AK55=\"\",#N/A,'Planilha (A)'!AK55)","v":{"$error":"#N/A"}},{"$f":"IF('Planilha (A)'!AN55=\"\",#N/A,'Planilha (A)'!AN55)","v":{"$error":"#N/A"}},{"$f":"IF('Planilha (A)'!AQ55=\"\",#N/A,'Planilha (A)'!AQ55)","v":{"$error":"#N/A"}}]
[null,null,null,null,null,32,{"$f":"'Planilha (A)'!C56","v":""},{"$f":"'Planilha (A)'!B56","v":""},{"$f":"IF('Planilha (A)'!G56=\"\",#N/A,'Planilha (A)'!G56)","v":{"$error":"#N/A"}},{"$f":"IF('Planilha (A)'!J56=\"\",#N/A,'Planilha (A)'!J56)","v":{"$error":"#N/A"}},{"$f":"IF('Planilha (A)'!M56=\"\",#N/A,'Planilha (A)'!M56)","v":{"$error":"#N/A"}},{"$f":"IF('Planilha (A)'!P56=\"\",#N/A,'Planilha (A)'!P56)","v":{"$error":"#N/A"}},{"$f":"IF('Planilha (A)'!S56=\"\",#N/A,'Planilha (A)'!S56)","v":{"$error":"#N/A"}},{"$f":"IF('Planilha (A)'!V56=\"\",#N/A,'Planilha (A)'!V56)","v":{"$error":"#N/A"}},{"$f":"IF('Planilha (A)'!Y56=\"\",#N/A,'Planilha (A)'!Y56)","v":{"$error":"#N/A"}},{"$f":"IF('Planilha (A)'!AB56=\"\",#N/A,'Planilha (A)'!AB56)","v":{"$error":"#N/A"}},{"$f":"IF('Planilha (A)'!AE56=\"\",#N/A,'Planilha (A)'!AE56)","v":{"$error":"#N/A"}},{"$f":"IF('Planilha (A)'!AH56=\"\",#N/A,'Planilha (A)'!AH56)","v":{"$error":"#N/A"}},{"$f":"IF('Planilha (A)'!AK56=\"\",#N/A,'Planilha (A)'!AK56)","v":{"$error":"#N/A"}},{"$f":"IF('Planilha (A)'!AN56=\"\",#N/A,'Planilha (A)'!AN56)","v":{"$error":"#N/A"}},{"$f":"IF('Planilha (A)'!AQ56=\"\",#N/A,'Planilha (A)'!AQ56)","v":{"$error":"#N/A"}}]
[null,null,null,null,null,33,{"$f":"'Planilha (A)'!C57","v":""},{"$f":"'Planilha (A)'!B57","v":""},{"$f":"IF('Planilha (A)'!G57=\"\",#N/A,'Planilha (A)'!G57)","v":{"$error":"#N/A"}},{"$f":"IF('Planilha (A)'!J57=\"\",#N/A,'Planilha (A)'!J57)","v":{"$error":"#N/A"}},{"$f":"IF('Planilha (A)'!M57=\"\",#N/A,'Planilha (A)'!M57)","v":{"$error":"#N/A"}},{"$f":"IF('Planilha (A)'!P57=\"\",#N/A,'Planilha (A)'!P57)","v":{"$error":"#N/A"}},{"$f":"IF('Planilha (A)'!S57=\"\",#N/A,'Planilha (A)'!S57)","v":{"$error":"#N/A"}},{"$f":"IF('Planilha (A)'!V57=\"\",#N/A,'Planilha (A)'!V57)","v":{"$error":"#N/A"}},{"$f":"IF('Planilha (A)'!Y57=\"\",#N/A,'Planilha (A)'!Y57)","v":{"$error":"#N/A"}},{"$f":"IF('Planilha (A)'!AB57=\"\",#N/A,'Planilha (A)'!AB57)","v":{"$error":"#N/A"}},{"$f":"IF('Planilha (A)'!AE57=\"\",#N/A,'Planilha (A)'!AE57)","v":{"$error":"#N/A"}},{"$f":"IF('Planilha (A)'!AH57=\"\",#N/A,'Planilha (A)'!AH57)","v":{"$error":"#N/A"}},{"$f":"IF('Planilha (A)'!AK57=\"\",#N/A,'Planilha (A)'!AK57)","v":{"$error":"#N/A"}},{"$f":"IF('Planilha (A)'!AN57=\"\",#N/A,'Planilha (A)'!AN57)","v":{"$error":"#N/A"}},{"$f":"IF('Planilha (A)'!AQ57=\"\",#N/A,'Planilha (A)'!AQ57)","v":{"$error":"#N/A"}}]
[null,null,null,null,null,34,{"$f":"'Planilha (A)'!C58","v":""},{"$f":"'Planilha (A)'!B58","v":""},{"$f":"IF('Planilha (A)'!G58=\"\",#N/A,'Planilha (A)'!G58)","v":{"$error":"#N/A"}},{"$f":"IF('Planilha (A)'!J58=\"\",#N/A,'Planilha (A)'!J58)","v":{"$error":"#N/A"}},{"$f":"IF('Planilha (A)'!M58=\"\",#N/A,'Planilha (A)'!M58)","v":{"$error":"#N/A"}},{"$f":"IF('Planilha (A)'!P58=\"\",#N/A,'Planilha (A)'!P58)","v":{"$error":"#N/A"}},{"$f":"IF('Planilha (A)'!S58=\"\",#N/A,'Planilha (A)'!S58)","v":{"$error":"#N/A"}},{"$f":"IF('Planilha (A)'!V58=\"\",#N/A,'Planilha (A)'!V58)","v":{"$error":"#N/A"}},{"$f":"IF('Planilha (A)'!Y58=\"\",#N/A,'Planilha (A)'!Y58)","v":{"$error":"#N/A"}},{"$f":"IF('Planilha (A)'!AB58=\"\",#N/A,'Planilha (A)'!AB58)","v":{"$error":"#N/A"}},{"$f":"IF('Planilha (A)'!AE58=\"\",#N/A,'Planilha (A)'!AE58)","v":{"$error":"#N/A"}},{"$f":"IF('Planilha (A)'!AH58=\"\",#N/A,'Planilha (A)'!AH58)","v":{"$error":"#N/A"}},{"$f":"IF('Planilha (A)'!AK58=\"\",#N/A,'Planilha (A)'!AK58)","v":{"$error":"#N/A"}},{"$f":"IF('Planilha (A)'!AN58=\"\",#N/A,'Planilha (A)'!AN58)","v":{"$error":"#N/A"}},{"$f":"IF('Planilha (A)'!AQ58=\"\",#N/A,'Planilha (A)'!AQ58)","v":{"$error":"#N/A"}}]
[null,null,null,null,null,35,{"$f":"'Planilha (A)'!C59","v":""},{"$f":"'Planilha (A)'!B59","v":""},{"$f":"IF('Planilha (A)'!G59=\"\",#N/A,'Planilha (A)'!G59)","v":{"$error":"#N/A"}},{"$f":"IF('Planilha (A)'!J59=\"\",#N/A,'Planilha (A)'!J59)","v":{"$error":"#N/A"}},{"$f":"IF('Planilha (A)'!M59=\"\",#N/A,'Planilha (A)'!M59)","v":{"$error":"#N/A"}},{"$f":"IF('Planilha (A)'!P59=\"\",#N/A,'Planilha (A)'!P59)","v":{"$error":"#N/A"}},{"$f":"IF('Planilha (A)'!S59=\"\",#N/A,'Planilha (A)'!S59)","v":{"$error":"#N/A"}},{"$f":"IF('Planilha (A)'!V59=\"\",#N/A,'Planilha (A)'!V59)","v":{"$error":"#N/A"}},{"$f":"IF('Planilha (A)'!Y59=\"\",#N/A,'Planilha (A)'!Y59)","v":{"$error":"#N/A"}},{"$f":"IF('Planilha (A)'!AB59=\"\",#N/A,'Planilha (A)'!AB59)","v":{"$error":"#N/A"}},{"$f":"IF('Planilha (A)'!AE59=\"\",#N/A,'Planilha (A)'!AE59)","v":{"$error":"#N/A"}},{"$f":"IF('Planilha (A)'!AH59=\"\",#N/A,'Planilha (A)'!AH59)","v":{"$error":"#N/A"}},{"$f":"IF('Planilha (A)'!AK59=\"\",#N/A,'Planilha (A)'!AK59)","v":{"$error":"#N/A"}},{"$f":"IF('Planilha (A)'!AN59=\"\",#N/A,'Planilha (A)'!AN59)","v":{"$error":"#N/A"}},{"$f":"IF('Planilha (A)'!AQ59=\"\",#N/A,'Planilha (A)'!AQ59)","v":{"$error":"#N/A"}}]
[null,null,null,null,null,36,{"$f":"'Planilha (A)'!C60","v":""},{"$f":"'Planilha (A)'!B60","v":""},{"$f":"IF('Planilha (A)'!G60=\"\",#N/A,'Planilha (A)'!G60)","v":{"$error":"#N/A"}},{"$f":"IF('Planilha (A)'!J60=\"\",#N/A,'Planilha (A)'!J60)","v":{"$error":"#N/A"}},{"$f":"IF('Planilha (A)'!M60=\"\",#N/A,'Planilha (A)'!M60)","v":{"$error":"#N/A"}},{"$f":"IF('Planilha (A)'!P60=\"\",#N/A,'Planilha (A)'!P60)","v":{"$error":"#N/A"}},{"$f":"IF('Planilha (A)'!S60=\"\",#N/A,'Planilha (A)'!S60)","v":{"$error":"#N/A"}},{"$f":"IF('Planilha (A)'!V60=\"\",#N/A,'Planilha (A)'!V60)","v":{"$error":"#N/A"}},{"$f":"IF('Planilha (A)'!Y60=\"\",#N/A,'Planilha (A)'!Y60)","v":{"$error":"#N/A"}},{"$f":"IF('Planilha (A)'!AB60=\"\",#N/A,'Planilha (A)'!AB60)","v":{"$error":"#N/A"}},{"$f":"IF('Planilha (A)'!AE60=\"\",#N/A,'Planilha (A)'!AE60)","v":{"$error":"#N/A"}},{"$f":"IF('Planilha (A)'!AH60=\"\",#N/A,'Planilha (A)'!AH60)","v":{"$error":"#N/A"}},{"$f":"IF('Planilha (A)'!AK60=\"\",#N/A,'Planilha (A)'!AK60)","v":{"$error":"#N/A"}},{"$f":"IF('Planilha (A)'!AN60=\"\",#N/A,'Planilha (A)'!AN60)","v":{"$error":"#N/A"}},{"$f":"IF('Planilha (A)'!AQ60=\"\",#N/A,'Planilha (A)'!AQ60)","v":{"$error":"#N/A"}}]
[null,null,null,null,null,37,{"$f":"'Planilha (A)'!C61","v":""},{"$f":"'Planilha (A)'!B61","v":""},{"$f":"IF('Planilha (A)'!G61=\"\",#N/A,'Planilha (A)'!G61)","v":{"$error":"#N/A"}},{"$f":"IF('Planilha (A)'!J61=\"\",#N/A,'Planilha (A)'!J61)","v":{"$error":"#N/A"}},{"$f":"IF('Planilha (A)'!M61=\"\",#N/A,'Planilha (A)'!M61)","v":{"$error":"#N/A"}},{"$f":"IF('Planilha (A)'!P61=\"\",#N/A,'Planilha (A)'!P61)","v":{"$error":"#N/A"}},{"$f":"IF('Planilha (A)'!S61=\"\",#N/A,'Planilha (A)'!S61)","v":{"$error":"#N/A"}},{"$f":"IF('Planilha (A)'!V61=\"\",#N/A,'Planilha (A)'!V61)","v":{"$error":"#N/A"}},{"$f":"IF('Planilha (A)'!Y61=\"\",#N/A,'Planilha (A)'!Y61)","v":{"$error":"#N/A"}},{"$f":"IF('Planilha (A)'!AB61=\"\",#N/A,'Planilha (A)'!AB61)","v":{"$error":"#N/A"}},{"$f":"IF('Planilha (A)'!AE61=\"\",#N/A,'Planilha (A)'!AE61)","v":{"$error":"#N/A"}},{"$f":"IF('Planilha (A)'!AH61=\"\",#N/A,'Planilha (A)'!AH61)","v":{"$error":"#N/A"}},{"$f":"IF('Planilha (A)'!AK61=\"\",#N/A,'Planilha (A)'!AK61)","v":{"$error":"#N/A"}},{"$f":"IF('Planilha (A)'!AN61=\"\",#N/A,'Planilha (A)'!AN61)","v":{"$error":"#N/A"}},{"$f":"IF('Planilha (A)'!AQ61=\"\",#N/A,'Planilha (A)'!AQ61)","v":{"$error":"#N/A"}}]
[null,null,null,null,null,38,{"$f":"'Planilha (A)'!C62","v":""},{"$f":"'Planilha (A)'!B62","v":""},{"$f":"IF('Planilha (A)'!G62=\"\",#N/A,'Planilha (A)'!G62)","v":{"$error":"#N/A"}},{"$f":"IF('Planilha (A)'!J62=\"\",#N/A,'Planilha (A)'!J62)","v":{"$error":"#N/A"}},{"$f":"IF('Planilha (A)'!M62=\"\",#N/A,'Planilha (A)'!M62)","v":{"$error":"#N/A"}},{"$f":"IF('Planilha (A)'!P62=\"\",#N/A,'Planilha (A)'!P62)","v":{"$error":"#N/A"}},{"$f":"IF('Planilha (A)'!S62=\"\",#N/A,'Planilha (A)'!S62)","v":{"$error":"#N/A"}},{"$f":"IF('Planilha (A)'!V62=\"\",#N/A,'Planilha (A)'!V62)","v":{"$error":"#N/A"}},{"$f":"IF('Planilha (A)'!Y62=\"\",#N/A,'Planilha (A)'!Y62)","v":{"$error":"#N/A"}},{"$f":"IF('Planilha (A)'!AB62=\"\",#N/A,'Planilha (A)'!AB62)","v":{"$error":"#N/A"}},{"$f":"IF('Planilha (A)'!AE62=\"\",#N/A,'Planilha (A)'!AE62)","v":{"$error":"#N/A"}},{"$f":"IF('Planilha (A)'!AH62=\"\",#N/A,'Planilha (A)'!AH62)","v":{"$error":"#N/A"}},{"$f":"IF('Planilha (A)'!AK62=\"\",#N/A,'Planilha (A)'!AK62)","v":{"$error":"#N/A"}},{"$f":"IF('Planilha (A)'!AN62=\"\",#N/A,'Planilha (A)'!AN62)","v":{"$error":"#N/A"}},{"$f":"IF('Planilha (A)'!AQ62=\"\",#N/A,'Planilha (A)'!AQ62)","v":{"$error":"#N/A"}}]
[null,null,null,null,null,39,{"$f":"'Planilha (A)'!C63","v":""},{"$f":"'Planilha (A)'!B63","v":""},{"$f":"IF('Planilha (A)'!G63=\"\",#N/A,'Planilha (A)'!G63)","v":{"$error":"#N/A"}},{"$f":"IF('Planilha (A)'!J63=\"\",#N/A,'Planilha (A)'!J63)","v":{"$error":"#N/A"}},{"$f":"IF('Planilha (A)'!M63=\"\",#N/A,'Planilha (A)'!M63)","v":{"$error":"#N/A"}},{"$f":"IF('Planilha (A)'!P63=\"\",#N/A,'Planilha (A)'!P63)","v":{"$error":"#N/A"}},{"$f":"IF('Planilha (A)'!S63=\"\",#N/A,'Planilha (A)'!S63)","v":{"$error":"#N/A"}},{"$f":"IF('Planilha (A)'!V63=\"\",#N/A,'Planilha (A)'!V63)","v":{"$error":"#N/A"}},{"$f":"IF('Planilha (A)'!Y63=\"\",#N/A,'Planilha (A)'!Y63)","v":{"$error":"#N/A"}},{"$f":"IF('Planilha (A)'!AB63=\"\",#N/A,'Planilha (A)'!AB63)","v":{"$error":"#N/A"}},{"$f":"IF('Planilha (A)'!AE63=\"\",#N/A,'Planilha (A)'!AE63)","v":{"$error":"#N/A"}},{"$f":"IF('Planilha (A)'!AH63=\"\",#N/A,'Planilha (A)'!AH63)","v":{"$error":"#N/A"}},{"$f":"IF('Planilha (A)'!AK63=\"\",#N/A,'Planilha (A)'!AK63)","v":{"$error":"#N/A"}},{"$f":"IF('Planilha (A)'!AN63=\"\",#N/A,'Planilha (A)'!AN63)","v":{"$error":"#N/A"}},{"$f":"IF('Planilha (A)'!AQ63=\"\",#N/A,'Planilha (A)'!AQ63)","v":{"$error":"#N/A"}}]
[null,null,null,null,null,40,{"$f":"'Planilha (A)'!C64","v":""},{"$f":"'Planilha (A)'!B64","v":""},{"$f":"IF('Planilha (A)'!G64=\"\",#N/A,'Planilha (A)'!G64)","v":{"$error":"#N/A"}},{"$f":"IF('Planilha (A)'!J64=\"\",#N/A,'Planilha (A)'!J64)","v":{"$error":"#N/A"}},{"$f":"IF('Planilha (A)'!M64=\"\",#N/A,'Planilha (A)'!M64)","v":{"$error":"#N/A"}},{"$f":"IF('Planilha (A)'!P64=\"\",#N/A,'Planilha (A)'!P64)","v":{"$error":"#N/A"}},{"$f":"IF('Planilha (A)'!S64=\"\",#N/A,'Planilha (A)'!S64)","v":{"$error":"#N/A"}},{"$f":"IF('Planilha (A)'!V64=\"\",#N/A,'Planilha (A)'!V64)","v":{"$error":"#N/A"}},{"$f":"IF('Planilha (A)'!Y64=\"\",#N/A,'Planilha (A)'!Y64)","v":{"$error":"#N/A"}},{"$f":"IF('Planilha (A)'!AB64=\"\",#N/A,'Planilha (A)'!AB64)","v":{"$error":"#N/A"}},{"$f":"IF('Planilha (A)'!AE64=\"\",#N/A,'Planilha (A)'!AE64)","v":{"$error":"#N/A"}},{"$f":"IF('Planilha (A)'!AH64=\"\",#N/A,'Planilha (A)'!AH64)","v":{"$error":"#N/A"}},{"$f":"IF('Planilha (A)'!AK64=\"\",#N/A,'Planilha (A)'!AK64)","v":{"$error":"#N/A"}},{"$f":"IF('Planilha (A)'!AN64=\"\",#N/A,'Planilha (A)'!AN64)","v":{"$error":"#N/A"}},{"$f":"IF('Planilha (A)'!AQ64=\"\",#N/A,'Planilha (A)'!AQ64)","v":{"$error":"#N/A"}}]
[null,null,null,null,null,41,{"$f":"'Planilha (A)'!C65","v":""},{"$f":"'Planilha (A)'!B65","v":""},{"$f":"IF('Planilha (A)'!G65=\"\",#N/A,'Planilha (A)'!G65)","v":{"$error":"#N/A"}},{"$f":"IF('Planilha (A)'!J65=\"\",#N/A,'Planilha (A)'!J65)","v":{"$error":"#N/A"}},{"$f":"IF('Planilha (A)'!M65=\"\",#N/A,'Planilha (A)'!M65)","v":{"$error":"#N/A"}},{"$f":"IF('Planilha (A)'!P65=\"\",#N/A,'Planilha (A)'!P65)","v":{"$error":"#N/A"}},{"$f":"IF('Planilha (A)'!S65=\"\",#N/A,'Planilha (A)'!S65)","v":{"$error":"#N/A"}},{"$f":"IF('Planilha (A)'!V65=\"\",#N/A,'Planilha (A)'!V65)","v":{"$error":"#N/A"}},{"$f":"IF('Planilha (A)'!Y65=\"\",#N/A,'Planilha (A)'!Y65)","v":{"$error":"#N/A"}},{"$f":"IF('Planilha (A)'!AB65=\"\",#N/A,'Planilha (A)'!AB65)","v":{"$error":"#N/A"}},{"$f":"IF('Planilha (A)'!AE65=\"\",#N/A,'Planilha (A)'!AE65)","v":{"$error":"#N/A"}},{"$f":"IF('Planilha (A)'!AH65=\"\",#N/A,'Planilha (A)'!AH65)","v":{"$error":"#N/A"}},{"$f":"IF('Planilha (A)'!AK65=\"\",#N/A,'Planilha (A)'!AK65)","v":{"$error":"#N/A"}},{"$f":"IF('Planilha (A)'!AN65=\"\",#N/A,'Planilha (A)'!AN65)","v":{"$error":"#N/A"}},{"$f":"IF('Planilha (A)'!AQ65=\"\",#N/A,'Planilha (A)'!AQ65)","v":{"$error":"#N/A"}}]
[null,null,null,null,null,42,{"$f":"'Planilha (A)'!C66","v":""},{"$f":"'Planilha (A)'!B66","v":""},{"$f":"IF('Planilha (A)'!G66=\"\",#N/A,'Planilha (A)'!G66)","v":{"$error":"#N/A"}},{"$f":"IF('Planilha (A)'!J66=\"\",#N/A,'Planilha (A)'!J66)","v":{"$error":"#N/A"}},{"$f":"IF('Planilha (A)'!M66=\"\",#N/A,'Planilha (A)'!M66)","v":{"$error":"#N/A"}},{"$f":"IF('Planilha (A)'!P66=\"\",#N/A,'Planilha (A)'!P66)","v":{"$error":"#N/A"}},{"$f":"IF('Planilha (A)'!S66=\"\",#N/A,'Planilha (A)'!S66)","v":{"$error":"#N/A"}},{"$f":"IF('Planilha (A)'!V66=\"\",#N/A,'Planilha (A)'!V66)","v":{"$error":"#N/A"}},{"$f":"IF('Planilha (A)'!Y66=\"\",#N/A,'Planilha (A)'!Y66)","v":{"$error":"#N/A"}},{"$f":"IF('Planilha (A)'!AB66=\"\",#N/A,'Planilha (A)'!AB66)","v":{"$error":"#N/A"}},{"$f":"IF('Planilha (A)'!AE66=\"\",#N/A,'Planilha (A)'!AE66)","v":{"$error":"#N/A"}},{"$f":"IF('Planilha (A)'!AH66=\"\",#N/A,'Planilha (A)'!AH66)","v":{"$error":"#N/A"}},{"$f":"IF('Planilha (A)'!AK66=\"\",#N/A,'Planilha (A)'!AK66)","v":{"$error":"#N/A"}},{"$f":"IF('Planilha (A)'!AN66=\"\",#N/A,'Planilha (A)'!AN66)","v":{"$error":"#N/A"}},{"$f":"IF('Planilha (A)'!AQ66=\"\",#N/A,'Planilha (A)'!AQ66)","v":{"$error":"#N/A"}}]
[null,null,null,null,null,43,{"$f":"'Planilha (A)'!C67","v":""},{"$f":"'Planilha (A)'!B67","v":""},{"$f":"IF('Planilha (A)'!G67=\"\",#N/A,'Planilha (A)'!G67)","v":{"$error":"#N/A"}},{"$f":"IF('Planilha (A)'!J67=\"\",#N/A,'Planilha (A)'!J67)","v":{"$error":"#N/A"}},{"$f":"IF('Planilha (A)'!M67=\"\",#N/A,'Planilha (A)'!M67)","v":{"$error":"#N/A"}},{"$f":"IF('Planilha (A)'!P67=\"\",#N/A,'Planilha (A)'!P67)","v":{"$error":"#N/A"}},{"$f":"IF('Planilha (A)'!S67=\"\",#N/A,'Planilha (A)'!S67)","v":{"$error":"#N/A"}},{"$f":"IF('Planilha (A)'!V67=\"\",#N/A,'Planilha (A)'!V67)","v":{"$error":"#N/A"}},{"$f":"IF('Planilha (A)'!Y67=\"\",#N/A,'Planilha (A)'!Y67)","v":{"$error":"#N/A"}},{"$f":"IF('Planilha (A)'!AB67=\"\",#N/A,'Planilha (A)'!AB67)","v":{"$error":"#N/A"}},{"$f":"IF('Planilha (A)'!AE67=\"\",#N/A,'Planilha (A)'!AE67)","v":{"$error":"#N/A"}},{"$f":"IF('Planilha (A)'!AH67=\"\",#N/A,'Planilha (A)'!AH67)","v":{"$error":"#N/A"}},{"$f":"IF('Planilha (A)'!AK67=\"\",#N/A,'Planilha (A)'!AK67)","v":{"$error":"#N/A"}},{"$f":"IF('Planilha (A)'!AN67=\"\",#N/A,'Planilha (A)'!AN67)","v":{"$error":"#N/A"}},{"$f":"IF('Planilha (A)'!AQ67=\"\",#N/A,'Planilha (A)'!AQ67)","v":{"$error":"#N/A"}}]
[null,null,null,null,null,44,{"$f":"'Planilha (A)'!C68","v":""},{"$f":"'Planilha (A)'!B68","v":""},{"$f":"IF('Planilha (A)'!G68=\"\",#N/A,'Planilha (A)'!G68)","v":{"$error":"#N/A"}},{"$f":"IF('Planilha (A)'!J68=\"\",#N/A,'Planilha (A)'!J68)","v":{"$error":"#N/A"}},{"$f":"IF('Planilha (A)'!M68=\"\",#N/A,'Planilha (A)'!M68)","v":{"$error":"#N/A"}},{"$f":"IF('Planilha (A)'!P68=\"\",#N/A,'Planilha (A)'!P68)","v":{"$error":"#N/A"}},{"$f":"IF('Planilha (A)'!S68=\"\",#N/A,'Planilha (A)'!S68)","v":{"$error":"#N/A"}},{"$f":"IF('Planilha (A)'!V68=\"\",#N/A,'Planilha (A)'!V68)","v":{"$error":"#N/A"}},{"$f":"IF('Planilha (A)'!Y68=\"\",#N/A,'Planilha (A)'!Y68)","v":{"$error":"#N/A"}},{"$f":"IF('Planilha (A)'!AB68=\"\",#N/A,'Planilha (A)'!AB68)","v":{"$error":"#N/A"}},{"$f":"IF('Planilha (A)'!AE68=\"\",#N/A,'Planilha (A)'!AE68)","v":{"$error":"#N/A"}},{"$f":"IF('Planilha (A)'!AH68=\"\",#N/A,'Planilha (A)'!AH68)","v":{"$error":"#N/A"}},{"$f":"IF('Planilha (A)'!AK68=\"\",#N/A,'Planilha (A)'!AK68)","v":{"$error":"#N/A"}},{"$f":"IF('Planilha (A)'!AN68=\"\",#N/A,'Planilha (A)'!AN68)","v":{"$error":"#N/A"}},{"$f":"IF('Planilha (A)'!AQ68=\"\",#N/A,'Planilha (A)'!AQ68)","v":{"$error":"#N/A"}}]
[null,null,null,null,null,45,{"$f":"'Planilha (A)'!C69","v":""},{"$f":"'Planilha (A)'!B69","v":""},{"$f":"IF('Planilha (A)'!G69=\"\",#N/A,'Planilha (A)'!G69)","v":{"$error":"#N/A"}},{"$f":"IF('Planilha (A)'!J69=\"\",#N/A,'Planilha (A)'!J69)","v":{"$error":"#N/A"}},{"$f":"IF('Planilha (A)'!M69=\"\",#N/A,'Planilha (A)'!M69)","v":{"$error":"#N/A"}},{"$f":"IF('Planilha (A)'!P69=\"\",#N/A,'Planilha (A)'!P69)","v":{"$error":"#N/A"}},{"$f":"IF('Planilha (A)'!S69=\"\",#N/A,'Planilha (A)'!S69)","v":{"$error":"#N/A"}},{"$f":"IF('Planilha (A)'!V69=\"\",#N/A,'Planilha (A)'!V69)","v":{"$error":"#N/A"}},{"$f":"IF('Planilha (A)'!Y69=\"\",#N/A,'Planilha (A)'!Y69)","v":{"$error":"#N/A"}},{"$f":"IF('Planilha (A)'!AB69=\"\",#N/A,'Planilha (A)'!AB69)","v":{"$error":"#N/A"}},{"$f":"IF('Planilha (A)'!AE69=\"\",#N/A,'Planilha (A)'!AE69)","v":{"$error":"#N/A"}},{"$f":"IF('Planilha (A)'!AH69=\"\",#N/A,'Planilha (A)'!AH69)","v":{"$error":"#N/A"}},{"$f":"IF('Planilha (A)'!AK69=\"\",#N/A,'Planilha (A)'!AK69)","v":{"$error":"#N/A"}},{"$f":"IF('Planilha (A)'!AN69=\"\",#N/A,'Planilha (A)'!AN69)","v":{"$error":"#N/A"}},{"$f":"IF('Planilha (A)'!AQ69=\"\",#N/A,'Planilha (A)'!AQ69)","v":{"$error":"#N/A"}}]
[null,null,null,null,null,46,{"$f":"'Planilha (A)'!C70","v":""},{"$f":"'Planilha (A)'!B70","v":""},{"$f":"IF('Planilha (A)'!G70=\"\",#N/A,'Planilha (A)'!G70)","v":{"$error":"#N/A"}},{"$f":"IF('Planilha (A)'!J70=\"\",#N/A,'Planilha (A)'!J70)","v":{"$error":"#N/A"}},{"$f":"IF('Planilha (A)'!M70=\"\",#N/A,'Planilha (A)'!M70)","v":{"$error":"#N/A"}},{"$f":"IF('Planilha (A)'!P70=\"\",#N/A,'Planilha (A)'!P70)","v":{"$error":"#N/A"}},{"$f":"IF('Planilha (A)'!S70=\"\",#N/A,'Planilha (A)'!S70)","v":{"$error":"#N/A"}},{"$f":"IF('Planilha (A)'!V70=\"\",#N/A,'Planilha (A)'!V70)","v":{"$error":"#N/A"}},{"$f":"IF('Planilha (A)'!Y70=\"\",#N/A,'Planilha (A)'!Y70)","v":{"$error":"#N/A"}},{"$f":"IF('Planilha (A)'!AB70=\"\",#N/A,'Planilha (A)'!AB70)","v":{"$error":"#N/A"}},{"$f":"IF('Planilha (A)'!AE70=\"\",#N/A,'Planilha (A)'!AE70)","v":{"$error":"#N/A"}},{"$f":"IF('Planilha (A)'!AH70=\"\",#N/A,'Planilha (A)'!AH70)","v":{"$error":"#N/A"}},{"$f":"IF('Planilha (A)'!AK70=\"\",#N/A,'Planilha (A)'!AK70)","v":{"$error":"#N/A"}},{"$f":"IF('Planilha (A)'!AN70=\"\",#N/A,'Planilha (A)'!AN70)","v":{"$error":"#N/A"}},{"$f":"IF('Planilha (A)'!AQ70=\"\",#N/A,'Planilha (A)'!AQ70)","v":{"$error":"#N/A"}}]
[null,null,null,null,null,47,{"$f":"'Planilha (A)'!C71","v":""},{"$f":"'Planilha (A)'!B71","v":""},{"$f":"IF('Planilha (A)'!G71=\"\",#N/A,'Planilha (A)'!G71)","v":{"$error":"#N/A"}},{"$f":"IF('Planilha (A)'!J71=\"\",#N/A,'Planilha (A)'!J71)","v":{"$error":"#N/A"}},{"$f":"IF('Planilha (A)'!M71=\"\",#N/A,'Planilha (A)'!M71)","v":{"$error":"#N/A"}},{"$f":"IF('Planilha (A)'!P71=\"\",#N/A,'Planilha (A)'!P71)","v":{"$error":"#N/A"}},{"$f":"IF('Planilha (A)'!S71=\"\",#N/A,'Planilha (A)'!S71)","v":{"$error":"#N/A"}},{"$f":"IF('Planilha (A)'!V71=\"\",#N/A,'Planilha (A)'!V71)","v":{"$error":"#N/A"}},{"$f":"IF('Planilha (A)'!Y71=\"\",#N/A,'Planilha (A)'!Y71)","v":{"$error":"#N/A"}},{"$f":"IF('Planilha (A)'!AB71=\"\",#N/A,'Planilha (A)'!AB71)","v":{"$error":"#N/A"}},{"$f":"IF('Planilha (A)'!AE71=\"\",#N/A,'Planilha (A)'!AE71)","v":{"$error":"#N/A"}},{"$f":"IF('Planilha (A)'!AH71=\"\",#N/A,'Planilha (A)'!AH71)","v":{"$error":"#N/A"}},{"$f":"IF('Planilha (A)'!AK71=\"\",#N/A,'Planilha (A)'!AK71)","v":{"$error":"#N/A"}},{"$f":"IF('Planilha (A)'!AN71=\"\",#N/A,'Planilha (A)'!AN71)","v":{"$error":"#N/A"}},{"$f":"IF('Planilha (A)'!AQ71=\"\",#N/A,'Planilha (A)'!AQ71)","v":{"$error":"#N/A"}}]
[null,null,null,null,null,48,{"$f":"'Planilha (A)'!C72","v":""},{"$f":"'Planilha (A)'!B72","v":""},{"$f":"IF('Planilha (A)'!G72=\"\",#N/A,'Planilha (A)'!G72)","v":{"$error":"#N/A"}},{"$f":"IF('Planilha (A)'!J72=\"\",#N/A,'Planilha (A)'!J72)","v":{"$error":"#N/A"}},{"$f":"IF('Planilha (A)'!M72=\"\",#N/A,'Planilha (A)'!M72)","v":{"$error":"#N/A"}},{"$f":"IF('Planilha (A)'!P72=\"\",#N/A,'Planilha (A)'!P72)","v":{"$error":"#N/A"}},{"$f":"IF('Planilha (A)'!S72=\"\",#N/A,'Planilha (A)'!S72)","v":{"$error":"#N/A"}},{"$f":"IF('Planilha (A)'!V72=\"\",#N/A,'Planilha (A)'!V72)","v":{"$error":"#N/A"}},{"$f":"IF('Planilha (A)'!Y72=\"\",#N/A,'Planilha (A)'!Y72)","v":{"$error":"#N/A"}},{"$f":"IF('Planilha (A)'!AB72=\"\",#N/A,'Planilha (A)'!AB72)","v":{"$error":"#N/A"}},{"$f":"IF('Planilha (A)'!AE72=\"\",#N/A,'Planilha (A)'!AE72)","v":{"$error":"#N/A"}},{"$f":"IF('Planilha (A)'!AH72=\"\",#N/A,'Planilha (A)'!AH72)","v":{"$error":"#N/A"}},{"$f":"IF('Planilha (A)'!AK72=\"\",#N/A,'Planilha (A)'!AK72)","v":{"$error":"#N/A"}},{"$f":"IF('Planilha (A)'!AN72=\"\",#N/A,'Planilha (A)'!AN72)","v":{"$error":"#N/A"}},{"$f":"IF('Planilha (A)'!AQ72=\"\",#N/A,'Planilha (A)'!AQ72)","v":{"$error":"#N/A"}}]
[null,null,null,null,null,49,{"$f":"'Planilha (A)'!C73","v":""},{"$f":"'Planilha (A)'!B73","v":""},{"$f":"IF('Planilha (A)'!G73=\"\",#N/A,'Planilha (A)'!G73)","v":{"$error":"#N/A"}},{"$f":"IF('Planilha (A)'!J73=\"\",#N/A,'Planilha (A)'!J73)","v":{"$error":"#N/A"}},{"$f":"IF('Planilha (A)'!M73=\"\",#N/A,'Planilha (A)'!M73)","v":{"$error":"#N/A"}},{"$f":"IF('Planilha (A)'!P73=\"\",#N/A,'Planilha (A)'!P73)","v":{"$error":"#N/A"}},{"$f":"IF('Planilha (A)'!S73=\"\",#N/A,'Planilha (A)'!S73)","v":{"$error":"#N/A"}},{"$f":"IF('Planilha (A)'!V73=\"\",#N/A,'Planilha (A)'!V73)","v":{"$error":"#N/A"}},{"$f":"IF('Planilha (A)'!Y73=\"\",#N/A,'Planilha (A)'!Y73)","v":{"$error":"#N/A"}},{"$f":"IF('Planilha (A)'!AB73=\"\",#N/A,'Planilha (A)'!AB73)","v":{"$error":"#N/A"}},{"$f":"IF('Planilha (A)'!AE73=\"\",#N/A,'Planilha (A)'!AE73)","v":{"$error":"#N/A"}},{"$f":"IF('Planilha (A)'!AH73=\"\",#N/A,'Planilha (A)'!AH73)","v":{"$error":"#N/A"}},{"$f":"IF('Planilha (A)'!AK73=\"\",#N/A,'Planilha (A)'!AK73)","v":{"$error":"#N/A"}},{"$f":"IF('Planilha (A)'!AN73=\"\",#N/A,'Planilha (A)'!AN73)","v":{"$error":"#N/A"}},{"$f":"IF('Planilha (A)'!AQ73=\"\",#N/A,'Planilha (A)'!AQ73)","v":{"$error":"#N/A"}}]
[null,null,null,null,null,50,{"$f":"'Planilha (A)'!C74","v":""},{"$f":"'Planilha (A)'!B74","v":""},{"$f":"IF('Planilha (A)'!G74=\"\",#N/A,'Planilha (A)'!G74)","v":{"$error":"#N/A"}},{"$f":"IF('Planilha (A)'!J74=\"\",#N/A,'Planilha (A)'!J74)","v":{"$error":"#N/A"}},{"$f":"IF('Planilha (A)'!M74=\"\",#N/A,'Planilha (A)'!M74)","v":{"$error":"#N/A"}},{"$f":"IF('Planilha (A)'!P74=\"\",#N/A,'Planilha (A)'!P74)","v":{"$error":"#N/A"}},{"$f":"IF('Planilha (A)'!S74=\"\",#N/A,'Planilha (A)'!S74)","v":{"$error":"#N/A"}},{"$f":"IF('Planilha (A)'!V74=\"\",#N/A,'Planilha (A)'!V74)","v":{"$error":"#N/A"}},{"$f":"IF('Planilha (A)'!Y74=\"\",#N/A,'Planilha (A)'!Y74)","v":{"$error":"#N/A"}},{"$f":"IF('Planilha (A)'!AB74=\"\",#N/A,'Planilha (A)'!AB74)","v":{"$error":"#N/A"}},{"$f":"IF('Planilha (A)'!AE74=\"\",#N/A,'Planilha (A)'!AE74)","v":{"$error":"#N/A"}},{"$f":"IF('Planilha (A)'!AH74=\"\",#N/A,'Planilha (A)'!AH74)","v":{"$error":"#N/A"}},{"$f":"IF('Planilha (A)'!AK74=\"\",#N/A,'Planilha (A)'!AK74)","v":{"$error":"#N/A"}},{"$f":"IF('Planilha (A)'!AN74=\"\",#N/A,'Planilha (A)'!AN74)","v":{"$error":"#N/A"}},{"$f":"IF('Planilha (A)'!AQ74=\"\",#N/A,'Planilha (A)'!AQ74)","v":{"$error":"#N/A"}}]

{"sheet":"Planilha (A)","index":3,"n_rows":76,"n_cols":43,"rows_kept":76,"cut":false,"hidden":false,"merged":[[22,40,22,42],[22,7,22,9],[22,10,22,12],[22,13,22,15],[22,16,22,18],[22,19,22,21],[22,22,22,24],[22,25,22,27],[22,28,22,30],[22,31,22,33],[22,34,22,36],[22,37,22,39],[21,4,21,5],[21,6,21,9],[21,10,21,11],[22,4,22,6]]}
[]
[]
[]
[]
[null,null,null,null,null,null,null,null,null,null,"ESTADO",{"$f":"Dados!$H$37","v":"DF"},{"$f":"Dados!$R$70","v":"BRASIL"}]
[null,null,null,null,null,null,null,null,null,null,2017,{"$f":"INDEX(Dados!$H$71:$P$83,ROW(K6)-5,periodo)","v":0.45251396648044695},{"$f":"Dados!R71","v":0.35422582627908483}]
[null,null,null,null,null,null,null,null,null,null,"JAN",{"$f":"INDEX(Dados!$H$71:$P$83,ROW(K7)-5,periodo)","v":0.48044692737430167},{"$f":"Dados!R72","v":0.37565551046127826}]
[null,null,null,null,null,null,null,null,null,null,"FEV",{"$f":"INDEX(Dados!$H$71:$P$83,ROW(K8)-5,periodo)","v":{"$error":"#N/A"}},{"$f":"Dados!R73","v":{"$error":"#N/A"}}]
[null,null,null,null,null,null,null,null,null,null,"MAR",{"$f":"INDEX(Dados!$H$71:$P$83,ROW(K9)-5,periodo)","v":{"$error":"#N/A"}},{"$f":"Dados!R74","v":{"$error":"#N/A"}}]
[null,null,null,null,null,null,null,null,null,null,"ABR",{"$f":"INDEX(Dados!$H$71:$P$83,ROW(K10)-5,periodo)","v":{"$error":"#N/A"}},{"$f":"Dados!R75","v":{"$error":"#N/A"}}]
[null,null,null,null,null,null,null,null,null,null,"MAI",{"$f":"INDEX(Dados!$H$71:$P$83,ROW(K11)-5,periodo)","v":{"$error":"#N/A"}},{"$f":"Dados!R76","v":{"$error":"#N/A"}}]
[null,null,null,null,null,null,null,null,null,null,"JUN",{"$f":"INDEX(Dados!$H$71:$P$83,ROW(K12)-5,periodo)","v":{"$error":"#N/A"}},{"$f":"Dados!R77","v":{"$error":"#N/A"}}]
[null,null,null,null,null,null,null,null,null,null,"JUL",{"$f":"INDEX(Dados!$H$71:$P$83,ROW(K13)-5,periodo)","v":{"$error":"#N/A"}},{"$f":"Dados!R78","v":{"$error":"#N/A"}}]
[null,null,null,null,null,null,null,null,null,null,"AGO",{"$f":"INDEX(Dados!$H$71:$P$83,ROW(K14)-5,periodo)","v":{"$error":"#N/A"}},{"$f":"Dados!R79","v":{"$error":"#N/A"}}]
[null,null,null,null,null,null,null,null,null,null,"SET",{"$f":"INDEX(Dados!$H$71:$P$83,ROW(K15)-5,periodo)","v":{"$error":"#N/A"}},{"$f":"Dados!R80","v":{"$error":"#N/A"}}]
[null,null,null,null,null,null,null,null,null,null,"OUT",{"$f":"INDEX(Dados!$H$71:$P$83,ROW(K16)-5,periodo)","v":{"$error":"#N/A"}},{"$f":"Dados!R81","v":{"$error":"#N/A"}}]
[null,null,null,null,null,null,null,null,null,null,"NOV",{"$f":"INDEX(Dados!$H$71:$P$83,ROW(K17)-5,periodo)","v":{"$error":"#N/A"}},{"$f":"Dados!R82","v":{"$error":"#N/A"}}]
[null,null,null,null,null,null,null,null,null,null,"DEZ",{"$f":"INDEX(Dados!$H$71:$P$83,ROW(K18)-5,periodo)","v":{"$error":"#N/A"}},{"$f":"Dados!R83","v":{"$error":"#N/A"}}]
[]
[]
[]
[]
[null,null,{"$f":"COLUMN(INDIRECT(D23))+2","v":10},"JAN",2017,null,null,"JAN",null,null,"FEV",null,null,"MAR",null,null,"ABR",null,null,"MAI",null,null,"JUN",null,null,"JUL",null,null,"AGO",null,null,"SET",null,null,"OUT",null,null,"NOV",null,null,"DEZ"]
[null,"Código","Empresa",{"$f":"\"Comparativo \"&IF(D23=JAN,YEAR(TODAY())-1,OFFSET(INDIRECT(D23,TRUE),,-3))&\" / \"&D23","v":"Comparativo 2017 / JAN"},"Serviços Demandados","Serviços Atendidos","% Atendimento","Serviços Demandados","Serviços Atendidos","% Atendimento","Serviços Demandados","Serviços Atendidos","% Atendimento","Serviços Demandados","Serviços Atendidos","% Atendimento","Serviços Demandados","Serviços Atendidos","% Atendimento","Serviços Demandados","Serviços Atendidos","% Atendimento","Serviços Demandados","Serviços Atendidos","% Atendimento","Serviços Demandados","Serviços Atendidos","% Atendimento","Serviços Demandados","Serviços Atendidos","% Atendimento","Serviços Demandados","Serviços Atendidos","% Atendimento","Serviços Demandados","Serviços Atendidos","% Atendimento","Serviços Demandados","Serviços Atendidos","% Atendimento","Serviços Demandados","Serviços Atendidos","% Atendimento"]
[null,{"$f":"IFERROR(INDEX(Empresas!$B$6:$AS$46,SMALL(IF(Empresas!$B$6:$B$46=Dados!$H$37,ROW(Empresas!$B$6:$B$46)-5),ROW($A1)),COLUMN(B$1)),\"\")","v":13},{"$f":"IFERROR(INDEX(Empresas!$B$6:$AS$46,SMALL(IF(Empresas!$B$6:$B$46=Dados!$H$37,ROW(Empresas!$B$6:$B$46)-5),ROW($A1)),COLUMN(C$1)),\"\")","v":"EMPRESA 13"},{"$f":"IF(C25=\"\",\"\",IF(OFFSET(INDIRECT($D$23,TRUE),ROW(C25)-23,2)>OFFSET(INDIRECT($D$23),ROW(C25)-23,-1),1,IF(OFFSET(INDIRECT($D$23,TRUE),ROW(C25)-23,2)=OFFSET(INDIRECT($D$23),ROW(C25)-23,-1),2,3)))","v":1},{"$f":"IFERROR(INDEX(Empresas!$B$6:$AS$46,SMALL(IF(Empresas!$B$6:$B$46=Dados!$H$37,ROW(Empresas!$B$6:$B$46)-5),ROW($A1)),COLUMN(F$1)),\"\")","v":72},{"$f":"IFERROR(INDEX(Empresas!$B$6:$AS$46,SMALL(IF(Empresas!$B$6:$B$46=Dados!$H$37,ROW(Empresas!$B$6:$B$46)-5),ROW($A1)),COLUMN(G$1)),\"\")","v":18},{"$f":"IFERROR(INDEX(Empresas!$B$6:$AS$46,SMALL(IF(Empresas!$B$6:$B$46=Dados!$H$37,ROW(Empresas!$B$6:$B$46)-5),ROW($A1)),COLUMN(H$1)),\"\")","v":0.25},{"$f":"IFERROR(INDEX(Empresas!$B$6:$AS$46,SMALL(IF(Empresas!$B$6:$B$46=Dados!$H$37,ROW(Empresas!$B$6:$B$46)-5),ROW($A1)),COLUMN(I$1)),\"\")","v":72},{"$f":"IFERROR(INDEX(Empresas!$B$6:$AS$46,SMALL(IF(Empresas!$B$6:$B$46=Dados!$H$37,ROW(Empresas!$B$6:$B$46)-5),ROW($A1)),COLUMN(J$1)),\"\")","v":29},{"$f":"IFERROR(INDEX(Empresas!$B$6:$AS$46,SMALL(IF(Empresas!$B$6:$B$46=Dados!$H$37,ROW(Empresas!$B$6:$B$46)-5),ROW($A1)),COLUMN(K$1)),\"\")","v":0.40277777777777779},{"$f":"IFERROR(INDEX(Empresas!$B$6:$AS$46,SMALL(IF(Empresas!$B$6:$B$46=Dados!$H$37,ROW(Empresas!$B$6:$B$46)-5),ROW($A1)),COLUMN(L$1)),\"\")","v":""},{"$f":"IFERROR(INDEX(Empresas!$B$6:$AS$46,SMALL(IF(Empresas!$B$6:$B$46=Dados!$H$37,ROW(Empresas!$B$6:$B$46)-5),ROW($A1)),COLUMN(M$1)),\"\")","v":""},{"$f":"IFERROR(INDEX(Empresas!$B$6:$AS$46,SMALL(IF(Empresas!$B$6:$B$46=Dados!$H$37,ROW(Empresas!$B$6:$B$46)-5),ROW($A1)),COLUMN(N$1)),\"\")","v":""},{"$f":"IFERROR(INDEX(Empresas!$B$6:$AS$46,SMALL(IF(Empresas!$B$6:$B$46=Dados!$H$37,ROW(Empresas!$B$6:$B$46)-5),ROW($A1)),COLUMN(O$1)),\"\")","v":""},{"$f":"IFERROR(INDEX(Empresas!$B$6:$AS$46,SMALL(IF(Empresas!$B$6:$B$46=Dados!$H$37,ROW(Empresas!$B$6:$B$46)-5),ROW($A1)),COLUMN(P$1)),\"\")","v":""},{"$f":"IFERROR(INDEX(Empresas!$B$6:$AS$46,SMALL(IF(Empresas!$B$6:$B$46=Dados!$H$37,ROW(Empresas!$B$6:$B$46)-5),ROW($A1)),COLUMN(Q$1)),\"\")","v":""},{"$f":"IFERROR(INDEX(Empresas!$B$6:$AS$46,SMALL(IF(Empresas!$B$6:$B$46=Dados!$H$37,ROW(Empresas!$B$6:$B$46)-5),ROW($A1)),COLUMN(R$1)),\"\")","v":""},{"$f":"IFERROR(INDEX(Empresas!$B$6:$AS$46,SMALL(IF(Empresas!$B$6:$B$46=Dados!$H$37,ROW(Empresas!$B$6:$B$46)-5),ROW($A1)),COLUMN(S$1)),\"\")","v":""},{"$f":"IFERROR(INDEX(Empresas!$B$6:$AS$46,SMALL(IF(Empresas!$B$6:$B$46=Dados!$H$37,ROW(Empresas!$B$6:$B$46)-5),ROW($A1)),COLUMN(T$1)),\"\")","v":""},{"$f":"IFERROR(INDEX(Empresas!$B$6:$AS$46,SMALL(IF(Empresas!$B$6:$B$46=Dados!$H$37,ROW(Empresas!$B$6:$B$46)-5),ROW($A1)),COLUMN(U$1)),\"\")","v":""},{"$f":"IFERROR(INDEX(Empresas!$B$6:$AS$46,SMALL(IF(Empresas!$B$6:$B$46=Dados!$H$37,ROW(Empresas!$B$6:$B$46)-5),ROW($A1)),COLUMN(V$1)),\"\")","v":""},{"$f":"IFERROR(INDEX(Empresas!$B$6:$AS$46,SMALL(IF(Empresas!$B$6:$B$46=Dados!$H$37,ROW(Empresas!$B$6:$B$46)-5),ROW($A1)),COLUMN(W$1)),\"\")","v":""},{"$f":"IFERROR(INDEX(Empresas!$B$6:$AS$46,SMALL(IF(Empresas!$B$6:$B$46=Dados!$H$37,ROW(Empresas!$B$6:$B$46)-5),ROW($A1)),COLUMN(X$1)),\"\")","v":""},{"$f":"IFERROR(INDEX(Empresas!$B$6:$AS$46,SMALL(IF(Empresas!$B$6:$B$46=Dados!$H$37,ROW(Empresas!$B$6:$B$46)-5),ROW($A1)),COLUMN(Y$1)),\"\")","v":""},{"$f":"IFERROR(INDEX(Empresas!$B$6:$AS$46,SMALL(IF(Empresas!$B$6:$B$46=Dados!$H$37,ROW(Empresas!$B$6:$B$46)-5),ROW($A1)),COLUMN(Z$1)),\"\")","v":""},{"$f":"IFERROR(INDEX(Empresas!$B$6:$AS$46,SMALL(IF(Empresas!$B$6:$B$46=Dados!$H$37,ROW(Empresas!$B$6:$B$46)-5),ROW($A1)),COLUMN(AA$1)),\"\")","v":""},{"$f":"IFERROR(INDEX(Empresas!$B$6:$AS$46,SMALL(IF(Empresas!$B$6:$B$46=Dados!$H$37,ROW(Empresas!$B$6:$B$46)-5),ROW($A1)),COLUMN(AB$1)),\"\")","v":""},{"$f":"IFERROR(INDEX(Empresas!$B$6:$AS$46,SMALL(IF(Empresas!$B$6:$B$46=Dados!$H$37,ROW(Empresas!$B$6:$B$46)-5),ROW($A1)),COLUMN(AC$1)),\"\")","v":""},{"$f":"IFERROR(INDEX(Empresas!$B$6:$AS$46,SMALL(IF(Empresas!$B$6:$B$46=Dados!$H$37,ROW(Empresas!$B$6:$B$46)-5),ROW($A1)),COLUMN(AD$1)),\"\")","v":""},{"$f":"IFERROR(INDEX(Empresas!$B$6:$AS$46,SMALL(IF(Empresas!$B$6:$B$46=Dados!$H$37,ROW(Empresas!$B$6:$B$46)-5),ROW($A1)),COLUMN(AE$1)),\"\")","v":""},{"$f":"IFERROR(INDEX(Empresas!$B$6:$AS$46,SMALL(IF(Empresas!$B$6:$B$46=Dados!$H$37,ROW(Empresas!$B$6:$B$46)-5),ROW($A1)),COLUMN(AF$1)),\"\")","v":""},{"$f":"IFERROR(INDEX(Empresas!$B$6:$AS$46,SMALL(IF(Empresas!$B$6:$B$46=Dados!$H$37,ROW(Empresas!$B$6:$B$46)-5),ROW($A1)),COLUMN(AG$1)),\"\")","v":""},{"$f":"IFERROR(INDEX(Empresas!$B$6:$AS$46,SMALL(IF(Empresas!$B$6:$B$46=Dados!$H$37,ROW(Empresas!$B$6:$B$46)-5),ROW($A1)),COLUMN(AH$1)),\"\")","v":""},{"$f":"IFERROR(INDEX(Empresas!$B$6:$AS$46,SMALL(IF(Empresas!$B$6:$B$46=Dados!$H$37,ROW(Empresas!$B$6:$B$46)-5),ROW($A1)),COLUMN(AI$1)),\"\")","v":""},{"$f":"IFERROR(INDEX(Empresas!$B$6:$AS$46,SMALL(IF(Empresas!$B$6:$B$46=Dados!$H$37,ROW(Empresas!$B$6:$B$46)-5),ROW($A1)),COLUMN(AJ$1)),\"\")","v":""},{"$f":"IFERROR(INDEX(Empresas!$B$6:$AS$46,SMALL(IF(Empresas!$B$6:$B$46=Dados!$H$37,ROW(Empresas!$B$6:$B$46)-5),ROW($A1)),COLUMN(AK$1)),\"\")","v":""},{"$f":"IFERROR(INDEX(Empresas!$B$6:$AS$46,SMALL(IF(Empresas!$B$6:$B$46=Dados!$H$37,ROW(Empresas!$B$6:$B$46)-5),ROW($A1)),COLUMN(AL$1)),\"\")","v":""},{"$f":"IFERROR(INDEX(Empresas!$B$6:$AS$46,SMALL(IF(Empresas!$B$6:$B$46=Dados!$H$37,ROW(Empresas!$B$6:$B$46)-5),ROW($A1)),COLUMN(AM$1)),\"\")","v":""},{"$f":"IFERROR(INDEX(Empresas!$B$6:$AS$46,SMALL(IF(Empresas!$B$6:$B$46=Dados!$H$37,ROW(Empresas!$B$6:$B$46)-5),ROW($A1)),COLUMN(AN$1)),\"\")","v":""},{"$f":"IFERROR(INDEX(Empresas!$B$6:$AS$46,SMALL(IF(Empresas!$B$6:$B$46=Dados!$H$37,ROW(Empresas!$B$6:$B$46)-5),ROW($A1)),COLUMN(AO$1)),\"\")","v":""},{"$f":"IFERROR(INDEX(Empresas!$B$6:$AS$46,SMALL(IF(Empresas!$B$6:$B$46=Dados!$H$37,ROW(Empresas!$B$6:$B$46)-5),ROW($A1)),COLUMN(AP$1)),\"\")","v":""},{"$f":"IFERROR(INDEX(Empresas!$B$6:$AS$46,SMALL(IF(Empresas!$B$6:$B$46=Dados!$H$37,ROW(Empresas!$B$6:$B$46)-5),ROW($A1)),COLUMN(AQ$1)),\"\")","v":""},{"$f":"IFERROR(INDEX(Empresas!$B$6:$AS$46,SMALL(IF(Empresas!$B$6:$B$46=Dados!$H$37,ROW(Empresas!$B$6:$B$46)-5),ROW($A1)),COLUMN(AR$1)),\"\")","v":""}]
[null,{"$f":"IFERROR(INDEX(Empresas!$B$6:$AS$46,SMALL(IF(Empresas!$B$6:$B$46=Dados!$H$37,ROW(Empresas!$B$6:$B$46)-5),ROW($A2)),COLUMN(B$1)),\"\")","v":14},{"$f":"IFERROR(INDEX(Empresas!$B$6:$AS$46,SMALL(IF(Empresas!$B$6:$B$46=Dados!$H$37,ROW(Empresas!$B$6:$B$46)-5),ROW($A2)),COLUMN(C$1)),\"\")","v":"EMPRESA 14"},3,{"$f":"IFERROR(INDEX(Empresas!$B$6:$AS$46,SMALL(IF(Empresas!$B$6:$B$46=Dados!$H$37,ROW(Empresas!$B$6:$B$46)-5),ROW($A2)),COLUMN(F$1)),\"\")","v":67},{"$f":"IFERROR(INDEX(Empresas!$B$6:$AS$46,SMALL(IF(Empresas!$B$6:$B$46=Dados!$H$37,ROW(Empresas!$B$6:$B$46)-5),ROW($A2)),COLUMN(G$1)),\"\")","v":29},{"$f":"IFERROR(INDEX(Empresas!$B$6:$AS$46,SMALL(IF(Empresas!$B$6:$B$46=Dados!$H$37,ROW(Empresas!$B$6:$B$46)-5),ROW($A2)),COLUMN(H$1)),\"\")","v":0.43283582089552236},{"$f":"IFERROR(INDEX(Empresas!$B$6:$AS$46,SMALL(IF(Empresas!$B$6:$B$46=Dados!$H$37,ROW(Empresas!$B$6:$B$46)-5),ROW($A2)),COLUMN(I$1)),\"\")","v":67},{"$f":"IFERROR(INDEX(Empresas!$B$6:$AS$46,SMALL(IF(Empresas!$B$6:$B$46=Dados!$H$37,ROW(Empresas!$B$6:$B$46)-5),ROW($A2)),COLUMN(J$1)),\"\")","v":28},{"$f":"IFERROR(INDEX(Empresas!$B$6:$AS$46,SMALL(IF(Empresas!$B$6:$B$46=Dados!$H$37,ROW(Empresas!$B$6:$B$46)-5),ROW($A2)),COLUMN(K$1)),\"\")","v":0.41791044776119401},{"$f":"IFERROR(INDEX(Empresas!$B$6:$AS$46,SMALL(IF(Empresas!$B$6:$B$46=Dados!$H$37,ROW(Empresas!$B$6:$B$46)-5),ROW($A2)),COLUMN(L$1)),\"\")","v":""},{"$f":"IFERROR(INDEX(Empresas!$B$6:$AS$46,SMALL(IF(Empresas!$B$6:$B$46=Dados!$H$37,ROW(Empresas!$B$6:$B$46)-5),ROW($A2)),COLUMN(M$1)),\"\")","v":""},{"$f":"IFERROR(INDEX(Empresas!$B$6:$AS$46,SMALL(IF(Empresas!$B$6:$B$46=Dados!$H$37,ROW(Empresas!$B$6:$B$46)-5),ROW($A2)),COLUMN(N$1)),\"\")","v":""},{"$f":"IFERROR(INDEX(Empresas!$B$6:$AS$46,SMALL(IF(Empresas!$B$6:$B$46=Dados!$H$37,ROW(Empresas!$B$6:$B$46)-5),ROW($A2)),COLUMN(O$1)),\"\")","v":""},{"$f":"IFERROR(INDEX(Empresas!$B$6:$AS$46,SMALL(IF(Empresas!$B$6:$B$46=Dados!$H$37,ROW(Empresas!$B$6:$B$46)-5),ROW($A2)),COLUMN(P$1)),\"\")","v":""},{"$f":"IFERROR(INDEX(Empresas!$B$6:$AS$46,SMALL(IF(Empresas!$B$6:$B$46=Dados!$H$37,ROW(Empresas!$B$6:$B$46)-5),ROW($A2)),COLUMN(Q$1)),\"\")","v":""},{"$f":"IFERROR(INDEX(Empresas!$B$6:$AS$46,SMALL(IF(Empresas!$B$6:$B$46=Dados!$H$37,ROW(Empresas!$B$6:$B$46)-5),ROW($A2)),COLUMN(R$1)),\"\")","v":""},{"$f":"IFERROR(INDEX(Empresas!$B$6:$AS$46,SMALL(IF(Empresas!$B$6:$B$46=Dados!$H$37,ROW(Empresas!$B$6:$B$46)-5),ROW($A2)),COLUMN(S$1)),\"\")","v":""},{"$f":"IFERROR(INDEX(Empresas!$B$6:$AS$46,SMALL(IF(Empresas!$B$6:$B$46=Dados!$H$37,ROW(Empresas!$B$6:$B$46)-5),ROW($A2)),COLUMN(T$1)),\"\")","v":""},{"$f":"IFERROR(INDEX(Empresas!$B$6:$AS$46,SMALL(IF(Empresas!$B$6:$B$46=Dados!$H$37,ROW(Empresas!$B$6:$B$46)-5),ROW($A2)),COLUMN(U$1)),\"\")","v":""},{"$f":"IFERROR(INDEX(Empresas!$B$6:$AS$46,SMALL(IF(Empresas!$B$6:$B$46=Dados!$H$37,ROW(Empresas!$B$6:$B$46)-5),ROW($A2)),COLUMN(V$1)),\"\")","v":""},{"$f":"IFERROR(INDEX(Empresas!$B$6:$AS$46,SMALL(IF(Empresas!$B$6:$B$46=Dados!$H$37,ROW(Empresas!$B$6:$B$46)-5),ROW($A2)),COLUMN(W$1)),\"\")","v":""},{"$f":"IFERROR(INDEX(Empresas!$B$6:$AS$46,SMALL(IF(Empresas!$B$6:$B$46=Dados!$H$37,ROW(Empresas!$B$6:$B$46)-5),ROW($A2)),COLUMN(X$1)),\"\")","v":""},{"$f":"IFERROR(INDEX(Empresas!$B$6:$AS$46,SMALL(IF(Empresas!$B$6:$B$46=Dados!$H$37,ROW(Empresas!$B$6:$B$46)-5),ROW($A2)),COLUMN(Y$1)),\"\")","v":""},{"$f":"IFERROR(INDEX(Empresas!$B$6:$AS$46,SMALL(IF(Empresas!$B$6:$B$46=Dados!$H$37,ROW(Empresas!$B$6:$B$46)-5),ROW($A2)),COLUMN(Z$1)),\"\")","v":""},{"$f":"IFERROR(INDEX(Empresas!$B$6:$AS$46,SMALL(IF(Empresas!$B$6:$B$46=Dados!$H$37,ROW(Empresas!$B$6:$B$46)-5),ROW($A2)),COLUMN(AA$1)),\"\")","v":""},{"$f":"IFERROR(INDEX(Empresas!$B$6:$AS$46,SMALL(IF(Empresas!$B$6:$B$46=Dados!$H$37,ROW(Empresas!$B$6:$B$46)-5),ROW($A2)),COLUMN(AB$1)),\"\")","v":""},{"$f":"IFERROR(INDEX(Empresas!$B$6:$AS$46,SMALL(IF(Empresas!$B$6:$B$46=Dados!$H$37,ROW(Empresas!$B$6:$B$46)-5),ROW($A2)),COLUMN(AC$1)),\"\")","v":""},{"$f":"IFERROR(INDEX(Empresas!$B$6:$AS$46,SMALL(IF(Empresas!$B$6:$B$46=Dados!$H$37,ROW(Empresas!$B$6:$B$46)-5),ROW($A2)),COLUMN(AD$1)),\"\")","v":""},{"$f":"IFERROR(INDEX(Empresas!$B$6:$AS$46,SMALL(IF(Empresas!$B$6:$B$46=Dados!$H$37,ROW(Empresas!$B$6:$B$46)-5),ROW($A2)),COLUMN(AE$1)),\"\")","v":""},{"$f":"IFERROR(INDEX(Empresas!$B$6:$AS$46,SMALL(IF(Empresas!$B$6:$B$46=Dados!$H$37,ROW(Empresas!$B$6:$B$46)-5),ROW($A2)),COLUMN(AF$1)),\"\")","v":""},{"$f":"IFERROR(INDEX(Empresas!$B$6:$AS$46,SMALL(IF(Empresas!$B$6:$B$46=Dados!$H$37,ROW(Empresas!$B$6:$B$46)-5),ROW($A2)),COLUMN(AG$1)),\"\")","v":""},{"$f":"IFERROR(INDEX(Empresas!$B$6:$AS$46,SMALL(IF(Empresas!$B$6:$B$46=Dados!$H$37,ROW(Empresas!$B$6:$B$46)-5),ROW($A2)),COLUMN(AH$1)),\"\")","v":""},{"$f":"IFERROR(INDEX(Empresas!$B$6:$AS$46,SMALL(IF(Empresas!$B$6:$B$46=Dados!$H$37,ROW(Empresas!$B$6:$B$46)-5),ROW($A2)),COLUMN(AI$1)),\"\")","v":""},{"$f":"IFERROR(INDEX(Empresas!$B$6:$AS$46,SMALL(IF(Empresas!$B$6:$B$46=Dados!$H$37,ROW(Empresas!$B$6:$B$46)-5),ROW($A2)),COLUMN(AJ$1)),\"\")","v":""},{"$f":"IFERROR(INDEX(Empresas!$B$6:$AS$46,SMALL(IF(Empresas!$B$6:$B$46=Dados!$H$37,ROW(Empresas!$B$6:$B$46)-5),ROW($A2)),COLUMN(AK$1)),\"\")","v":""},{"$f":"IFERROR(INDEX(Empresas!$B$6:$AS$46,SMALL(IF(Empresas!$B$6:$B$46=Dados!$H$37,ROW(Empresas!$B$6:$B$46)-5),ROW($A2)),COLUMN(AL$1)),\"\")","v":""},{"$f":"IFERROR(INDEX(Empresas!$B$6:$AS$46,SMALL(IF(Empresas!$B$6:$B$46=Dados!$H$37,ROW(Empresas!$B$6:$B$46)-5),ROW($A2)),COLUMN(AM$1)),\"\")","v":""},{"$f":"IFERROR(INDEX(Empresas!$B$6:$AS$46,SMALL(IF(Empresas!$B$6:$B$46=Dados!$H$37,ROW(Empresas!$B$6:$B$46)-5),ROW($A2)),COLUMN(AN$1)),\"\")","v":""},{"$f":"IFERROR(INDEX(Empresas!$B$6:$AS$46,SMALL(IF(Empresas!$B$6:$B$46=Dados!$H$37,ROW(Empresas!$B$6:$B$46)-5),ROW($A2)),COLUMN(AO$1)),\"\")","v":""},{"$f":"IFERROR(INDEX(Empresas!$B$6:$AS$46,SMALL(IF(Empresas!$B$6:$B$46=Dados!$H$37,ROW(Empresas!$B$6:$B$46)-5),ROW($A2)),COLUMN(AP$1)),\"\")","v":""},{"$f":"IFERROR(INDEX(Empresas!$B$6:$AS$46,SMALL(IF(Empresas!$B$6:$B$46=Dados!$H$37,ROW(Empresas!$B$6:$B$46)-5),ROW($A2)),COLUMN(AQ$1)),\"\")","v":""},{"$f":"IFERROR(INDEX(Empresas!$B$6:$AS$46,SMALL(IF(Empresas!$B$6:$B$46=Dados!$H$37,ROW(Empresas!$B$6:$B$46)-5),ROW($A2)),COLUMN(AR$1)),\"\")","v":""}]
[null,{"$f":"IFERROR(INDEX(Empresas!$B$6:$AS$46,SMALL(IF(Empresas!$B$6:$B$46=Dados!$H$37,ROW(Empresas!$B$6:$B$46)-5),ROW($A3)),COLUMN(B$1)),\"\")","v":15},{"$f":"IFERROR(INDEX(Empresas!$B$6:$AS$46,SMALL(IF(Empresas!$B$6:$B$46=Dados!$H$37,ROW(Empresas!$B$6:$B$46)-5),ROW($A3)),COLUMN(C$1)),\"\")","v":"EMPRESA 15"},1,{"$f":"IFERROR(INDEX(Empresas!$B$6:$AS$46,SMALL(IF(Empresas!$B$6:$B$46=Dados!$H$37,ROW(Empresas!$B$6:$B$46)-5),ROW($A3)),COLUMN(F$1)),\"\")","v":47},{"$f":"IFERROR(INDEX(Empresas!$B$6:$AS$46,SMALL(IF(Empresas!$B$6:$B$46=Dados!$H$37,ROW(Empresas!$B$6:$B$46)-5),ROW($A3)),COLUMN(G$1)),\"\")","v":8},{"$f":"IFERROR(INDEX(Empresas!$B$6:$AS$46,SMALL(IF(Empresas!$B$6:$B$46=Dados!$H$37,ROW(Empresas!$B$6:$B$46)-5),ROW($A3)),COLUMN(H$1)),\"\")","v":0.1702127659574468},{"$f":"IFERROR(INDEX(Empresas!$B$6:$AS$46,SMALL(IF(Empresas!$B$6:$B$46=Dados!$H$37,ROW(Empresas!$B$6:$B$46)-5),ROW($A3)),COLUMN(I$1)),\"\")","v":47},{"$f":"IFERROR(INDEX(Empresas!$B$6:$AS$46,SMALL(IF(Empresas!$B$6:$B$46=Dados!$H$37,ROW(Empresas!$B$6:$B$46)-5),ROW($A3)),COLUMN(J$1)),\"\")","v":12},{"$f":"IFERROR(INDEX(Empresas!$B$6:$AS$46,SMALL(IF(Empresas!$B$6:$B$46=Dados!$H$37,ROW(Empresas!$B$6:$B$46)-5),ROW($A3)),COLUMN(K$1)),\"\")","v":0.25531914893617019},{"$f":"IFERROR(INDEX(Empresas!$B$6:$AS$46,SMALL(IF(Empresas!$B$6:$B$46=Dados!$H$37,ROW(Empresas!$B$6:$B$46)-5),ROW($A3)),COLUMN(L$1)),\"\")","v":""},{"$f":"IFERROR(INDEX(Empresas!$B$6:$AS$46,SMALL(IF(Empresas!$B$6:$B$46=Dados!$H$37,ROW(Empresas!$B$6:$B$46)-5),ROW($A3)),COLUMN(M$1)),\"\")","v":""},{"$f":"IFERROR(INDEX(Empresas!$B$6:$AS$46,SMALL(IF(Empresas!$B$6:$B$46=Dados!$H$37,ROW(Empresas!$B$6:$B$46)-5),ROW($A3)),COLUMN(N$1)),\"\")","v":""},{"$f":"IFERROR(INDEX(Empresas!$B$6:$AS$46,SMALL(IF(Empresas!$B$6:$B$46=Dados!$H$37,ROW(Empresas!$B$6:$B$46)-5),ROW($A3)),COLUMN(O$1)),\"\")","v":""},{"$f":"IFERROR(INDEX(Empresas!$B$6:$AS$46,SMALL(IF(Empresas!$B$6:$B$46=Dados!$H$37,ROW(Empresas!$B$6:$B$46)-5),ROW($A3)),COLUMN(P$1)),\"\")","v":""},{"$f":"IFERROR(INDEX(Empresas!$B$6:$AS$46,SMALL(IF(Empresas!$B$6:$B$46=Dados!$H$37,ROW(Empresas!$B$6:$B$46)-5),ROW($A3)),COLUMN(Q$1)),\"\")","v":""},{"$f":"IFERROR(INDEX(Empresas!$B$6:$AS$46,SMALL(IF(Empresas!$B$6:$B$46=Dados!$H$37,ROW(Empresas!$B$6:$B$46)-5),ROW($A3)),COLUMN(R$1)),\"\")","v":""},{"$f":"IFERROR(INDEX(Empresas!$B$6:$AS$46,SMALL(IF(Empresas!$B$6:$B$46=Dados!$H$37,ROW(Empresas!$B$6:$B$46)-5),ROW($A3)),COLUMN(S$1)),\"\")","v":""},{"$f":"IFERROR(INDEX(Empresas!$B$6:$AS$46,SMALL(IF(Empresas!$B$6:$B$46=Dados!$H$37,ROW(Empresas!$B$6:$B$46)-5),ROW($A3)),COLUMN(T$1)),\"\")","v":""},{"$f":"IFERROR(INDEX(Empresas!$B$6:$AS$46,SMALL(IF(Empresas!$B$6:$B$46=Dados!$H$37,ROW(Empresas!$B$6:$B$46)-5),ROW($A3)),COLUMN(U$1)),\"\")","v":""},{"$f":"IFERROR(INDEX(Empresas!$B$6:$AS$46,SMALL(IF(Empresas!$B$6:$B$46=Dados!$H$37,ROW(Empresas!$B$6:$B$46)-5),ROW($A3)),COLUMN(V$1)),\"\")","v":""},{"$f":"IFERROR(INDEX(Empresas!$B$6:$AS$46,SMALL(IF(Empresas!$B$6:$B$46=Dados!$H$37,ROW(Empresas!$B$6:$B$46)-5),ROW($A3)),COLUMN(W$1)),\"\")","v":""},{"$f":"IFERROR(INDEX(Empresas!$B$6:$AS$46,SMALL(IF(Empresas!$B$6:$B$46=Dados!$H$37,ROW(Empresas!$B$6:$B$46)-5),ROW($A3)),COLUMN(X$1)),\"\")","v":""},{"$f":"IFERROR(INDEX(Empresas!$B$6:$AS$46,SMALL(IF(Empresas!$B$6:$B$46=Dados!$H$37,ROW(Empresas!$B$6:$B$46)-5),ROW($A3)),COLUMN(Y$1)),\"\")","v":""},{"$f":"IFERROR(INDEX(Empresas!$B$6:$AS$46,SMALL(IF(Empresas!$B$6:$B$46=Dados!$H$37,ROW(Empresas!$B$6:$B$46)-5),ROW($A3)),COLUMN(Z$1)),\"\")","v":""},{"$f":"IFERROR(INDEX(Empresas!$B$6:$AS$46,SMALL(IF(Empresas!$B$6:$B$46=Dados!$H$37,ROW(Empresas!$B$6:$B$46)-5),ROW($A3)),COLUMN(AA$1)),\"\")","v":""},{"$f":"IFERROR(INDEX(Empresas!$B$6:$AS$46,SMALL(IF(Empresas!$B$6:$B$46=Dados!$H$37,ROW(Empresas!$B$6:$B$46)-5),ROW($A3)),COLUMN(AB$1)),\"\")","v":""},{"$f":"IFERROR(INDEX(Empresas!$B$6:$AS$46,SMALL(IF(Empresas!$B$6:$B$46=Dados!$H$37,ROW(Empresas!$B$6:$B$46)-5),ROW($A3)),COLUMN(AC$1)),\"\")","v":""},{"$f":"IFERROR(INDEX(Empresas!$B$6:$AS$46,SMALL(IF(Empresas!$B$6:$B$46=Dados!$H$37,ROW(Empresas!$B$6:$B$46)-5),ROW($A3)),COLUMN(AD$1)),\"\")","v":""},{"$f":"IFERROR(INDEX(Empresas!$B$6:$AS$46,SMALL(IF(Empresas!$B$6:$B$46=Dados!$H$37,ROW(Empresas!$B$6:$B$46)-5),ROW($A3)),COLUMN(AE$1)),\"\")","v":""},{"$f":"IFERROR(INDEX(Empresas!$B$6:$AS$46,SMALL(IF(Empresas!$B$6:$B$46=Dados!$H$37,ROW(Empresas!$B$6:$B$46)-5),ROW($A3)),COLUMN(AF$1)),\"\")","v":""},{"$f":"IFERROR(INDEX(Empresas!$B$6:$AS$46,SMALL(IF(Empresas!$B$6:$B$46=Dados!$H$37,ROW(Empresas!$B$6:$B$46)-5),ROW($A3)),COLUMN(AG$1)),\"\")","v":""},{"$f":"IFERROR(INDEX(Empresas!$B$6:$AS$46,SMALL(IF(Empresas!$B$6:$B$46=Dados!$H$37,ROW(Empresas!$B$6:$B$46)-5),ROW($A3)),COLUMN(AH$1)),\"\")","v":""},{"$f":"IFERROR(INDEX(Empresas!$B$6:$AS$46,SMALL(IF(Empresas!$B$6:$B$46=Dados!$H$37,ROW(Empresas!$B$6:$B$46)-5),ROW($A3)),COLUMN(AI$1)),\"\")","v":""},{"$f":"IFERROR(INDEX(Empresas!$B$6:$AS$46,SMALL(IF(Empresas!$B$6:$B$46=Dados!$H$37,ROW(Empresas!$B$6:$B$46)-5),ROW($A3)),COLUMN(AJ$1)),\"\")","v":""},{"$f":"IFERROR(INDEX(Empresas!$B$6:$AS$46,SMALL(IF(Empresas!$B$6:$B$46=Dados!$H$37,ROW(Empresas!$B$6:$B$46)-5),ROW($A3)),COLUMN(AK$1)),\"\")","v":""},{"$f":"IFERROR(INDEX(Empresas!$B$6:$AS$46,SMALL(IF(Empresas!$B$6:$B$46=Dados!$H$37,ROW(Empresas!$B$6:$B$46)-5),ROW($A3)),COLUMN(AL$1)),\"\")","v":""},{"$f":"IFERROR(INDEX(Empresas!$B$6:$AS$46,SMALL(IF(Empresas!$B$6:$B$46=Dados!$H$37,ROW(Empresas!$B$6:$B$46)-5),ROW($A3)),COLUMN(AM$1)),\"\")","v":""},{"$f":"IFERROR(INDEX(Empresas!$B$6:$AS$46,SMALL(IF(Empresas!$B$6:$B$46=Dados!$H$37,ROW(Empresas!$B$6:$B$46)-5),ROW($A3)),COLUMN(AN$1)),\"\")","v":""},{"$f":"IFERROR(INDEX(Empresas!$B$6:$AS$46,SMALL(IF(Empresas!$B$6:$B$46=Dados!$H$37,ROW(Empresas!$B$6:$B$46)-5),ROW($A3)),COLUMN(AO$1)),\"\")","v":""},{"$f":"IFERROR(INDEX(Empresas!$B$6:$AS$46,SMALL(IF(Empresas!$B$6:$B$46=Dados!$H$37,ROW(Empresas!$B$6:$B$46)-5),ROW($A3)),COLUMN(AP$1)),\"\")","v":""},{"$f":"IFERROR(INDEX(Empresas!$B$6:$AS$46,SMALL(IF(Empresas!$B$6:$B$46=Dados!$H$37,ROW(Empresas!$B$6:$B$46)-5),ROW($A3)),COLUMN(AQ$1)),\"\")","v":""},{"$f":"IFERROR(INDEX(Empresas!$B$6:$AS$46,SMALL(IF(Empresas!$B$6:$B$46=Dados!$H$37,ROW(Empresas!$B$6:$B$46)-5),ROW($A3)),COLUMN(AR$1)),\"\")","v":""}]
[null,{"$f":"IFERROR(INDEX(Empresas!$B$6:$AS$46,SMALL(IF(Empresas!$B$6:$B$46=Dados!$H$37,ROW(Empresas!$B$6:$B$46)-5),ROW($A4)),COLUMN(B$1)),\"\")","v":16},{"$f":"IFERROR(INDEX(Empresas!$B$6:$AS$46,SMALL(IF(Empresas!$B$6:$B$46=Dados!$H$37,ROW(Empresas!$B$6:$B$46)-5),ROW($A4)),COLUMN(C$1)),\"\")","v":"EMPRESA 16"},3,{"$f":"IFERROR(INDEX(Empresas!$B$6:$AS$46,SMALL(IF(Empresas!$B$6:$B$46=Dados!$H$37,ROW(Empresas!$B$6:$B$46)-5),ROW($A4)),COLUMN(F$1)),\"\")","v":85},{"$f":"IFERROR(INDEX(Empresas!$B$6:$AS$46,SMALL(IF(Empresas!$B$6:$B$46=Dados!$H$37,ROW(Empresas!$B$6:$B$46)-5),ROW($A4)),COLUMN(G$1)),\"\")","v":80},{"$f":"IFERROR(INDEX(Empresas!$B$6:$AS$46,SMALL(IF(Empresas!$B$6:$B$46=Dados!$H$37,ROW(Empresas!$B$6:$B$46)-5),ROW($A4)),COLUMN(H$1)),\"\")","v":0.94117647058823528},{"$f":"IFERROR(INDEX(Empresas!$B$6:$AS$46,SMALL(IF(Empresas!$B$6:$B$46=Dados!$H$37,ROW(Empresas!$B$6:$B$46)-5),ROW($A4)),COLUMN(I$1)),\"\")","v":85},{"$f":"IFERROR(INDEX(Empresas!$B$6:$AS$46,SMALL(IF(Empresas!$B$6:$B$46=Dados!$H$37,ROW(Empresas!$B$6:$B$46)-5),ROW($A4)),COLUMN(J$1)),\"\")","v":66},{"$f":"IFERROR(INDEX(Empresas!$B$6:$AS$46,SMALL(IF(Empresas!$B$6:$B$46=Dados!$H$37,ROW(Empresas!$B$6:$B$46)-5),ROW($A4)),COLUMN(K$1)),\"\")","v":0.77647058823529413},{"$f":"IFERROR(INDEX(Empresas!$B$6:$AS$46,SMALL(IF(Empresas!$B$6:$B$46=Dados!$H$37,ROW(Empresas!$B$6:$B$46)-5),ROW($A4)),COLUMN(L$1)),\"\")","v":""},{"$f":"IFERROR(INDEX(Empresas!$B$6:$AS$46,SMALL(IF(Empresas!$B$6:$B$46=Dados!$H$37,ROW(Empresas!$B$6:$B$46)-5),ROW($A4)),COLUMN(M$1)),\"\")","v":""},{"$f":"IFERROR(INDEX(Empresas!$B$6:$AS$46,SMALL(IF(Empresas!$B$6:$B$46=Dados!$H$37,ROW(Empresas!$B$6:$B$46)-5),ROW($A4)),COLUMN(N$1)),\"\")","v":""},{"$f":"IFERROR(INDEX(Empresas!$B$6:$AS$46,SMALL(IF(Empresas!$B$6:$B$46=Dados!$H$37,ROW(Empresas!$B$6:$B$46)-5),ROW($A4)),COLUMN(O$1)),\"\")","v":""},{"$f":"IFERROR(INDEX(Empresas!$B$6:$AS$46,SMALL(IF(Empresas!$B$6:$B$46=Dados!$H$37,ROW(Empresas!$B$6:$B$46)-5),ROW($A4)),COLUMN(P$1)),\"\")","v":""},{"$f":"IFERROR(INDEX(Empresas!$B$6:$AS$46,SMALL(IF(Empresas!$B$6:$B$46=Dados!$H$37,ROW(Empresas!$B$6:$B$46)-5),ROW($A4)),COLUMN(Q$1)),\"\")","v":""},{"$f":"IFERROR(INDEX(Empresas!$B$6:$AS$46,SMALL(IF(Empresas!$B$6:$B$46=Dados!$H$37,ROW(Empresas!$B$6:$B$46)-5),ROW($A4)),COLUMN(R$1)),\"\")","v":""},{"$f":"IFERROR(INDEX(Empresas!$B$6:$AS$46,SMALL(IF(Empresas!$B$6:$B$46=Dados!$H$37,ROW(Empresas!$B$6:$B$46)-5),ROW($A4)),COLUMN(S$1)),\"\")","v":""},{"$f":"IFERROR(INDEX(Empresas!$B$6:$AS$46,SMALL(IF(Empresas!$B$6:$B$46=Dados!$H$37,ROW(Empresas!$B$6:$B$46)-5),ROW($A4)),COLUMN(T$1)),\"\")","v":""},{"$f":"IFERROR(INDEX(Empresas!$B$6:$AS$46,SMALL(IF(Empresas!$B$6:$B$46=Dados!$H$37,ROW(Empresas!$B$6:$B$46)-5),ROW($A4)),COLUMN(U$1)),\"\")","v":""},{"$f":"IFERROR(INDEX(Empresas!$B$6:$AS$46,SMALL(IF(Empresas!$B$6:$B$46=Dados!$H$37,ROW(Empresas!$B$6:$B$46)-5),ROW($A4)),COLUMN(V$1)),\"\")","v":""},{"$f":"IFERROR(INDEX(Empresas!$B$6:$AS$46,SMALL(IF(Empresas!$B$6:$B$46=Dados!$H$37,ROW(Empresas!$B$6:$B$46)-5),ROW($A4)),COLUMN(W$1)),\"\")","v":""},{"$f":"IFERROR(INDEX(Empresas!$B$6:$AS$46,SMALL(IF(Empresas!$B$6:$B$46=Dados!$H$37,ROW(Empresas!$B$6:$B$46)-5),ROW($A4)),COLUMN(X$1)),\"\")","v":""},{"$f":"IFERROR(INDEX(Empresas!$B$6:$AS$46,SMALL(IF(Empresas!$B$6:$B$46=Dados!$H$37,ROW(Empresas!$B$6:$B$46)-5),ROW($A4)),COLUMN(Y$1)),\"\")","v":""},{"$f":"IFERROR(INDEX(Empresas!$B$6:$AS$46,SMALL(IF(Empresas!$B$6:$B$46=Dados!$H$37,ROW(Empresas!$B$6:$B$46)-5),ROW($A4)),COLUMN(Z$1)),\"\")","v":""},{"$f":"IFERROR(INDEX(Empresas!$B$6:$AS$46,SMALL(IF(Empresas!$B$6:$B$46=Dados!$H$37,ROW(Empresas!$B$6:$B$46)-5),ROW($A4)),COLUMN(AA$1)),\"\")","v":""},{"$f":"IFERROR(INDEX(Empresas!$B$6:$AS$46,SMALL(IF(Empresas!$B$6:$B$46=Dados!$H$37,ROW(Empresas!$B$6:$B$46)-5),ROW($A4)),COLUMN(AB$1)),\"\")","v":""},{"$f":"IFERROR(INDEX(Empresas!$B$6:$AS$46,SMALL(IF(Empresas!$B$6:$B$46=Dados!$H$37,ROW(Empresas!$B$6:$B$46)-5),ROW($A4)),COLUMN(AC$1)),\"\")","v":""},{"$f":"IFERROR(INDEX(Empresas!$B$6:$AS$46,SMALL(IF(Empresas!$B$6:$B$46=Dados!$H$37,ROW(Empresas!$B$6:$B$46)-5),ROW($A4)),COLUMN(AD$1)),\"\")","v":""},{"$f":"IFERROR(INDEX(Empresas!$B$6:$AS$46,SMALL(IF(Empresas!$B$6:$B$46=Dados!$H$37,ROW(Empresas!$B$6:$B$46)-5),ROW($A4)),COLUMN(AE$1)),\"\")","v":""},{"$f":"IFERROR(INDEX(Empresas!$B$6:$AS$46,SMALL(IF(Empresas!$B$6:$B$46=Dados!$H$37,ROW(Empresas!$B$6:$B$46)-5),ROW($A4)),COLUMN(AF$1)),\"\")","v":""},{"$f":"IFERROR(INDEX(Empresas!$B$6:$AS$46,SMALL(IF(Empresas!$B$6:$B$46=Dados!$H$37,ROW(Empresas!$B$6:$B$46)-5),ROW($A4)),COLUMN(AG$1)),\"\")","v":""},{"$f":"IFERROR(INDEX(Empresas!$B$6:$AS$46,SMALL(IF(Empresas!$B$6:$B$46=Dados!$H$37,ROW(Empresas!$B$6:$B$46)-5),ROW($A4)),COLUMN(AH$1)),\"\")","v":""},{"$f":"IFERROR(INDEX(Empresas!$B$6:$AS$46,SMALL(IF(Empresas!$B$6:$B$46=Dados!$H$37,ROW(Empresas!$B$6:$B$46)-5),ROW($A4)),COLUMN(AI$1)),\"\")","v":""},{"$f":"IFERROR(INDEX(Empresas!$B$6:$AS$46,SMALL(IF(Empresas!$B$6:$B$46=Dados!$H$37,ROW(Empresas!$B$6:$B$46)-5),ROW($A4)),COLUMN(AJ$1)),\"\")","v":""},{"$f":"IFERROR(INDEX(Empresas!$B$6:$AS$46,SMALL(IF(Empresas!$B$6:$B$46=Dados!$H$37,ROW(Empresas!$B$6:$B$46)-5),ROW($A4)),COLUMN(AK$1)),\"\")","v":""},{"$f":"IFERROR(INDEX(Empresas!$B$6:$AS$46,SMALL(IF(Empresas!$B$6:$B$46=Dados!$H$37,ROW(Empresas!$B$6:$B$46)-5),ROW($A4)),COLUMN(AL$1)),\"\")","v":""},{"$f":"IFERROR(INDEX(Empresas!$B$6:$AS$46,SMALL(IF(Empresas!$B$6:$B$46=Dados!$H$37,ROW(Empresas!$B$6:$B$46)-5),ROW($A4)),COLUMN(AM$1)),\"\")","v":""},{"$f":"IFERROR(INDEX(Empresas!$B$6:$AS$46,SMALL(IF(Empresas!$B$6:$B$46=Dados!$H$37,ROW(Empresas!$B$6:$B$46)-5),ROW($A4)),COLUMN(AN$1)),\"\")","v":""},{"$f":"IFERROR(INDEX(Empresas!$B$6:$AS$46,SMALL(IF(Empresas!$B$6:$B$46=Dados!$H$37,ROW(Empresas!$B$6:$B$46)-5),ROW($A4)),COLUMN(AO$1)),\"\")","v":""},{"$f":"IFERROR(INDEX(Empresas!$B$6:$AS$46,SMALL(IF(Empresas!$B$6:$B$46=Dados!$H$37,ROW(Empresas!$B$6:$B$46)-5),ROW($A4)),COLUMN(AP$1)),\"\")","v":""},{"$f":"IFERROR(INDEX(Empresas!$B$6:$AS$46,SMALL(IF(Empresas!$B$6:$B$46=Dados!$H$37,ROW(Empresas!$B$6:$B$46)-5),ROW($A4)),COLUMN(AQ$1)),\"\")","v":""},{"$f":"IFERROR(INDEX(Empresas!$B$6:$AS$46,SMALL(IF(Empresas!$B$6:$B$46=Dados!$H$37,ROW(Empresas!$B$6:$B$46)-5),ROW($A4)),COLUMN(AR$1)),\"\")","v":""}]
[null,{"$f":"IFERROR(INDEX(Empresas!$B$6:$AS$46,SMALL(IF(Empresas!$B$6:$B$46=Dados!$H$37,ROW(Empresas!$B$6:$B$46)-5),ROW($A5)),COLUMN(B$1)),\"\")","v":17},{"$f":"IFERROR(INDEX(Empresas!$B$6:$AS$46,SMALL(IF(Empresas!$B$6:$B$46=Dados!$H$37,ROW(Empresas!$B$6:$B$46)-5),ROW($A5)),COLUMN(C$1)),\"\")","v":"EMPRESA 17"},1,{"$f":"IFERROR(INDEX(Empresas!$B$6:$AS$46,SMALL(IF(Empresas!$B$6:$B$46=Dados!$H$37,ROW(Empresas!$B$6:$B$46)-5),ROW($A5)),COLUMN(F$1)),\"\")","v":87},{"$f":"IFERROR(INDEX(Empresas!$B$6:$AS$46,SMALL(IF(Empresas!$B$6:$B$46=Dados!$H$37,ROW(Empresas!$B$6:$B$46)-5),ROW($A5)),COLUMN(G$1)),\"\")","v":27},{"$f":"IFERROR(INDEX(Empresas!$B$6:$AS$46,SMALL(IF(Empresas!$B$6:$B$46=Dados!$H$37,ROW(Empresas!$B$6:$B$46)-5),ROW($A5)),COLUMN(H$1)),\"\")","v":0.31034482758620691},{"$f":"IFERROR(INDEX(Empresas!$B$6:$AS$46,SMALL(IF(Empresas!$B$6:$B$46=Dados!$H$37,ROW(Empresas!$B$6:$B$46)-5),ROW($A5)),COLUMN(I$1)),\"\")","v":87},{"$f":"IFERROR(INDEX(Empresas!$B$6:$AS$46,SMALL(IF(Empresas!$B$6:$B$46=Dados!$H$37,ROW(Empresas!$B$6:$B$46)-5),ROW($A5)),COLUMN(J$1)),\"\")","v":37},{"$f":"IFERROR(INDEX(Empresas!$B$6:$AS$46,SMALL(IF(Empresas!$B$6:$B$46=Dados!$H$37,ROW(Empresas!$B$6:$B$46)-5),ROW($A5)),COLUMN(K$1)),\"\")","v":0.42528735632183906},{"$f":"IFERROR(INDEX(Empresas!$B$6:$AS$46,SMALL(IF(Empresas!$B$6:$B$46=Dados!$H$37,ROW(Empresas!$B$6:$B$46)-5),ROW($A5)),COLUMN(L$1)),\"\")","v":""},{"$f":"IFERROR(INDEX(Empresas!$B$6:$AS$46,SMALL(IF(Empresas!$B$6:$B$46=Dados!$H$37,ROW(Empresas!$B$6:$B$46)-5),ROW($A5)),COLUMN(M$1)),\"\")","v":""},{"$f":"IFERROR(INDEX(Empresas!$B$6:$AS$46,SMALL(IF(Empresas!$B$6:$B$46=Dados!$H$37,ROW(Empresas!$B$6:$B$46)-5),ROW($A5)),COLUMN(N$1)),\"\")","v":""},{"$f":"IFERROR(INDEX(Empresas!$B$6:$AS$46,SMALL(IF(Empresas!$B$6:$B$46=Dados!$H$37,ROW(Empresas!$B$6:$B$46)-5),ROW($A5)),COLUMN(O$1)),\"\")","v":""},{"$f":"IFERROR(INDEX(Empresas!$B$6:$AS$46,SMALL(IF(Empresas!$B$6:$B$46=Dados!$H$37,ROW(Empresas!$B$6:$B$46)-5),ROW($A5)),COLUMN(P$1)),\"\")","v":""},{"$f":"IFERROR(INDEX(Empresas!$B$6:$AS$46,SMALL(IF(Empresas!$B$6:$B$46=Dados!$H$37,ROW(Empresas!$B$6:$B$46)-5),ROW($A5)),COLUMN(Q$1)),\"\")","v":""},{"$f":"IFERROR(INDEX(Empresas!$B$6:$AS$46,SMALL(IF(Empresas!$B$6:$B$46=Dados!$H$37,ROW(Empresas!$B$6:$B$46)-5),ROW($A5)),COLUMN(R$1)),\"\")","v":""},{"$f":"IFERROR(INDEX(Empresas!$B$6:$AS$46,SMALL(IF(Empresas!$B$6:$B$46=Dados!$H$37,ROW(Empresas!$B$6:$B$46)-5),ROW($A5)),COLUMN(S$1)),\"\")","v":""},{"$f":"IFERROR(INDEX(Empresas!$B$6:$AS$46,SMALL(IF(Empresas!$B$6:$B$46=Dados!$H$37,ROW(Empresas!$B$6:$B$46)-5),ROW($A5)),COLUMN(T$1)),\"\")","v":""},{"$f":"IFERROR(INDEX(Empresas!$B$6:$AS$46,SMALL(IF(Empresas!$B$6:$B$46=Dados!$H$37,ROW(Empresas!$B$6:$B$46)-5),ROW($A5)),COLUMN(U$1)),\"\")","v":""},{"$f":"IFERROR(INDEX(Empresas!$B$6:$AS$46,SMALL(IF(Empresas!$B$6:$B$46=Dados!$H$37,ROW(Empresas!$B$6:$B$46)-5),ROW($A5)),COLUMN(V$1)),\"\")","v":""},{"$f":"IFERROR(INDEX(Empresas!$B$6:$AS$46,SMALL(IF(Empresas!$B$6:$B$46=Dados!$H$37,ROW(Empresas!$B$6:$B$46)-5),ROW($A5)),COLUMN(W$1)),\"\")","v":""},{"$f":"IFERROR(INDEX(Empresas!$B$6:$AS$46,SMALL(IF(Empresas!$B$6:$B$46=Dados!$H$37,ROW(Empresas!$B$6:$B$46)-5),ROW($A5)),COLUMN(X$1)),\"\")","v":""},{"$f":"IFERROR(INDEX(Empresas!$B$6:$AS$46,SMALL(IF(Empresas!$B$6:$B$46=Dados!$H$37,ROW(Empresas!$B$6:$B$46)-5),ROW($A5)),COLUMN(Y$1)),\"\")","v":""},{"$f":"IFERROR(INDEX(Empresas!$B$6:$AS$46,SMALL(IF(Empresas!$B$6:$B$46=Dados!$H$37,ROW(Empresas!$B$6:$B$46)-5),ROW($A5)),COLUMN(Z$1)),\"\")","v":""},{"$f":"IFERROR(INDEX(Empresas!$B$6:$AS$46,SMALL(IF(Empresas!$B$6:$B$46=Dados!$H$37,ROW(Empresas!$B$6:$B$46)-5),ROW($A5)),COLUMN(AA$1)),\"\")","v":""},{"$f":"IFERROR(INDEX(Empresas!$B$6:$AS$46,SMALL(IF(Empresas!$B$6:$B$46=Dados!$H$37,ROW(Empresas!$B$6:$B$46)-5),ROW($A5)),COLUMN(AB$1)),\"\")","v":""},{"$f":"IFERROR(INDEX(Empresas!$B$6:$AS$46,SMALL(IF(Empresas!$B$6:$B$46=Dados!$H$37,ROW(Empresas!$B$6:$B$46)-5),ROW($A5)),COLUMN(AC$1)),\"\")","v":""},{"$f":"IFERROR(INDEX(Empresas!$B$6:$AS$46,SMALL(IF(Empresas!$B$6:$B$46=Dados!$H$37,ROW(Empresas!$B$6:$B$46)-5),ROW($A5)),COLUMN(AD$1)),\"\")","v":""},{"$f":"IFERROR(INDEX(Empresas!$B$6:$AS$46,SMALL(IF(Empresas!$B$6:$B$46=Dados!$H$37,ROW(Empresas!$B$6:$B$46)-5),ROW($A5)),COLUMN(AE$1)),\"\")","v":""},{"$f":"IFERROR(INDEX(Empresas!$B$6:$AS$46,SMALL(IF(Empresas!$B$6:$B$46=Dados!$H$37,ROW(Empresas!$B$6:$B$46)-5),ROW($A5)),COLUMN(AF$1)),\"\")","v":""},{"$f":"IFERROR(INDEX(Empresas!$B$6:$AS$46,SMALL(IF(Empresas!$B$6:$B$46=Dados!$H$37,ROW(Empresas!$B$6:$B$46)-5),ROW($A5)),COLUMN(AG$1)),\"\")","v":""},{"$f":"IFERROR(INDEX(Empresas!$B$6:$AS$46,SMALL(IF(Empresas!$B$6:$B$46=Dados!$H$37,ROW(Empresas!$B$6:$B$46)-5),ROW($A5)),COLUMN(AH$1)),\"\")","v":""},{"$f":"IFERROR(INDEX(Empresas!$B$6:$AS$46,SMALL(IF(Empresas!$B$6:$B$46=Dados!$H$37,ROW(Empresas!$B$6:$B$46)-5),ROW($A5)),COLUMN(AI$1)),\"\")","v":""},{"$f":"IFERROR(INDEX(Empresas!$B$6:$AS$46,SMALL(IF(Empresas!$B$6:$B$46=Dados!$H$37,ROW(Empresas!$B$6:$B$46)-5),ROW($A5)),COLUMN(AJ$1)),\"\")","v":""},{"$f":"IFERROR(INDEX(Empresas!$B$6:$AS$46,SMALL(IF(Empresas!$B$6:$B$46=Dados!$H$37,ROW(Empresas!$B$6:$B$46)-5),ROW($A5)),COLUMN(AK$1)),\"\")","v":""},{"$f":"IFERROR(INDEX(Empresas!$B$6:$AS$46,SMALL(IF(Empresas!$B$6:$B$46=Dados!$H$37,ROW(Empresas!$B$6:$B$46)-5),ROW($A5)),COLUMN(AL$1)),\"\")","v":""},{"$f":"IFERROR(INDEX(Empresas!$B$6:$AS$46,SMALL(IF(Empresas!$B$6:$B$46=Dados!$H$37,ROW(Empresas!$B$6:$B$46)-5),ROW($A5)),COLUMN(AM$1)),\"\")","v":""},{"$f":"IFERROR(INDEX(Empresas!$B$6:$AS$46,SMALL(IF(Empresas!$B$6:$B$46=Dados!$H$37,ROW(Empresas!$B$6:$B$46)-5),ROW($A5)),COLUMN(AN$1)),\"\")","v":""},{"$f":"IFERROR(INDEX(Empresas!$B$6:$AS$46,SMALL(IF(Empresas!$B$6:$B$46=Dados!$H$37,ROW(Empresas!$B$6:$B$46)-5),ROW($A5)),COLUMN(AO$1)),\"\")","v":""},{"$f":"IFERROR(INDEX(Empresas!$B$6:$AS$46,SMALL(IF(Empresas!$B$6:$B$46=Dados!$H$37,ROW(Empresas!$B$6:$B$46)-5),ROW($A5)),COLUMN(AP$1)),\"\")","v":""},{"$f":"IFERROR(INDEX(Empresas!$B$6:$AS$46,SMALL(IF(Empresas!$B$6:$B$46=Dados!$H$37,ROW(Empresas!$B$6:$B$46)-5),ROW($A5)),COLUMN(AQ$1)),\"\")","v":""},{"$f":"IFERROR(INDEX(Empresas!$B$6:$AS$46,SMALL(IF(Empresas!$B$6:$B$46=Dados!$H$37,ROW(Empresas!$B$6:$B$46)-5),ROW($A5)),COLUMN(AR$1)),\"\")","v":""}]
[null,{"$f":"IFERROR(INDEX(Empresas!$B$6:$AS$46,SMALL(IF(Empresas!$B$6:$B$46=Dados!$H$37,ROW(Empresas!$B$6:$B$46)-5),ROW($A7)),COLUMN(B$1)),\"\")","v":""},{"$f":"IFERROR(INDEX(Empresas!$B$6:$AS$46,SMALL(IF(Empresas!$B$6:$B$46=Dados!$H$37,ROW(Empresas!$B$6:$B$46)-5),ROW($A7)),COLUMN(C$1)),\"\")","v":""},"",{"$f":"IFERROR(INDEX(Empresas!$B$6:$AS$46,SMALL(IF(Empresas!$B$6:$B$46=Dados!$H$37,ROW(Empresas!$B$6:$B$46)-5),ROW($A7)),COLUMN(F$1)),\"\")","v":""},{"$f":"IFERROR(INDEX(Empresas!$B$6:$AS$46,SMALL(IF(Empresas!$B$6:$B$46=Dados!$H$37,ROW(Empresas!$B$6:$B$46)-5),ROW($A7)),COLUMN(G$1)),\"\")","v":""},{"$f":"IFERROR(INDEX(Empresas!$B$6:$AS$46,SMALL(IF(Empresas!$B$6:$B$46=Dados!$H$37,ROW(Empresas!$B$6:$B$46)-5),ROW($A7)),COLUMN(H$1)),\"\")","v":""},{"$f":"IFERROR(INDEX(Empresas!$B$6:$AS$46,SMALL(IF(Empresas!$B$6:$B$46=Dados!$H$37,ROW(Empresas!$B$6:$B$46)-5),ROW($A7)),COLUMN(I$1)),\"\")","v":""},{"$f":"IFERROR(INDEX(Empresas!$B$6:$AS$46,SMALL(IF(Empresas!$B$6:$B$46=Dados!$H$37,ROW(Empresas!$B$6:$B$46)-5),ROW($A7)),COLUMN(J$1)),\"\")","v":""},{"$f":"IFERROR(INDEX(Empresas!$B$6:$AS$46,SMALL(IF(Empresas!$B$6:$B$46=Dados!$H$37,ROW(Empresas!$B$6:$B$46)-5),ROW($A7)),COLUMN(K$1)),\"\")","v":""},{"$f":"IFERROR(INDEX(Empresas!$B$6:$AS$46,SMALL(IF(Empresas!$B$6:$B$46=Dados!$H$37,ROW(Empresas!$B$6:$B$46)-5),ROW($A7)),COLUMN(L$1)),\"\")","v":""},{"$f":"IFERROR(INDEX(Empresas!$B$6:$AS$46,SMALL(IF(Empresas!$B$6:$B$46=Dados!$H$37,ROW(Empresas!$B$6:$B$46)-5),ROW($A7)),COLUMN(M$1)),\"\")","v":""},{"$f":"IFERROR(INDEX(Empresas!$B$6:$AS$46,SMALL(IF(Empresas!$B$6:$B$46=Dados!$H$37,ROW(Empresas!$B$6:$B$46)-5),ROW($A7)),COLUMN(N$1)),\"\")","v":""},{"$f":"IFERROR(INDEX(Empresas!$B$6:$AS$46,SMALL(IF(Empresas!$B$6:$B$46=Dados!$H$37,ROW(Empresas!$B$6:$B$46)-5),ROW($A7)),COLUMN(O$1)),\"\")","v":""},{"$f":"IFERROR(INDEX(Empresas!$B$6:$AS$46,SMALL(IF(Empresas!$B$6:$B$46=Dados!$H$37,ROW(Empresas!$B$6:$B$46)-5),ROW($A7)),COLUMN(P$1)),\"\")","v":""},{"$f":"IFERROR(INDEX(Empresas!$B$6:$AS$46,SMALL(IF(Empresas!$B$6:$B$46=Dados!$H$37,ROW(Empresas!$B$6:$B$46)-5),ROW($A7)),COLUMN(Q$1)),\"\")","v":""},{"$f":"IFERROR(INDEX(Empresas!$B$6:$AS$46,SMALL(IF(Empresas!$B$6:$B$46=Dados!$H$37,ROW(Empresas!$B$6:$B$46)-5),ROW($A7)),COLUMN(R$1)),\"\")","v":""},{"$f":"IFERROR(INDEX(Empresas!$B$6:$AS$46,SMALL(IF(Empresas!$B$6:$B$46=Dados!$H$37,ROW(Empresas!$B$6:$B$46)-5),ROW($A7)),COLUMN(S$1)),\"\")","v":""},{"$f":"IFERROR(INDEX(Empresas!$B$6:$AS$46,SMALL(IF(Empresas!$B$6:$B$46=Dados!$H$37,ROW(Empresas!$B$6:$B$46)-5),ROW($A7)),COLUMN(T$1)),\"\")","v":""},{"$f":"IFERROR(INDEX(Empresas!$B$6:$AS$46,SMALL(IF(Empresas!$B$6:$B$46=Dados!$H$37,ROW(Empresas!$B$6:$B$46)-5),ROW($A7)),COLUMN(U$1)),\"\")","v":""},{"$f":"IFERROR(INDEX(Empresas!$B$6:$AS$46,SMALL(IF(Empresas!$B$6:$B$46=Dados!$H$37,ROW(Empresas!$B$6:$B$46)-5),ROW($A7)),COLUMN(V$1)),\"\")","v":""},{"$f":"IFERROR(INDEX(Empresas!$B$6:$AS$46,SMALL(IF(Empresas!$B$6:$B$46=Dados!$H$37,ROW(Empresas!$B$6:$B$46)-5),ROW($A7)),COLUMN(W$1)),\"\")","v":""},{"$f":"IFERROR(INDEX(Empresas!$B$6:$AS$46,SMALL(IF(Empresas!$B$6:$B$46=Dados!$H$37,ROW(Empresas!$B$6:$B$46)-5),ROW($A7)),COLUMN(X$1)),\"\")","v":""},{"$f":"IFERROR(INDEX(Empresas!$B$6:$AS$46,SMALL(IF(Empresas!$B$6:$B$46=Dados!$H$37,ROW(Empresas!$B$6:$B$46)-5),ROW($A7)),COLUMN(Y$1)),\"\")","v":""},{"$f":"IFERROR(INDEX(Empresas!$B$6:$AS$46,SMALL(IF(Empresas!$B$6:$B$46=Dados!$H$37,ROW(Empresas!$B$6:$B$46)-5),ROW($A7)),COLUMN(Z$1)),\"\")","v":""},{"$f":"IFERROR(INDEX(Empresas!$B$6:$AS$46,SMALL(IF(Empresas!$B$6:$B$46=Dados!$H$37,ROW(Empresas!$B$6:$B$46)-5),ROW($A7)),COLUMN(AA$1)),\"\")","v":""},{"$f":"IFERROR(INDEX(Empresas!$B$6:$AS$46,SMALL(IF(Empresas!$B$6:$B$46=Dados!$H$37,ROW(Empresas!$B$6:$B$46)-5),ROW($A7)),COLUMN(AB$1)),\"\")","v":""},{"$f":"IFERROR(INDEX(Empresas!$B$6:$AS$46,SMALL(IF(Empresas!$B$6:$B$46=Dados!$H$37,ROW(Empresas!$B$6:$B$46)-5),ROW($A7)),COLUMN(AC$1)),\"\")","v":""},{"$f":"IFERROR(INDEX(Empresas!$B$6:$AS$46,SMALL(IF(Empresas!$B$6:$B$46=Dados!$H$37,ROW(Empresas!$B$6:$B$46)-5),ROW($A7)),COLUMN(AD$1)),\"\")","v":""},{"$f":"IFERROR(INDEX(Empresas!$B$6:$AS$46,SMALL(IF(Empresas!$B$6:$B$46=Dados!$H$37,ROW(Empresas!$B$6:$B$46)-5),ROW($A7)),COLUMN(AE$1)),\"\")","v":""},{"$f":"IFERROR(INDEX(Empresas!$B$6:$AS$46,SMALL(IF(Empresas!$B$6:$B$46=Dados!$H$37,ROW(Empresas!$B$6:$B$46)-5),ROW($A7)),COLUMN(AF$1)),\"\")","v":""},{"$f":"IFERROR(INDEX(Empresas!$B$6:$AS$46,SMALL(IF(Empresas!$B$6:$B$46=Dados!$H$37,ROW(Empresas!$B$6:$B$46)-5),ROW($A7)),COLUMN(AG$1)),\"\")","v":""},{"$f":"IFERROR(INDEX(Empresas!$B$6:$AS$46,SMALL(IF(Empresas!$B$6:$B$46=Dados!$H$37,ROW(Empresas!$B$6:$B$46)-5),ROW($A7)),COLUMN(AH$1)),\"\")","v":""},{"$f":"IFERROR(INDEX(Empresas!$B$6:$AS$46,SMALL(IF(Empresas!$B$6:$B$46=Dados!$H$37,ROW(Empresas!$B$6:$B$46)-5),ROW($A7)),COLUMN(AI$1)),\"\")","v":""},{"$f":"IFERROR(INDEX(Empresas!$B$6:$AS$46,SMALL(IF(Empresas!$B$6:$B$46=Dados!$H$37,ROW(Empresas!$B$6:$B$46)-5),ROW($A7)),COLUMN(AJ$1)),\"\")","v":""},{"$f":"IFERROR(INDEX(Empresas!$B$6:$AS$46,SMALL(IF(Empresas!$B$6:$B$46=Dados!$H$37,ROW(Empresas!$B$6:$B$46)-5),ROW($A7)),COLUMN(AK$1)),\"\")","v":""},{"$f":"IFERROR(INDEX(Empresas!$B$6:$AS$46,SMALL(IF(Empresas!$B$6:$B$46=Dados!$H$37,ROW(Empresas!$B$6:$B$46)-5),ROW($A7)),COLUMN(AL$1)),\"\")","v":""},{"$f":"IFERROR(INDEX(Empresas!$B$6:$AS$46,SMALL(IF(Empresas!$B$6:$B$46=Dados!$H$37,ROW(Empresas!$B$6:$B$46)-5),ROW($A7)),COLUMN(AM$1)),\"\")","v":""},{"$f":"IFERROR(INDEX(Empresas!$B$6:$AS$46,SMALL(IF(Empresas!$B$6:$B$46=Dados!$H$37,ROW(Empresas!$B$6:$B$46)-5),ROW($A7)),COLUMN(AN$1)),\"\")","v":""},{"$f":"IFERROR(INDEX(Empresas!$B$6:$AS$46,SMALL(IF(Empresas!$B$6:$B$46=Dados!$H$37,ROW(Empresas!$B$6:$B$46)-5),ROW($A7)),COLUMN(AO$1)),\"\")","v":""},{"$f":"IFERROR(INDEX(Empresas!$B$6:$AS$46,SMALL(IF(Empresas!$B$6:$B$46=Dados!$H$37,ROW(Empresas!$B$6:$B$46)-5),ROW($A7)),COLUMN(AP$1)),\"\")","v":""},{"$f":"IFERROR(INDEX(Empresas!$B$6:$AS$46,SMALL(IF(Empresas!$B$6:$B$46=Dados!$H$37,ROW(Empresas!$B$6:$B$46)-5),ROW($A7)),COLUMN(AQ$1)),\"\")","v":""},{"$f":"IFERROR(INDEX(Empresas!$B$6:$AS$46,SMALL(IF(Empresas!$B$6:$B$46=Dados!$H$37,ROW(Empresas!$B$6:$B$46)-5),ROW($A7)),COLUMN(AR$1)),\"\")","v":""}]
[null,{"$f":"IFERROR(INDEX(Empresas!$B$6:$AS$46,SMALL(IF(Empresas!$B$6:$B$46=Dados!$H$37,ROW(Empresas!$B$6:$B$46)-5),ROW($A8)),COLUMN(B$1)),\"\")","v":""},{"$f":"IFERROR(INDEX(Empresas!$B$6:$AS$46,SMALL(IF(Empresas!$B$6:$B$46=Dados!$H$37,ROW(Empresas!$B$6:$B$46)-5),ROW($A8)),COLUMN(C$1)),\"\")","v":""},"",{"$f":"IFERROR(INDEX(Empresas!$B$6:$AS$46,SMALL(IF(Empresas!$B$6:$B$46=Dados!$H$37,ROW(Empresas!$B$6:$B$46)-5),ROW($A8)),COLUMN(F$1)),\"\")","v":""},{"$f":"IFERROR(INDEX(Empresas!$B$6:$AS$46,SMALL(IF(Empresas!$B$6:$B$46=Dados!$H$37,ROW(Empresas!$B$6:$B$46)-5),ROW($A8)),COLUMN(G$1)),\"\")","v":""},{"$f":"IFERROR(INDEX(Empresas!$B$6:$AS$46,SMALL(IF(Empresas!$B$6:$B$46=Dados!$H$37,ROW(Empresas!$B$6:$B$46)-5),ROW($A8)),COLUMN(H$1)),\"\")","v":""},{"$f":"IFERROR(INDEX(Empresas!$B$6:$AS$46,SMALL(IF(Empresas!$B$6:$B$46=Dados!$H$37,ROW(Empresas!$B$6:$B$46)-5),ROW($A8)),COLUMN(I$1)),\"\")","v":""},{"$f":"IFERROR(INDEX(Empresas!$B$6:$AS$46,SMALL(IF(Empresas!$B$6:$B$46=Dados!$H$37,ROW(Empresas!$B$6:$B$46)-5),ROW($A8)),COLUMN(J$1)),\"\")","v":""},{"$f":"IFERROR(INDEX(Empresas!$B$6:$AS$46,SMALL(IF(Empresas!$B$6:$B$46=Dados!$H$37,ROW(Empresas!$B$6:$B$46)-5),ROW($A8)),COLUMN(K$1)),\"\")","v":""},{"$f":"IFERROR(INDEX(Empresas!$B$6:$AS$46,SMALL(IF(Empresas!$B$6:$B$46=Dados!$H$37,ROW(Empresas!$B$6:$B$46)-5),ROW($A8)),COLUMN(L$1)),\"\")","v":""},{"$f":"IFERROR(INDEX(Empresas!$B$6:$AS$46,SMALL(IF(Empresas!$B$6:$B$46=Dados!$H$37,ROW(Empresas!$B$6:$B$46)-5),ROW($A8)),COLUMN(M$1)),\"\")","v":""},{"$f":"IFERROR(INDEX(Empresas!$B$6:$AS$46,SMALL(IF(Empresas!$B$6:$B$46=Dados!$H$37,ROW(Empresas!$B$6:$B$46)-5),ROW($A8)),COLUMN(N$1)),\"\")","v":""},{"$f":"IFERROR(INDEX(Empresas!$B$6:$AS$46,SMALL(IF(Empresas!$B$6:$B$46=Dados!$H$37,ROW(Empresas!$B$6:$B$46)-5),ROW($A8)),COLUMN(O$1)),\"\")","v":""},{"$f":"IFERROR(INDEX(Empresas!$B$6:$AS$46,SMALL(IF(Empresas!$B$6:$B$46=Dados!$H$37,ROW(Empresas!$B$6:$B$46)-5),ROW($A8)),COLUMN(P$1)),\"\")","v":""},{"$f":"IFERROR(INDEX(Empresas!$B$6:$AS$46,SMALL(IF(Empresas!$B$6:$B$46=Dados!$H$37,ROW(Empresas!$B$6:$B$46)-5),ROW($A8)),COLUMN(Q$1)),\"\")","v":""},{"$f":"IFERROR(INDEX(Empresas!$B$6:$AS$46,SMALL(IF(Empresas!$B$6:$B$46=Dados!$H$37,ROW(Empresas!$B$6:$B$46)-5),ROW($A8)),COLUMN(R$1)),\"\")","v":""},{"$f":"IFERROR(INDEX(Empresas!$B$6:$AS$46,SMALL(IF(Empresas!$B$6:$B$46=Dados!$H$37,ROW(Empresas!$B$6:$B$46)-5),ROW($A8)),COLUMN(S$1)),\"\")","v":""},{"$f":"IFERROR(INDEX(Empresas!$B$6:$AS$46,SMALL(IF(Empresas!$B$6:$B$46=Dados!$H$37,ROW(Empresas!$B$6:$B$46)-5),ROW($A8)),COLUMN(T$1)),\"\")","v":""},{"$f":"IFERROR(INDEX(Empresas!$B$6:$AS$46,SMALL(IF(Empresas!$B$6:$B$46=Dados!$H$37,ROW(Empresas!$B$6:$B$46)-5),ROW($A8)),COLUMN(U$1)),\"\")","v":""},{"$f":"IFERROR(INDEX(Empresas!$B$6:$AS$46,SMALL(IF(Empresas!$B$6:$B$46=Dados!$H$37,ROW(Empresas!$B$6:$B$46)-5),ROW($A8)),COLUMN(V$1)),\"\")","v":""},{"$f":"IFERROR(INDEX(Empresas!$B$6:$AS$46,SMALL(IF(Empresas!$B$6:$B$46=Dados!$H$37,ROW(Empresas!$B$6:$B$46)-5),ROW($A8)),COLUMN(W$1)),\"\")","v":""},{"$f":"IFERROR(INDEX(Empresas!$B$6:$AS$46,SMALL(IF(Empresas!$B$6:$B$46=Dados!$H$37,ROW(Empresas!$B$6:$B$46)-5),ROW($A8)),COLUMN(X$1)),\"\")","v":""},{"$f":"IFERROR(INDEX(Empresas!$B$6:$AS$46,SMALL(IF(Empresas!$B$6:$B$46=Dados!$H$37,ROW(Empresas!$B$6:$B$46)-5),ROW($A8)),COLUMN(Y$1)),\"\")","v":""},{"$f":"IFERROR(INDEX(Empresas!$B$6:$AS$46,SMALL(IF(Empresas!$B$6:$B$46=Dados!$H$37,ROW(Empresas!$B$6:$B$46)-5),ROW($A8)),COLUMN(Z$1)),\"\")","v":""},{"$f":"IFERROR(INDEX(Empresas!$B$6:$AS$46,SMALL(IF(Empresas!$B$6:$B$46=Dados!$H$37,ROW(Empresas!$B$6:$B$46)-5),ROW($A8)),COLUMN(AA$1)),\"\")","v":""},{"$f":"IFERROR(INDEX(Empresas!$B$6:$AS$46,SMALL(IF(Empresas!$B$6:$B$46=Dados!$H$37,ROW(Empresas!$B$6:$B$46)-5),ROW($A8)),COLUMN(AB$1)),\"\")","v":""},{"$f":"IFERROR(INDEX(Empresas!$B$6:$AS$46,SMALL(IF(Empresas!$B$6:$B$46=Dados!$H$37,ROW(Empresas!$B$6:$B$46)-5),ROW($A8)),COLUMN(AC$1)),\"\")","v":""},{"$f":"IFERROR(INDEX(Empresas!$B$6:$AS$46,SMALL(IF(Empresas!$B$6:$B$46=Dados!$H$37,ROW(Empresas!$B$6:$B$46)-5),ROW($A8)),COLUMN(AD$1)),\"\")","v":""},{"$f":"IFERROR(INDEX(Empresas!$B$6:$AS$46,SMALL(IF(Empresas!$B$6:$B$46=Dados!$H$37,ROW(Empresas!$B$6:$B$46)-5),ROW($A8)),COLUMN(AE$1)),\"\")","v":""},{"$f":"IFERROR(INDEX(Empresas!$B$6:$AS$46,SMALL(IF(Empresas!$B$6:$B$46=Dados!$H$37,ROW(Empresas!$B$6:$B$46)-5),ROW($A8)),COLUMN(AF$1)),\"\")","v":""},{"$f":"IFERROR(INDEX(Empresas!$B$6:$AS$46,SMALL(IF(Empresas!$B$6:$B$46=Dados!$H$37,ROW(Empresas!$B$6:$B$46)-5),ROW($A8)),COLUMN(AG$1)),\"\")","v":""},{"$f":"IFERROR(INDEX(Empresas!$B$6:$AS$46,SMALL(IF(Empresas!$B$6:$B$46=Dados!$H$37,ROW(Empresas!$B$6:$B$46)-5),ROW($A8)),COLUMN(AH$1)),\"\")","v":""},{"$f":"IFERROR(INDEX(Empresas!$B$6:$AS$46,SMALL(IF(Empresas!$B$6:$B$46=Dados!$H$37,ROW(Empresas!$B$6:$B$46)-5),ROW($A8)),COLUMN(AI$1)),\"\")","v":""},{"$f":"IFERROR(INDEX(Empresas!$B$6:$AS$46,SMALL(IF(Empresas!$B$6:$B$46=Dados!$H$37,ROW(Empresas!$B$6:$B$46)-5),ROW($A8)),COLUMN(AJ$1)),\"\")","v":""},{"$f":"IFERROR(INDEX(Empresas!$B$6:$AS$46,SMALL(IF(Empresas!$B$6:$B$46=Dados!$H$37,ROW(Empresas!$B$6:$B$46)-5),ROW($A8)),COLUMN(AK$1)),\"\")","v":""},{"$f":"IFERROR(INDEX(Empresas!$B$6:$AS$46,SMALL(IF(Empresas!$B$6:$B$46=Dados!$H$37,ROW(Empresas!$B$6:$B$46)-5),ROW($A8)),COLUMN(AL$1)),\"\")","v":""},{"$f":"IFERROR(INDEX(Empresas!$B$6:$AS$46,SMALL(IF(Empresas!$B$6:$B$46=Dados!$H$37,ROW(Empresas!$B$6:$B$46)-5),ROW($A8)),COLUMN(AM$1)),\"\")","v":""},{"$f":"IFERROR(INDEX(Empresas!$B$6:$AS$46,SMALL(IF(Empresas!$B$6:$B$46=Dados!$H$37,ROW(Empresas!$B$6:$B$46)-5),ROW($A8)),COLUMN(AN$1)),\"\")","v":""},{"$f":"IFERROR(INDEX(Empresas!$B$6:$AS$46,SMALL(IF(Empresas!$B$6:$B$46=Dados!$H$37,ROW(Empresas!$B$6:$B$46)-5),ROW($A8)),COLUMN(AO$1)),\"\")","v":""},{"$f":"IFERROR(INDEX(Empresas!$B$6:$AS$46,SMALL(IF(Empresas!$B$6:$B$46=Dados!$H$37,ROW(Empresas!$B$6:$B$46)-5),ROW($A8)),COLUMN(AP$1)),\"\")","v":""},{"$f":"IFERROR(INDEX(Empresas!$B$6:$AS$46,SMALL(IF(Empresas!$B$6:$B$46=Dados!$H$37,ROW(Empresas!$B$6:$B$46)-5),ROW($A8)),COLUMN(AQ$1)),\"\")","v":""},{"$f":"IFERROR(INDEX(Empresas!$B$6:$AS$46,SMALL(IF(Empresas!$B$6:$B$46=Dados!$H$37,ROW(Empresas!$B$6:$B$46)-5),ROW($A8)),COLUMN(AR$1)),\"\")","v":""}]
[null,{"$f":"IFERROR(INDEX(Empresas!$B$6:$AS$46,SMALL(IF(Empresas!$B$6:$B$46=Dados!$H$37,ROW(Empresas!$B$6:$B$46)-5),ROW($A9)),COLUMN(B$1)),\"\")","v":""},{"$f":"IFERROR(INDEX(Empresas!$B$6:$AS$46,SMALL(IF(Empresas!$B$6:$B$46=Dados!$H$37,ROW(Empresas!$B$6:$B$46)-5),ROW($A9)),COLUMN(C$1)),\"\")","v":""},"",{"$f":"IFERROR(INDEX(Empresas!$B$6:$AS$46,SMALL(IF(Empresas!$B$6:$B$46=Dados!$H$37,ROW(Empresas!$B$6:$B$46)-5),ROW($A9)),COLUMN(F$1)),\"\")","v":""},{"$f":"IFERROR(INDEX(Empresas!$B$6:$AS$46,SMALL(IF(Empresas!$B$6:$B$46=Dados!$H$37,ROW(Empresas!$B$6:$B$46)-5),ROW($A9)),COLUMN(G$1)),\"\")","v":""},{"$f":"IFERROR(INDEX(Empresas!$B$6:$AS$46,SMALL(IF(Empresas!$B$6:$B$46=Dados!$H$37,ROW(Empresas!$B$6:$B$46)-5),ROW($A9)),COLUMN(H$1)),\"\")","v":""},{"$f":"IFERROR(INDEX(Empresas!$B$6:$AS$46,SMALL(IF(Empresas!$B$6:$B$46=Dados!$H$37,ROW(Empresas!$B$6:$B$46)-5),ROW($A9)),COLUMN(I$1)),\"\")","v":""},{"$f":"IFERROR(INDEX(Empresas!$B$6:$AS$46,SMALL(IF(Empresas!$B$6:$B$46=Dados!$H$37,ROW(Empresas!$B$6:$B$46)-5),ROW($A9)),COLUMN(J$1)),\"\")","v":""},{"$f":"IFERROR(INDEX(Empresas!$B$6:$AS$46,SMALL(IF(Empresas!$B$6:$B$46=Dados!$H$37,ROW(Empresas!$B$6:$B$46)-5),ROW($A9)),COLUMN(K$1)),\"\")","v":""},{"$f":"IFERROR(INDEX(Empresas!$B$6:$AS$46,SMALL(IF(Empresas!$B$6:$B$46=Dados!$H$37,ROW(Empresas!$B$6:$B$46)-5),ROW($A9)),COLUMN(L$1)),\"\")","v":""},{"$f":"IFERROR(INDEX(Empresas!$B$6:$AS$46,SMALL(IF(Empresas!$B$6:$B$46=Dados!$H$37,ROW(Empresas!$B$6:$B$46)-5),ROW($A9)),COLUMN(M$1)),\"\")","v":""},{"$f":"IFERROR(INDEX(Empresas!$B$6:$AS$46,SMALL(IF(Empresas!$B$6:$B$46=Dados!$H$37,ROW(Empresas!$B$6:$B$46)-5),ROW($A9)),COLUMN(N$1)),\"\")","v":""},{"$f":"IFERROR(INDEX(Empresas!$B$6:$AS$46,SMALL(IF(Empresas!$B$6:$B$46=Dados!$H$37,ROW(Empresas!$B$6:$B$46)-5),ROW($A9)),COLUMN(O$1)),\"\")","v":""},{"$f":"IFERROR(INDEX(Empresas!$B$6:$AS$46,SMALL(IF(Empresas!$B$6:$B$46=Dados!$H$37,ROW(Empresas!$B$6:$B$46)-5),ROW($A9)),COLUMN(P$1)),\"\")","v":""},{"$f":"IFERROR(INDEX(Empresas!$B$6:$AS$46,SMALL(IF(Empresas!$B$6:$B$46=Dados!$H$37,ROW(Empresas!$B$6:$B$46)-5),ROW($A9)),COLUMN(Q$1)),\"\")","v":""},{"$f":"IFERROR(INDEX(Empresas!$B$6:$AS$46,SMALL(IF(Empresas!$B$6:$B$46=Dados!$H$37,ROW(Empresas!$B$6:$B$46)-5),ROW($A9)),COLUMN(R$1)),\"\")","v":""},{"$f":"IFERROR(INDEX(Empresas!$B$6:$AS$46,SMALL(IF(Empresas!$B$6:$B$46=Dados!$H$37,ROW(Empresas!$B$6:$B$46)-5),ROW($A9)),COLUMN(S$1)),\"\")","v":""},{"$f":"IFERROR(INDEX(Empresas!$B$6:$AS$46,SMALL(IF(Empresas!$B$6:$B$46=Dados!$H$37,ROW(Empresas!$B$6:$B$46)-5),ROW($A9)),COLUMN(T$1)),\"\")","v":""},{"$f":"IFERROR(INDEX(Empresas!$B$6:$AS$46,SMALL(IF(Empresas!$B$6:$B$46=Dados!$H$37,ROW(Empresas!$B$6:$B$46)-5),ROW($A9)),COLUMN(U$1)),\"\")","v":""},{"$f":"IFERROR(INDEX(Empresas!$B$6:$AS$46,SMALL(IF(Empresas!$B$6:$B$46=Dados!$H$37,ROW(Empresas!$B$6:$B$46)-5),ROW($A9)),COLUMN(V$1)),\"\")","v":""},{"$f":"IFERROR(INDEX(Empresas!$B$6:$AS$46,SMALL(IF(Empresas!$B$6:$B$46=Dados!$H$37,ROW(Empresas!$B$6:$B$46)-5),ROW($A9)),COLUMN(W$1)),\"\")","v":""},{"$f":"IFERROR(INDEX(Empresas!$B$6:$AS$46,SMALL(IF(Empresas!$B$6:$B$46=Dados!$H$37,ROW(Empresas!$B$6:$B$46)-5),ROW($A9)),COLUMN(X$1)),\"\")","v":""},{"$f":"IFERROR(INDEX(Empresas!$B$6:$AS$46,SMALL(IF(Empresas!$B$6:$B$46=Dados!$H$37,ROW(Empresas!$B$6:$B$46)-5),ROW($A9)),COLUMN(Y$1)),\"\")","v":""},{"$f":"IFERROR(INDEX(Empresas!$B$6:$AS$46,SMALL(IF(Empresas!$B$6:$B$46=Dados!$H$37,ROW(Empresas!$B$6:$B$46)-5),ROW($A9)),COLUMN(Z$1)),\"\")","v":""},{"$f":"IFERROR(INDEX(Empresas!$B$6:$AS$46,SMALL(IF(Empresas!$B$6:$B$46=Dados!$H$37,ROW(Empresas!$B$6:$B$46)-5),ROW($A9)),COLUMN(AA$1)),\"\")","v":""},{"$f":"IFERROR(INDEX(Empresas!$B$6:$AS$46,SMALL(IF(Empresas!$B$6:$B$46=Dados!$H$37,ROW(Empresas!$B$6:$B$46)-5),ROW($A9)),COLUMN(AB$1)),\"\")","v":""},{"$f":"IFERROR(INDEX(Empresas!$B$6:$AS$46,SMALL(IF(Empresas!$B$6:$B$46=Dados!$H$37,ROW(Empresas!$B$6:$B$46)-5),ROW($A9)),COLUMN(AC$1)),\"\")","v":""},{"$f":"IFERROR(INDEX(Empresas!$B$6:$AS$46,SMALL(IF(Empresas!$B$6:$B$46=Dados!$H$37,ROW(Empresas!$B$6:$B$46)-5),ROW($A9)),COLUMN(AD$1)),\"\")","v":""},{"$f":"IFERROR(INDEX(Empresas!$B$6:$AS$46,SMALL(IF(Empresas!$B$6:$B$46=Dados!$H$37,ROW(Empresas!$B$6:$B$46)-5),ROW($A9)),COLUMN(AE$1)),\"\")","v":""},{"$f":"IFERROR(INDEX(Empresas!$B$6:$AS$46,SMALL(IF(Empresas!$B$6:$B$46=Dados!$H$37,ROW(Empresas!$B$6:$B$46)-5),ROW($A9)),COLUMN(AF$1)),\"\")","v":""},{"$f":"IFERROR(INDEX(Empresas!$B$6:$AS$46,SMALL(IF(Empresas!$B$6:$B$46=Dados!$H$37,ROW(Empresas!$B$6:$B$46)-5),ROW($A9)),COLUMN(AG$1)),\"\")","v":""},{"$f":"IFERROR(INDEX(Empresas!$B$6:$AS$46,SMALL(IF(Empresas!$B$6:$B$46=Dados!$H$37,ROW(Empresas!$B$6:$B$46)-5),ROW($A9)),COLUMN(AH$1)),\"\")","v":""},{"$f":"IFERROR(INDEX(Empresas!$B$6:$AS$46,SMALL(IF(Empresas!$B$6:$B$46=Dados!$H$37,ROW(Empresas!$B$6:$B$46)-5),ROW($A9)),COLUMN(AI$1)),\"\")","v":""},{"$f":"IFERROR(INDEX(Empresas!$B$6:$AS$46,SMALL(IF(Empresas!$B$6:$B$46=Dados!$H$37,ROW(Empresas!$B$6:$B$46)-5),ROW($A9)),COLUMN(AJ$1)),\"\")","v":""},{"$f":"IFERROR(INDEX(Empresas!$B$6:$AS$46,SMALL(IF(Empresas!$B$6:$B$46=Dados!$H$37,ROW(Empresas!$B$6:$B$46)-5),ROW($A9)),COLUMN(AK$1)),\"\")","v":""},{"$f":"IFERROR(INDEX(Empresas!$B$6:$AS$46,SMALL(IF(Empresas!$B$6:$B$46=Dados!$H$37,ROW(Empresas!$B$6:$B$46)-5),ROW($A9)),COLUMN(AL$1)),\"\")","v":""},{"$f":"IFERROR(INDEX(Empresas!$B$6:$AS$46,SMALL(IF(Empresas!$B$6:$B$46=Dados!$H$37,ROW(Empresas!$B$6:$B$46)-5),ROW($A9)),COLUMN(AM$1)),\"\")","v":""},{"$f":"IFERROR(INDEX(Empresas!$B$6:$AS$46,SMALL(IF(Empresas!$B$6:$B$46=Dados!$H$37,ROW(Empresas!$B$6:$B$46)-5),ROW($A9)),COLUMN(AN$1)),\"\")","v":""},{"$f":"IFERROR(INDEX(Empresas!$B$6:$AS$46,SMALL(IF(Empresas!$B$6:$B$46=Dados!$H$37,ROW(Empresas!$B$6:$B$46)-5),ROW($A9)),COLUMN(AO$1)),\"\")","v":""},{"$f":"IFERROR(INDEX(Empresas!$B$6:$AS$46,SMALL(IF(Empresas!$B$6:$B$46=Dados!$H$37,ROW(Empresas!$B$6:$B$46)-5),ROW($A9)),COLUMN(AP$1)),\"\")","v":""},{"$f":"IFERROR(INDEX(Empresas!$B$6:$AS$46,SMALL(IF(Empresas!$B$6:$B$46=Dados!$H$37,ROW(Empresas!$B$6:$B$46)-5),ROW($A9)),COLUMN(AQ$1)),\"\")","v":""},{"$f":"IFERROR(INDEX(Empresas!$B$6:$AS$46,SMALL(IF(Empresas!$B$6:$B$46=Dados!$H$37,ROW(Empresas!$B$6:$B$46)-5),ROW($A9)),COLUMN(AR$1)),\"\")","v":""}]
[null,{"$f":"IFERROR(INDEX(Empresas!$B$6:$AS$46,SMALL(IF(Empresas!$B$6:$B$46=Dados!$H$37,ROW(Empresas!$B$6:$B$46)-5),ROW($A10)),COLUMN(B$1)),\"\")","v":""},{"$f":"IFERROR(INDEX(Empresas!$B$6:$AS$46,SMALL(IF(Empresas!$B$6:$B$46=Dados!$H$37,ROW(Empresas!$B$6:$B$46)-5),ROW($A10)),COLUMN(C$1)),\"\")","v":""},"",{"$f":"IFERROR(INDEX(Empresas!$B$6:$AS$46,SMALL(IF(Empresas!$B$6:$B$46=Dados!$H$37,ROW(Empresas!$B$6:$B$46)-5),ROW($A10)),COLUMN(F$1)),\"\")","v":""},{"$f":"IFERROR(INDEX(Empresas!$B$6:$AS$46,SMALL(IF(Empresas!$B$6:$B$46=Dados!$H$37,ROW(Empresas!$B$6:$B$46)-5),ROW($A10)),COLUMN(G$1)),\"\")","v":""},{"$f":"IFERROR(INDEX(Empresas!$B$6:$AS$46,SMALL(IF(Empresas!$B$6:$B$46=Dados!$H$37,ROW(Empresas!$B$6:$B$46)-5),ROW($A10)),COLUMN(H$1)),\"\")","v":""},{"$f":"IFERROR(INDEX(Empresas!$B$6:$AS$46,SMALL(IF(Empresas!$B$6:$B$46=Dados!$H$37,ROW(Empresas!$B$6:$B$46)-5),ROW($A10)),COLUMN(I$1)),\"\")","v":""},{"$f":"IFERROR(INDEX(Empresas!$B$6:$AS$46,SMALL(IF(Empresas!$B$6:$B$46=Dados!$H$37,ROW(Empresas!$B$6:$B$46)-5),ROW($A10)),COLUMN(J$1)),\"\")","v":""},{"$f":"IFERROR(INDEX(Empresas!$B$6:$AS$46,SMALL(IF(Empresas!$B$6:$B$46=Dados!$H$37,ROW(Empresas!$B$6:$B$46)-5),ROW($A10)),COLUMN(K$1)),\"\")","v":""},{"$f":"IFERROR(INDEX(Empresas!$B$6:$AS$46,SMALL(IF(Empresas!$B$6:$B$46=Dados!$H$37,ROW(Empresas!$B$6:$B$46)-5),ROW($A10)),COLUMN(L$1)),\"\")","v":""},{"$f":"IFERROR(INDEX(Empresas!$B$6:$AS$46,SMALL(IF(Empresas!$B$6:$B$46=Dados!$H$37,ROW(Empresas!$B$6:$B$46)-5),ROW($A10)),COLUMN(M$1)),\"\")","v":""},{"$f":"IFERROR(INDEX(Empresas!$B$6:$AS$46,SMALL(IF(Empresas!$B$6:$B$46=Dados!$H$37,ROW(Empresas!$B$6:$B$46)-5),ROW($A10)),COLUMN(N$1)),\"\")","v":""},{"$f":"IFERROR(INDEX(Empresas!$B$6:$AS$46,SMALL(IF(Empresas!$B$6:$B$46=Dados!$H$37,ROW(Empresas!$B$6:$B$46)-5),ROW($A10)),COLUMN(O$1)),\"\")","v":""},{"$f":"IFERROR(INDEX(Empresas!$B$6:$AS$46,SMALL(IF(Empresas!$B$6:$B$46=Dados!$H$37,ROW(Empresas!$B$6:$B$46)-5),ROW($A10)),COLUMN(P$1)),\"\")","v":""},{"$f":"IFERROR(INDEX(Empresas!$B$6:$AS$46,SMALL(IF(Empresas!$B$6:$B$46=Dados!$H$37,ROW(Empresas!$B$6:$B$46)-5),ROW($A10)),COLUMN(Q$1)),\"\")","v":""},{"$f":"IFERROR(INDEX(Empresas!$B$6:$AS$46,SMALL(IF(Empresas!$B$6:$B$46=Dados!$H$37,ROW(Empresas!$B$6:$B$46)-5),ROW($A10)),COLUMN(R$1)),\"\")","v":""},{"$f":"IFERROR(INDEX(Empresas!$B$6:$AS$46,SMALL(IF(Empresas!$B$6:$B$46=Dados!$H$37,ROW(Empresas!$B$6:$B$46)-5),ROW($A10)),COLUMN(S$1)),\"\")","v":""},{"$f":"IFERROR(INDEX(Empresas!$B$6:$AS$46,SMALL(IF(Empresas!$B$6:$B$46=Dados!$H$37,ROW(Empresas!$B$6:$B$46)-5),ROW($A10)),COLUMN(T$1)),\"\")","v":""},{"$f":"IFERROR(INDEX(Empresas!$B$6:$AS$46,SMALL(IF(Empresas!$B$6:$B$46=Dados!$H$37,ROW(Empresas!$B$6:$B$46)-5),ROW($A10)),COLUMN(U$1)),\"\")","v":""},{"$f":"IFERROR(INDEX(Empresas!$B$6:$AS$46,SMALL(IF(Empresas!$B$6:$B$46=Dados!$H$37,ROW(Empresas!$B$6:$B$46)-5),ROW($A10)),COLUMN(V$1)),\"\")","v":""},{"$f":"IFERROR(INDEX(Empresas!$B$6:$AS$46,SMALL(IF(Empresas!$B$6:$B$46=Dados!$H$37,ROW(Empresas!$B$6:$B$46)-5),ROW($A10)),COLUMN(W$1)),\"\")","v":""},{"$f":"IFERROR(INDEX(Empresas!$B$6:$AS$46,SMALL(IF(Empresas!$B$6:$B$46=Dados!$H$37,ROW(Empresas!$B$6:$B$46)-5),ROW($A10)),COLUMN(X$1)),\"\")","v":""},{"$f":"IFERROR(INDEX(Empresas!$B$6:$AS$46,SMALL(IF(Empresas!$B$6:$B$46=Dados!$H$37,ROW(Empresas!$B$6:$B$46)-5),ROW($A10)),COLUMN(Y$1)),\"\")","v":""},{"$f":"IFERROR(INDEX(Empresas!$B$6:$AS$46,SMALL(IF(Empresas!$B$6:$B$46=Dados!$H$37,ROW(Empresas!$B$6:$B$46)-5),ROW($A10)),COLUMN(Z$1)),\"\")","v":""},{"$f":"IFERROR(INDEX(Empresas!$B$6:$AS$46,SMALL(IF(Empresas!$B$6:$B$46=Dados!$H$37,ROW(Empresas!$B$6:$B$46)-5),ROW($A10)),COLUMN(AA$1)),\"\")","v":""},{"$f":"IFERROR(INDEX(Empresas!$B$6:$AS$46,SMALL(IF(Empresas!$B$6:$B$46=Dados!$H$37,ROW(Empresas!$B$6:$B$46)-5),ROW($A10)),COLUMN(AB$1)),\"\")","v":""},{"$f":"IFERROR(INDEX(Empresas!$B$6:$AS$46,SMALL(IF(Empresas!$B$6:$B$46=Dados!$H$37,ROW(Empresas!$B$6:$B$46)-5),ROW($A10)),COLUMN(AC$1)),\"\")","v":""},{"$f":"IFERROR(INDEX(Empresas!$B$6:$AS$46,SMALL(IF(Empresas!$B$6:$B$46=Dados!$H$37,ROW(Empresas!$B$6:$B$46)-5),ROW($A10)),COLUMN(AD$1)),\"\")","v":""},{"$f":"IFERROR(INDEX(Empresas!$B$6:$AS$46,SMALL(IF(Empresas!$B$6:$B$46=Dados!$H$37,ROW(Empresas!$B$6:$B$46)-5),ROW($A10)),COLUMN(AE$1)),\"\")","v":""},{"$f":"IFERROR(INDEX(Empresas!$B$6:$AS$46,SMALL(IF(Empresas!$B$6:$B$46=Dados!$H$37,ROW(Empresas!$B$6:$B$46)-5),ROW($A10)),COLUMN(AF$1)),\"\")","v":""},{"$f":"IFERROR(INDEX(Empresas!$B$6:$AS$46,SMALL(IF(Empresas!$B$6:$B$46=Dados!$H$37,ROW(Empresas!$B$6:$B$46)-5),ROW($A10)),COLUMN(AG$1)),\"\")","v":""},{"$f":"IFERROR(INDEX(Empresas!$B$6:$AS$46,SMALL(IF(Empresas!$B$6:$B$46=Dados!$H$37,ROW(Empresas!$B$6:$B$46)-5),ROW($A10)),COLUMN(AH$1)),\"\")","v":""},{"$f":"IFERROR(INDEX(Empresas!$B$6:$AS$46,SMALL(IF(Empresas!$B$6:$B$46=Dados!$H$37,ROW(Empresas!$B$6:$B$46)-5),ROW($A10)),COLUMN(AI$1)),\"\")","v":""},{"$f":"IFERROR(INDEX(Empresas!$B$6:$AS$46,SMALL(IF(Empresas!$B$6:$B$46=Dados!$H$37,ROW(Empresas!$B$6:$B$46)-5),ROW($A10)),COLUMN(AJ$1)),\"\")","v":""},{"$f":"IFERROR(INDEX(Empresas!$B$6:$AS$46,SMALL(IF(Empresas!$B$6:$B$46=Dados!$H$37,ROW(Empresas!$B$6:$B$46)-5),ROW($A10)),COLUMN(AK$1)),\"\")","v":""},{"$f":"IFERROR(INDEX(Empresas!$B$6:$AS$46,SMALL(IF(Empresas!$B$6:$B$46=Dados!$H$37,ROW(Empresas!$B$6:$B$46)-5),ROW($A10)),COLUMN(AL$1)),\"\")","v":""},{"$f":"IFERROR(INDEX(Empresas!$B$6:$AS$46,SMALL(IF(Empresas!$B$6:$B$46=Dados!$H$37,ROW(Empresas!$B$6:$B$46)-5),ROW($A10)),COLUMN(AM$1)),\"\")","v":""},{"$f":"IFERROR(INDEX(Empresas!$B$6:$AS$46,SMALL(IF(Empresas!$B$6:$B$46=Dados!$H$37,ROW(Empresas!$B$6:$B$46)-5),ROW($A10)),COLUMN(AN$1)),\"\")","v":""},{"$f":"IFERROR(INDEX(Empresas!$B$6:$AS$46,SMALL(IF(Empresas!$B$6:$B$46=Dados!$H$37,ROW(Empresas!$B$6:$B$46)-5),ROW($A10)),COLUMN(AO$1)),\"\")","v":""},{"$f":"IFERROR(INDEX(Empresas!$B$6:$AS$46,SMALL(IF(Empresas!$B$6:$B$46=Dados!$H$37,ROW(Empresas!$B$6:$B$46)-5),ROW($A10)),COLUMN(AP$1)),\"\")","v":""},{"$f":"IFERROR(INDEX(Empresas!$B$6:$AS$46,SMALL(IF(Empresas!$B$6:$B$46=Dados!$H$37,ROW(Empresas!$B$6:$B$46)-5),ROW($A10)),COLUMN(AQ$1)),\"\")","v":""},{"$f":"IFERROR(INDEX(Empresas!$B$6:$AS$46,SMALL(IF(Empresas!$B$6:$B$46=Dados!$H$37,ROW(Empresas!$B$6:$B$46)-5),ROW($A10)),COLUMN(AR$1)),\"\")","v":""}]
[null,{"$f":"IFERROR(INDEX(Empresas!$B$6:$AS$46,SMALL(IF(Empresas!$B$6:$B$46=Dados!$H$37,ROW(Empresas!$B$6:$B$46)-5),ROW($A11)),COLUMN(B$1)),\"\")","v":""},{"$f":"IFERROR(INDEX(Empresas!$B$6:$AS$46,SMALL(IF(Empresas!$B$6:$B$46=Dados!$H$37,ROW(Empresas!$B$6:$B$46)-5),ROW($A11)),COLUMN(C$1)),\"\")","v":""},"",{"$f":"IFERROR(INDEX(Empresas!$B$6:$AS$46,SMALL(IF(Empresas!$B$6:$B$46=Dados!$H$37,ROW(Empresas!$B$6:$B$46)-5),ROW($A11)),COLUMN(F$1)),\"\")","v":""},{"$f":"IFERROR(INDEX(Empresas!$B$6:$AS$46,SMALL(IF(Empresas!$B$6:$B$46=Dados!$H$37,ROW(Empresas!$B$6:$B$46)-5),ROW($A11)),COLUMN(G$1)),\"\")","v":""},{"$f":"IFERROR(INDEX(Empresas!$B$6:$AS$46,SMALL(IF(Empresas!$B$6:$B$46=Dados!$H$37,ROW(Empresas!$B$6:$B$46)-5),ROW($A11)),COLUMN(H$1)),\"\")","v":""},{"$f":"IFERROR(INDEX(Empresas!$B$6:$AS$46,SMALL(IF(Empresas!$B$6:$B$46=Dados!$H$37,ROW(Empresas!$B$6:$B$46)-5),ROW($A11)),COLUMN(I$1)),\"\")","v":""},{"$f":"IFERROR(INDEX(Empresas!$B$6:$AS$46,SMALL(IF(Empresas!$B$6:$B$46=Dados!$H$37,ROW(Empresas!$B$6:$B$46)-5),ROW($A11)),COLUMN(J$1)),\"\")","v":""},{"$f":"IFERROR(INDEX(Empresas!$B$6:$AS$46,SMALL(IF(Empresas!$B$6:$B$46=Dados!$H$37,ROW(Empresas!$B$6:$B$46)-5),ROW($A11)),COLUMN(K$1)),\"\")","v":""},{"$f":"IFERROR(INDEX(Empresas!$B$6:$AS$46,SMALL(IF(Empresas!$B$6:$B$46=Dados!$H$37,ROW(Empresas!$B$6:$B$46)-5),ROW($A11)),COLUMN(L$1)),\"\")","v":""},{"$f":"IFERROR(INDEX(Empresas!$B$6:$AS$46,SMALL(IF(Empresas!$B$6:$B$46=Dados!$H$37,ROW(Empresas!$B$6:$B$46)-5),ROW($A11)),COLUMN(M$1)),\"\")","v":""},{"$f":"IFERROR(INDEX(Empresas!$B$6:$AS$46,SMALL(IF(Empresas!$B$6:$B$46=Dados!$H$37,ROW(Empresas!$B$6:$B$46)-5),ROW($A11)),COLUMN(N$1)),\"\")","v":""},{"$f":"IFERROR(INDEX(Empresas!$B$6:$AS$46,SMALL(IF(Empresas!$B$6:$B$46=Dados!$H$37,ROW(Empresas!$B$6:$B$46)-5),ROW($A11)),COLUMN(O$1)),\"\")","v":""},{"$f":"IFERROR(INDEX(Empresas!$B$6:$AS$46,SMALL(IF(Empresas!$B$6:$B$46=Dados!$H$37,ROW(Empresas!$B$6:$B$46)-5),ROW($A11)),COLUMN(P$1)),\"\")","v":""},{"$f":"IFERROR(INDEX(Empresas!$B$6:$AS$46,SMALL(IF(Empresas!$B$6:$B$46=Dados!$H$37,ROW(Empresas!$B$6:$B$46)-5),ROW($A11)),COLUMN(Q$1)),\"\")","v":""},{"$f":"IFERROR(INDEX(Empresas!$B$6:$AS$46,SMALL(IF(Empresas!$B$6:$B$46=Dados!$H$37,ROW(Empresas!$B$6:$B$46)-5),ROW($A11)),COLUMN(R$1)),\"\")","v":""},{"$f":"IFERROR(INDEX(Empresas!$B$6:$AS$46,SMALL(IF(Empresas!$B$6:$B$46=Dados!$H$37,ROW(Empresas!$B$6:$B$46)-5),ROW($A11)),COLUMN(S$1)),\"\")","v":""},{"$f":"IFERROR(INDEX(Empresas!$B$6:$AS$46,SMALL(IF(Empresas!$B$6:$B$46=Dados!$H$37,ROW(Empresas!$B$6:$B$46)-5),ROW($A11)),COLUMN(T$1)),\"\")","v":""},{"$f":"IFERROR(INDEX(Empresas!$B$6:$AS$46,SMALL(IF(Empresas!$B$6:$B$46=Dados!$H$37,ROW(Empresas!$B$6:$B$46)-5),ROW($A11)),COLUMN(U$1)),\"\")","v":""},{"$f":"IFERROR(INDEX(Empresas!$B$6:$AS$46,SMALL(IF(Empresas!$B$6:$B$46=Dados!$H$37,ROW(Empresas!$B$6:$B$46)-5),ROW($A11)),COLUMN(V$1)),\"\")","v":""},{"$f":"IFERROR(INDEX(Empresas!$B$6:$AS$46,SMALL(IF(Empresas!$B$6:$B$46=Dados!$H$37,ROW(Empresas!$B$6:$B$46)-5),ROW($A11)),COLUMN(W$1)),\"\")","v":""},{"$f":"IFERROR(INDEX(Empresas!$B$6:$AS$46,SMALL(IF(Empresas!$B$6:$B$46=Dados!$H$37,ROW(Empresas!$B$6:$B$46)-5),ROW($A11)),COLUMN(X$1)),\"\")","v":""},{"$f":"IFERROR(INDEX(Empresas!$B$6:$AS$46,SMALL(IF(Empresas!$B$6:$B$46=Dados!$H$37,ROW(Empresas!$B$6:$B$46)-5),ROW($A11)),COLUMN(Y$1)),\"\")","v":""},{"$f":"IFERROR(INDEX(Empresas!$B$6:$AS$46,SMALL(IF(Empresas!$B$6:$B$46=Dados!$H$37,ROW(Empresas!$B$6:$B$46)-5),ROW($A11)),COLUMN(Z$1)),\"\")","v":""},{"$f":"IFERROR(INDEX(Empresas!$B$6:$AS$46,SMALL(IF(Empresas!$B$6:$B$46=Dados!$H$37,ROW(Empresas!$B$6:$B$46)-5),ROW($A11)),COLUMN(AA$1)),\"\")","v":""},{"$f":"IFERROR(INDEX(Empresas!$B$6:$AS$46,SMALL(IF(Empresas!$B$6:$B$46=Dados!$H$37,ROW(Empresas!$B$6:$B$46)-5),ROW($A11)),COLUMN(AB$1)),\"\")","v":""},{"$f":"IFERROR(INDEX(Empresas!$B$6:$AS$46,SMALL(IF(Empresas!$B$6:$B$46=Dados!$H$37,ROW(Empresas!$B$6:$B$46)-5),ROW($A11)),COLUMN(AC$1)),\"\")","v":""},{"$f":"IFERROR(INDEX(Empresas!$B$6:$AS$46,SMALL(IF(Empresas!$B$6:$B$46=Dados!$H$37,ROW(Empresas!$B$6:$B$46)-5),ROW($A11)),COLUMN(AD$1)),\"\")","v":""},{"$f":"IFERROR(INDEX(Empresas!$B$6:$AS$46,SMALL(IF(Empresas!$B$6:$B$46=Dados!$H$37,ROW(Empresas!$B$6:$B$46)-5),ROW($A11)),COLUMN(AE$1)),\"\")","v":""},{"$f":"IFERROR(INDEX(Empresas!$B$6:$AS$46,SMALL(IF(Empresas!$B$6:$B$46=Dados!$H$37,ROW(Empresas!$B$6:$B$46)-5),ROW($A11)),COLUMN(AF$1)),\"\")","v":""},{"$f":"IFERROR(INDEX(Empresas!$B$6:$AS$46,SMALL(IF(Empresas!$B$6:$B$46=Dados!$H$37,ROW(Empresas!$B$6:$B$46)-5),ROW($A11)),COLUMN(AG$1)),\"\")","v":""},{"$f":"IFERROR(INDEX(Empresas!$B$6:$AS$46,SMALL(IF(Empresas!$B$6:$B$46=Dados!$H$37,ROW(Empresas!$B$6:$B$46)-5),ROW($A11)),COLUMN(AH$1)),\"\")","v":""},{"$f":"IFERROR(INDEX(Empresas!$B$6:$AS$46,SMALL(IF(Empresas!$B$6:$B$46=Dados!$H$37,ROW(Empresas!$B$6:$B$46)-5),ROW($A11)),COLUMN(AI$1)),\"\")","v":""},{"$f":"IFERROR(INDEX(Empresas!$B$6:$AS$46,SMALL(IF(Empresas!$B$6:$B$46=Dados!$H$37,ROW(Empresas!$B$6:$B$46)-5),ROW($A11)),COLUMN(AJ$1)),\"\")","v":""},{"$f":"IFERROR(INDEX(Empresas!$B$6:$AS$46,SMALL(IF(Empresas!$B$6:$B$46=Dados!$H$37,ROW(Empresas!$B$6:$B$46)-5),ROW($A11)),COLUMN(AK$1)),\"\")","v":""},{"$f":"IFERROR(INDEX(Empresas!$B$6:$AS$46,SMALL(IF(Empresas!$B$6:$B$46=Dados!$H$37,ROW(Empresas!$B$6:$B$46)-5),ROW($A11)),COLUMN(AL$1)),\"\")","v":""},{"$f":"IFERROR(INDEX(Empresas!$B$6:$AS$46,SMALL(IF(Empresas!$B$6:$B$46=Dados!$H$37,ROW(Empresas!$B$6:$B$46)-5),ROW($A11)),COLUMN(AM$1)),\"\")","v":""},{"$f":"IFERROR(INDEX(Empresas!$B$6:$AS$46,SMALL(IF(Empresas!$B$6:$B$46=Dados!$H$37,ROW(Empresas!$B$6:$B$46)-5),ROW($A11)),COLUMN(AN$1)),\"\")","v":""},{"$f":"IFERROR(INDEX(Empresas!$B$6:$AS$46,SMALL(IF(Empresas!$B$6:$B$46=Dados!$H$37,ROW(Empresas!$B$6:$B$46)-5),ROW($A11)),COLUMN(AO$1)),\"\")","v":""},{"$f":"IFERROR(INDEX(Empresas!$B$6:$AS$46,SMALL(IF(Empresas!$B$6:$B$46=Dados!$H$37,ROW(Empresas!$B$6:$B$46)-5),ROW($A11)),COLUMN(AP$1)),\"\")","v":""},{"$f":"IFERROR(INDEX(Empresas!$B$6:$AS$46,SMALL(IF(Empresas!$B$6:$B$46=Dados!$H$37,ROW(Empresas!$B$6:$B$46)-5),ROW($A11)),COLUMN(AQ$1)),\"\")","v":""},{"$f":"IFERROR(INDEX(Empresas!$B$6:$AS$46,SMALL(IF(Empresas!$B$6:$B$46=Dados!$H$37,ROW(Empresas!$B$6:$B$46)-5),ROW($A11)),COLUMN(AR$1)),\"\")","v":""}]
[null,{"$f":"IFERROR(INDEX(Empresas!$B$6:$AS$46,SMALL(IF(Empresas!$B$6:$B$46=Dados!$H$37,ROW(Empresas!$B$6:$B$46)-5),ROW($A12)),COLUMN(B$1)),\"\")","v":""},{"$f":"IFERROR(INDEX(Empresas!$B$6:$AS$46,SMALL(IF(Empresas!$B$6:$B$46=Dados!$H$37,ROW(Empresas!$B$6:$B$46)-5),ROW($A12)),COLUMN(C$1)),\"\")","v":""},"",{"$f":"IFERROR(INDEX(Empresas!$B$6:$AS$46,SMALL(IF(Empresas!$B$6:$B$46=Dados!$H$37,ROW(Empresas!$B$6:$B$46)-5),ROW($A12)),COLUMN(F$1)),\"\")","v":""},{"$f":"IFERROR(INDEX(Empresas!$B$6:$AS$46,SMALL(IF(Empresas!$B$6:$B$46=Dados!$H$37,ROW(Empresas!$B$6:$B$46)-5),ROW($A12)),COLUMN(G$1)),\"\")","v":""},{"$f":"IFERROR(INDEX(Empresas!$B$6:$AS$46,SMALL(IF(Empresas!$B$6:$B$46=Dados!$H$37,ROW(Empresas!$B$6:$B$46)-5),ROW($A12)),COLUMN(H$1)),\"\")","v":""},{"$f":"IFERROR(INDEX(Empresas!$B$6:$AS$46,SMALL(IF(Empresas!$B$6:$B$46=Dados!$H$37,ROW(Empresas!$B$6:$B$46)-5),ROW($A12)),COLUMN(I$1)),\"\")","v":""},{"$f":"IFERROR(INDEX(Empresas!$B$6:$AS$46,SMALL(IF(Empresas!$B$6:$B$46=Dados!$H$37,ROW(Empresas!$B$6:$B$46)-5),ROW($A12)),COLUMN(J$1)),\"\")","v":""},{"$f":"IFERROR(INDEX(Empresas!$B$6:$AS$46,SMALL(IF(Empresas!$B$6:$B$46=Dados!$H$37,ROW(Empresas!$B$6:$B$46)-5),ROW($A12)),COLUMN(K$1)),\"\")","v":""},{"$f":"IFERROR(INDEX(Empresas!$B$6:$AS$46,SMALL(IF(Empresas!$B$6:$B$46=Dados!$H$37,ROW(Empresas!$B$6:$B$46)-5),ROW($A12)),COLUMN(L$1)),\"\")","v":""},{"$f":"IFERROR(INDEX(Empresas!$B$6:$AS$46,SMALL(IF(Empresas!$B$6:$B$46=Dados!$H$37,ROW(Empresas!$B$6:$B$46)-5),ROW($A12)),COLUMN(M$1)),\"\")","v":""},{"$f":"IFERROR(INDEX(Empresas!$B$6:$AS$46,SMALL(IF(Empresas!$B$6:$B$46=Dados!$H$37,ROW(Empresas!$B$6:$B$46)-5),ROW($A12)),COLUMN(N$1)),\"\")","v":""},{"$f":"IFERROR(INDEX(Empresas!$B$6:$AS$46,SMALL(IF(Empresas!$B$6:$B$46=Dados!$H$37,ROW(Empresas!$B$6:$B$46)-5),ROW($A12)),COLUMN(O$1)),\"\")","v":""},{"$f":"IFERROR(INDEX(Empresas!$B$6:$AS$46,SMALL(IF(Empresas!$B$6:$B$46=Dados!$H$37,ROW(Empresas!$B$6:$B$46)-5),ROW($A12)),COLUMN(P$1)),\"\")","v":""},{"$f":"IFERROR(INDEX(Empresas!$B$6:$AS$46,SMALL(IF(Empresas!$B$6:$B$46=Dados!$H$37,ROW(Empresas!$B$6:$B$46)-5),ROW($A12)),COLUMN(Q$1)),\"\")","v":""},{"$f":"IFERROR(INDEX(Empresas!$B$6:$AS$46,SMALL(IF(Empresas!$B$6:$B$46=Dados!$H$37,ROW(Empresas!$B$6:$B$46)-5),ROW($A12)),COLUMN(R$1)),\"\")","v":""},{"$f":"IFERROR(INDEX(Empresas!$B$6:$AS$46,SMALL(IF(Empresas!$B$6:$B$46=Dados!$H$37,ROW(Empresas!$B$6:$B$46)-5),ROW($A12)),COLUMN(S$1)),\"\")","v":""},{"$f":"IFERROR(INDEX(Empresas!$B$6:$AS$46,SMALL(IF(Empresas!$B$6:$B$46=Dados!$H$37,ROW(Empresas!$B$6:$B$46)-5),ROW($A12)),COLUMN(T$1)),\"\")","v":""},{"$f":"IFERROR(INDEX(Empresas!$B$6:$AS$46,SMALL(IF(Empresas!$B$6:$B$46=Dados!$H$37,ROW(Empresas!$B$6:$B$46)-5),ROW($A12)),COLUMN(U$1)),\"\")","v":""},{"$f":"IFERROR(INDEX(Empresas!$B$6:$AS$46,SMALL(IF(Empresas!$B$6:$B$46=Dados!$H$37,ROW(Empresas!$B$6:$B$46)-5),ROW($A12)),COLUMN(V$1)),\"\")","v":""},{"$f":"IFERROR(INDEX(Empresas!$B$6:$AS$46,SMALL(IF(Empresas!$B$6:$B$46=Dados!$H$37,ROW(Empresas!$B$6:$B$46)-5),ROW($A12)),COLUMN(W$1)),\"\")","v":""},{"$f":"IFERROR(INDEX(Empresas!$B$6:$AS$46,SMALL(IF(Empresas!$B$6:$B$46=Dados!$H$37,ROW(Empresas!$B$6:$B$46)-5),ROW($A12)),COLUMN(X$1)),\"\")","v":""},{"$f":"IFERROR(INDEX(Empresas!$B$6:$AS$46,SMALL(IF(Empresas!$B$6:$B$46=Dados!$H$37,ROW(Empresas!$B$6:$B$46)-5),ROW($A12)),COLUMN(Y$1)),\"\")","v":""},{"$f":"IFERROR(INDEX(Empresas!$B$6:$AS$46,SMALL(IF(Empresas!$B$6:$B$46=Dados!$H$37,ROW(Empresas!$B$6:$B$46)-5),ROW($A12)),COLUMN(Z$1)),\"\")","v":""},{"$f":"IFERROR(INDEX(Empresas!$B$6:$AS$46,SMALL(IF(Empresas!$B$6:$B$46=Dados!$H$37,ROW(Empresas!$B$6:$B$46)-5),ROW($A12)),COLUMN(AA$1)),\"\")","v":""},{"$f":"IFERROR(INDEX(Empresas!$B$6:$AS$46,SMALL(IF(Empresas!$B$6:$B$46=Dados!$H$37,ROW(Empresas!$B$6:$B$46)-5),ROW($A12)),COLUMN(AB$1)),\"\")","v":""},{"$f":"IFERROR(INDEX(Empresas!$B$6:$AS$46,SMALL(IF(Empresas!$B$6:$B$46=Dados!$H$37,ROW(Empresas!$B$6:$B$46)-5),ROW($A12)),COLUMN(AC$1)),\"\")","v":""},{"$f":"IFERROR(INDEX(Empresas!$B$6:$AS$46,SMALL(IF(Empresas!$B$6:$B$46=Dados!$H$37,ROW(Empresas!$B$6:$B$46)-5),ROW($A12)),COLUMN(AD$1)),\"\")","v":""},{"$f":"IFERROR(INDEX(Empresas!$B$6:$AS$46,SMALL(IF(Empresas!$B$6:$B$46=Dados!$H$37,ROW(Empresas!$B$6:$B$46)-5),ROW($A12)),COLUMN(AE$1)),\"\")","v":""},{"$f":"IFERROR(INDEX(Empresas!$B$6:$AS$46,SMALL(IF(Empresas!$B$6:$B$46=Dados!$H$37,ROW(Empresas!$B$6:$B$46)-5),ROW($A12)),COLUMN(AF$1)),\"\")","v":""},{"$f":"IFERROR(INDEX(Empresas!$B$6:$AS$46,SMALL(IF(Empresas!$B$6:$B$46=Dados!$H$37,ROW(Empresas!$B$6:$B$46)-5),ROW($A12)),COLUMN(AG$1)),\"\")","v":""},{"$f":"IFERROR(INDEX(Empresas!$B$6:$AS$46,SMALL(IF(Empresas!$B$6:$B$46=Dados!$H$37,ROW(Empresas!$B$6:$B$46)-5),ROW($A12)),COLUMN(AH$1)),\"\")","v":""},{"$f":"IFERROR(INDEX(Empresas!$B$6:$AS$46,SMALL(IF(Empresas!$B$6:$B$46=Dados!$H$37,ROW(Empresas!$B$6:$B$46)-5),ROW($A12)),COLUMN(AI$1)),\"\")","v":""},{"$f":"IFERROR(INDEX(Empresas!$B$6:$AS$46,SMALL(IF(Empresas!$B$6:$B$46=Dados!$H$37,ROW(Empresas!$B$6:$B$46)-5),ROW($A12)),COLUMN(AJ$1)),\"\")","v":""},{"$f":"IFERROR(INDEX(Empresas!$B$6:$AS$46,SMALL(IF(Empresas!$B$6:$B$46=Dados!$H$37,ROW(Empresas!$B$6:$B$46)-5),ROW($A12)),COLUMN(AK$1)),\"\")","v":""},{"$f":"IFERROR(INDEX(Empresas!$B$6:$AS$46,SMALL(IF(Empresas!$B$6:$B$46=Dados!$H$37,ROW(Empresas!$B$6:$B$46)-5),ROW($A12)),COLUMN(AL$1)),\"\")","v":""},{"$f":"IFERROR(INDEX(Empresas!$B$6:$AS$46,SMALL(IF(Empresas!$B$6:$B$46=Dados!$H$37,ROW(Empresas!$B$6:$B$46)-5),ROW($A12)),COLUMN(AM$1)),\"\")","v":""},{"$f":"IFERROR(INDEX(Empresas!$B$6:$AS$46,SMALL(IF(Empresas!$B$6:$B$46=Dados!$H$37,ROW(Empresas!$B$6:$B$46)-5),ROW($A12)),COLUMN(AN$1)),\"\")","v":""},{"$f":"IFERROR(INDEX(Empresas!$B$6:$AS$46,SMALL(IF(Empresas!$B$6:$B$46=Dados!$H$37,ROW(Empresas!$B$6:$B$46)-5),ROW($A12)),COLUMN(AO$1)),\"\")","v":""},{"$f":"IFERROR(INDEX(Empresas!$B$6:$AS$46,SMALL(IF(Empresas!$B$6:$B$46=Dados!$H$37,ROW(Empresas!$B$6:$B$46)-5),ROW($A12)),COLUMN(AP$1)),\"\")","v":""},{"$f":"IFERROR(INDEX(Empresas!$B$6:$AS$46,SMALL(IF(Empresas!$B$6:$B$46=Dados!$H$37,ROW(Empresas!$B$6:$B$46)-5),ROW($A12)),COLUMN(AQ$1)),\"\")","v":""},{"$f":"IFERROR(INDEX(Empresas!$B$6:$AS$46,SMALL(IF(Empresas!$B$6:$B$46=Dados!$H$37,ROW(Empresas!$B$6:$B$46)-5),ROW($A12)),COLUMN(AR$1)),\"\")","v":""}]
[null,{"$f":"IFERROR(INDEX(Empresas!$B$6:$AS$46,SMALL(IF(Empresas!$B$6:$B$46=Dados!$H$37,ROW(Empresas!$B$6:$B$46)-5),ROW($A13)),COLUMN(B$1)),\"\")","v":""},{"$f":"IFERROR(INDEX(Empresas!$B$6:$AS$46,SMALL(IF(Empresas!$B$6:$B$46=Dados!$H$37,ROW(Empresas!$B$6:$B$46)-5),ROW($A13)),COLUMN(C$1)),\"\")","v":""},"",{"$f":"IFERROR(INDEX(Empresas!$B$6:$AS$46,SMALL(IF(Empresas!$B$6:$B$46=Dados!$H$37,ROW(Empresas!$B$6:$B$46)-5),ROW($A13)),COLUMN(F$1)),\"\")","v":""},{"$f":"IFERROR(INDEX(Empresas!$B$6:$AS$46,SMALL(IF(Empresas!$B$6:$B$46=Dados!$H$37,ROW(Empresas!$B$6:$B$46)-5),ROW($A13)),COLUMN(G$1)),\"\")","v":""},{"$f":"IFERROR(INDEX(Empresas!$B$6:$AS$46,SMALL(IF(Empresas!$B$6:$B$46=Dados!$H$37,ROW(Empresas!$B$6:$B$46)-5),ROW($A13)),COLUMN(H$1)),\"\")","v":""},{"$f":"IFERROR(INDEX(Empresas!$B$6:$AS$46,SMALL(IF(Empresas!$B$6:$B$46=Dados!$H$37,ROW(Empresas!$B$6:$B$46)-5),ROW($A13)),COLUMN(I$1)),\"\")","v":""},{"$f":"IFERROR(INDEX(Empresas!$B$6:$AS$46,SMALL(IF(Empresas!$B$6:$B$46=Dados!$H$37,ROW(Empresas!$B$6:$B$46)-5),ROW($A13)),COLUMN(J$1)),\"\")","v":""},{"$f":"IFERROR(INDEX(Empresas!$B$6:$AS$46,SMALL(IF(Empresas!$B$6:$B$46=Dados!$H$37,ROW(Empresas!$B$6:$B$46)-5),ROW($A13)),COLUMN(K$1)),\"\")","v":""},{"$f":"IFERROR(INDEX(Empresas!$B$6:$AS$46,SMALL(IF(Empresas!$B$6:$B$46=Dados!$H$37,ROW(Empresas!$B$6:$B$46)-5),ROW($A13)),COLUMN(L$1)),\"\")","v":""},{"$f":"IFERROR(INDEX(Empresas!$B$6:$AS$46,SMALL(IF(Empresas!$B$6:$B$46=Dados!$H$37,ROW(Empresas!$B$6:$B$46)-5),ROW($A13)),COLUMN(M$1)),\"\")","v":""},{"$f":"IFERROR(INDEX(Empresas!$B$6:$AS$46,SMALL(IF(Empresas!$B$6:$B$46=Dados!$H$37,ROW(Empresas!$B$6:$B$46)-5),ROW($A13)),COLUMN(N$1)),\"\")","v":""},{"$f":"IFERROR(INDEX(Empresas!$B$6:$AS$46,SMALL(IF(Empresas!$B$6:$B$46=Dados!$H$37,ROW(Empresas!$B$6:$B$46)-5),ROW($A13)),COLUMN(O$1)),\"\")","v":""},{"$f":"IFERROR(INDEX(Empresas!$B$6:$AS$46,SMALL(IF(Empresas!$B$6:$B$46=Dados!$H$37,ROW(Empresas!$B$6:$B$46)-5),ROW($A13)),COLUMN(P$1)),\"\")","v":""},{"$f":"IFERROR(INDEX(Empresas!$B$6:$AS$46,SMALL(IF(Empresas!$B$6:$B$46=Dados!$H$37,ROW(Empresas!$B$6:$B$46)-5),ROW($A13)),COLUMN(Q$1)),\"\")","v":""},{"$f":"IFERROR(INDEX(Empresas!$B$6:$AS$46,SMALL(IF(Empresas!$B$6:$B$46=Dados!$H$37,ROW(Empresas!$B$6:$B$46)-5),ROW($A13)),COLUMN(R$1)),\"\")","v":""},{"$f":"IFERROR(INDEX(Empresas!$B$6:$AS$46,SMALL(IF(Empresas!$B$6:$B$46=Dados!$H$37,ROW(Empresas!$B$6:$B$46)-5),ROW($A13)),COLUMN(S$1)),\"\")","v":""},{"$f":"IFERROR(INDEX(Empresas!$B$6:$AS$46,SMALL(IF(Empresas!$B$6:$B$46=Dados!$H$37,ROW(Empresas!$B$6:$B$46)-5),ROW($A13)),COLUMN(T$1)),\"\")","v":""},{"$f":"IFERROR(INDEX(Empresas!$B$6:$AS$46,SMALL(IF(Empresas!$B$6:$B$46=Dados!$H$37,ROW(Empresas!$B$6:$B$46)-5),ROW($A13)),COLUMN(U$1)),\"\")","v":""},{"$f":"IFERROR(INDEX(Empresas!$B$6:$AS$46,SMALL(IF(Empresas!$B$6:$B$46=Dados!$H$37,ROW(Empresas!$B$6:$B$46)-5),ROW($A13)),COLUMN(V$1)),\"\")","v":""},{"$f":"IFERROR(INDEX(Empresas!$B$6:$AS$46,SMALL(IF(Empresas!$B$6:$B$46=Dados!$H$37,ROW(Empresas!$B$6:$B$46)-5),ROW($A13)),COLUMN(W$1)),\"\")","v":""},{"$f":"IFERROR(INDEX(Empresas!$B$6:$AS$46,SMALL(IF(Empresas!$B$6:$B$46=Dados!$H$37,ROW(Empresas!$B$6:$B$46)-5),ROW($A13)),COLUMN(X$1)),\"\")","v":""},{"$f":"IFERROR(INDEX(Empresas!$B$6:$AS$46,SMALL(IF(Empresas!$B$6:$B$46=Dados!$H$37,ROW(Empresas!$B$6:$B$46)-5),ROW($A13)),COLUMN(Y$1)),\"\")","v":""},{"$f":"IFERROR(INDEX(Empresas!$B$6:$AS$46,SMALL(IF(Empresas!$B$6:$B$46=Dados!$H$37,ROW(Empresas!$B$6:$B$46)-5),ROW($A13)),COLUMN(Z$1)),\"\")","v":""},{"$f":"IFERROR(INDEX(Empresas!$B$6:$AS$46,SMALL(IF(Empresas!$B$6:$B$46=Dados!$H$37,ROW(Empresas!$B$6:$B$46)-5),ROW($A13)),COLUMN(AA$1)),\"\")","v":""},{"$f":"IFERROR(INDEX(Empresas!$B$6:$AS$46,SMALL(IF(Empresas!$B$6:$B$46=Dados!$H$37,ROW(Empresas!$B$6:$B$46)-5),ROW($A13)),COLUMN(AB$1)),\"\")","v":""},{"$f":"IFERROR(INDEX(Empresas!$B$6:$AS$46,SMALL(IF(Empresas!$B$6:$B$46=Dados!$H$37,ROW(Empresas!$B$6:$B$46)-5),ROW($A13)),COLUMN(AC$1)),\"\")","v":""},{"$f":"IFERROR(INDEX(Empresas!$B$6:$AS$46,SMALL(IF(Empresas!$B$6:$B$46=Dados!$H$37,ROW(Empresas!$B$6:$B$46)-5),ROW($A13)),COLUMN(AD$1)),\"\")","v":""},{"$f":"IFERROR(INDEX(Empresas!$B$6:$AS$46,SMALL(IF(Empresas!$B$6:$B$46=Dados!$H$37,ROW(Empresas!$B$6:$B$46)-5),ROW($A13)),COLUMN(AE$1)),\"\")","v":""},{"$f":"IFERROR(INDEX(Empresas!$B$6:$AS$46,SMALL(IF(Empresas!$B$6:$B$46=Dados!$H$37,ROW(Empresas!$B$6:$B$46)-5),ROW($A13)),COLUMN(AF$1)),\"\")","v":""},{"$f":"IFERROR(INDEX(Empresas!$B$6:$AS$46,SMALL(IF(Empresas!$B$6:$B$46=Dados!$H$37,ROW(Empresas!$B$6:$B$46)-5),ROW($A13)),COLUMN(AG$1)),\"\")","v":""},{"$f":"IFERROR(INDEX(Empresas!$B$6:$AS$46,SMALL(IF(Empresas!$B$6:$B$46=Dados!$H$37,ROW(Empresas!$B$6:$B$46)-5),ROW($A13)),COLUMN(AH$1)),\"\")","v":""},{"$f":"IFERROR(INDEX(Empresas!$B$6:$AS$46,SMALL(IF(Empresas!$B$6:$B$46=Dados!$H$37,ROW(Empresas!$B$6:$B$46)-5),ROW($A13)),COLUMN(AI$1)),\"\")","v":""},{"$f":"IFERROR(INDEX(Empresas!$B$6:$AS$46,SMALL(IF(Empresas!$B$6:$B$46=Dados!$H$37,ROW(Empresas!$B$6:$B$46)-5),ROW($A13)),COLUMN(AJ$1)),\"\")","v":""},{"$f":"IFERROR(INDEX(Empresas!$B$6:$AS$46,SMALL(IF(Empresas!$B$6:$B$46=Dados!$H$37,ROW(Empresas!$B$6:$B$46)-5),ROW($A13)),COLUMN(AK$1)),\"\")","v":""},{"$f":"IFERROR(INDEX(Empresas!$B$6:$AS$46,SMALL(IF(Empresas!$B$6:$B$46=Dados!$H$37,ROW(Empresas!$B$6:$B$46)-5),ROW($A13)),COLUMN(AL$1)),\"\")","v":""},{"$f":"IFERROR(INDEX(Empresas!$B$6:$AS$46,SMALL(IF(Empresas!$B$6:$B$46=Dados!$H$37,ROW(Empresas!$B$6:$B$46)-5),ROW($A13)),COLUMN(AM$1)),\"\")","v":""},{"$f":"IFERROR(INDEX(Empresas!$B$6:$AS$46,SMALL(IF(Empresas!$B$6:$B$46=Dados!$H$37,ROW(Empresas!$B$6:$B$46)-5),ROW($A13)),COLUMN(AN$1)),\"\")","v":""},{"$f":"IFERROR(INDEX(Empresas!$B$6:$AS$46,SMALL(IF(Empresas!$B$6:$B$46=Dados!$H$37,ROW(Empresas!$B$6:$B$46)-5),ROW($A13)),COLUMN(AO$1)),\"\")","v":""},{"$f":"IFERROR(INDEX(Empresas!$B$6:$AS$46,SMALL(IF(Empresas!$B$6:$B$46=Dados!$H$37,ROW(Empresas!$B$6:$B$46)-5),ROW($A13)),COLUMN(AP$1)),\"\")","v":""},{"$f":"IFERROR(INDEX(Empresas!$B$6:$AS$46,SMALL(IF(Empresas!$B$6:$B$46=Dados!$H$37,ROW(Empresas!$B$6:$B$46)-5),ROW($A13)),COLUMN(AQ$1)),\"\")","v":""},{"$f":"IFERROR(INDEX(Empresas!$B$6:$AS$46,SMALL(IF(Empresas!$B$6:$B$46=Dados!$H$37,ROW(Empresas!$B$6:$B$46)-5),ROW($A13)),COLUMN(AR$1)),\"\")","v":""}]
[null,{"$f":"IFERROR(INDEX(Empresas!$B$6:$AS$46,SMALL(IF(Empresas!$B$6:$B$46=Dados!$H$37,ROW(Empresas!$B$6:$B$46)-5),ROW($A14)),COLUMN(B$1)),\"\")","v":""},{"$f":"IFERROR(INDEX(Empresas!$B$6:$AS$46,SMALL(IF(Empresas!$B$6:$B$46=Dados!$H$37,ROW(Empresas!$B$6:$B$46)-5),ROW($A14)),COLUMN(C$1)),\"\")","v":""},"",{"$f":"IFERROR(INDEX(Empresas!$B$6:$AS$46,SMALL(IF(Empresas!$B$6:$B$46=Dados!$H$37,ROW(Empresas!$B$6:$B$46)-5),ROW($A14)),COLUMN(F$1)),\"\")","v":""},{"$f":"IFERROR(INDEX(Empresas!$B$6:$AS$46,SMALL(IF(Empresas!$B$6:$B$46=Dados!$H$37,ROW(Empresas!$B$6:$B$46)-5),ROW($A14)),COLUMN(G$1)),\"\")","v":""},{"$f":"IFERROR(INDEX(Empresas!$B$6:$AS$46,SMALL(IF(Empresas!$B$6:$B$46=Dados!$H$37,ROW(Empresas!$B$6:$B$46)-5),ROW($A14)),COLUMN(H$1)),\"\")","v":""},{"$f":"IFERROR(INDEX(Empresas!$B$6:$AS$46,SMALL(IF(Empresas!$B$6:$B$46=Dados!$H$37,ROW(Empresas!$B$6:$B$46)-5),ROW($A14)),COLUMN(I$1)),\"\")","v":""},{"$f":"IFERROR(INDEX(Empresas!$B$6:$AS$46,SMALL(IF(Empresas!$B$6:$B$46=Dados!$H$37,ROW(Empresas!$B$6:$B$46)-5),ROW($A14)),COLUMN(J$1)),\"\")","v":""},{"$f":"IFERROR(INDEX(Empresas!$B$6:$AS$46,SMALL(IF(Empresas!$B$6:$B$46=Dados!$H$37,ROW(Empresas!$B$6:$B$46)-5),ROW($A14)),COLUMN(K$1)),\"\")","v":""},{"$f":"IFERROR(INDEX(Empresas!$B$6:$AS$46,SMALL(IF(Empresas!$B$6:$B$46=Dados!$H$37,ROW(Empresas!$B$6:$B$46)-5),ROW($A14)),COLUMN(L$1)),\"\")","v":""},{"$f":"IFERROR(INDEX(Empresas!$B$6:$AS$46,SMALL(IF(Empresas!$B$6:$B$46=Dados!$H$37,ROW(Empresas!$B$6:$B$46)-5),ROW($A14)),COLUMN(M$1)),\"\")","v":""},{"$f":"IFERROR(INDEX(Empresas!$B$6:$AS$46,SMALL(IF(Empresas!$B$6:$B$46=Dados!$H$37,ROW(Empresas!$B$6:$B$46)-5),ROW($A14)),COLUMN(N$1)),\"\")","v":""},{"$f":"IFERROR(INDEX(Empresas!$B$6:$AS$46,SMALL(IF(Empresas!$B$6:$B$46=Dados!$H$37,ROW(Empresas!$B$6:$B$46)-5),ROW($A14)),COLUMN(O$1)),\"\")","v":""},{"$f":"IFERROR(INDEX(Empresas!$B$6:$AS$46,SMALL(IF(Empresas!$B$6:$B$46=Dados!$H$37,ROW(Empresas!$B$6:$B$46)-5),ROW($A14)),COLUMN(P$1)),\"\")","v":""},{"$f":"IFERROR(INDEX(Empresas!$B$6:$AS$46,SMALL(IF(Empresas!$B$6:$B$46=Dados!$H$37,ROW(Empresas!$B$6:$B$46)-5),ROW($A14)),COLUMN(Q$1)),\"\")","v":""},{"$f":"IFERROR(INDEX(Empresas!$B$6:$AS$46,SMALL(IF(Empresas!$B$6:$B$46=Dados!$H$37,ROW(Empresas!$B$6:$B$46)-5),ROW($A14)),COLUMN(R$1)),\"\")","v":""},{"$f":"IFERROR(INDEX(Empresas!$B$6:$AS$46,SMALL(IF(Empresas!$B$6:$B$46=Dados!$H$37,ROW(Empresas!$B$6:$B$46)-5),ROW($A14)),COLUMN(S$1)),\"\")","v":""},{"$f":"IFERROR(INDEX(Empresas!$B$6:$AS$46,SMALL(IF(Empresas!$B$6:$B$46=Dados!$H$37,ROW(Empresas!$B$6:$B$46)-5),ROW($A14)),COLUMN(T$1)),\"\")","v":""},{"$f":"IFERROR(INDEX(Empresas!$B$6:$AS$46,SMALL(IF(Empresas!$B$6:$B$46=Dados!$H$37,ROW(Empresas!$B$6:$B$46)-5),ROW($A14)),COLUMN(U$1)),\"\")","v":""},{"$f":"IFERROR(INDEX(Empresas!$B$6:$AS$46,SMALL(IF(Empresas!$B$6:$B$46=Dados!$H$37,ROW(Empresas!$B$6:$B$46)-5),ROW($A14)),COLUMN(V$1)),\"\")","v":""},{"$f":"IFERROR(INDEX(Empresas!$B$6:$AS$46,SMALL(IF(Empresas!$B$6:$B$46=Dados!$H$37,ROW(Empresas!$B$6:$B$46)-5),ROW($A14)),COLUMN(W$1)),\"\")","v":""},{"$f":"IFERROR(INDEX(Empresas!$B$6:$AS$46,SMALL(IF(Empresas!$B$6:$B$46=Dados!$H$37,ROW(Empresas!$B$6:$B$46)-5),ROW($A14)),COLUMN(X$1)),\"\")","v":""},{"$f":"IFERROR(INDEX(Empresas!$B$6:$AS$46,SMALL(IF(Empresas!$B$6:$B$46=Dados!$H$37,ROW(Empresas!$B$6:$B$46)-5),ROW($A14)),COLUMN(Y$1)),\"\")","v":""},{"$f":"IFERROR(INDEX(Empresas!$B$6:$AS$46,SMALL(IF(Empresas!$B$6:$B$46=Dados!$H$37,ROW(Empresas!$B$6:$B$46)-5),ROW($A14)),COLUMN(Z$1)),\"\")","v":""},{"$f":"IFERROR(INDEX(Empresas!$B$6:$AS$46,SMALL(IF(Empresas!$B$6:$B$46=Dados!$H$37,ROW(Empresas!$B$6:$B$46)-5),ROW($A14)),COLUMN(AA$1)),\"\")","v":""},{"$f":"IFERROR(INDEX(Empresas!$B$6:$AS$46,SMALL(IF(Empresas!$B$6:$B$46=Dados!$H$37,ROW(Empresas!$B$6:$B$46)-5),ROW($A14)),COLUMN(AB$1)),\"\")","v":""},{"$f":"IFERROR(INDEX(Empresas!$B$6:$AS$46,SMALL(IF(Empresas!$B$6:$B$46=Dados!$H$37,ROW(Empresas!$B$6:$B$46)-5),ROW($A14)),COLUMN(AC$1)),\"\")","v":""},{"$f":"IFERROR(INDEX(Empresas!$B$6:$AS$46,SMALL(IF(Empresas!$B$6:$B$46=Dados!$H$37,ROW(Empresas!$B$6:$B$46)-5),ROW($A14)),COLUMN(AD$1)),\"\")","v":""},{"$f":"IFERROR(INDEX(Empresas!$B$6:$AS$46,SMALL(IF(Empresas!$B$6:$B$46=Dados!$H$37,ROW(Empresas!$B$6:$B$46)-5),ROW($A14)),COLUMN(AE$1)),\"\")","v":""},{"$f":"IFERROR(INDEX(Empresas!$B$6:$AS$46,SMALL(IF(Empresas!$B$6:$B$46=Dados!$H$37,ROW(Empresas!$B$6:$B$46)-5),ROW($A14)),COLUMN(AF$1)),\"\")","v":""},{"$f":"IFERROR(INDEX(Empresas!$B$6:$AS$46,SMALL(IF(Empresas!$B$6:$B$46=Dados!$H$37,ROW(Empresas!$B$6:$B$46)-5),ROW($A14)),COLUMN(AG$1)),\"\")","v":""},{"$f":"IFERROR(INDEX(Empresas!$B$6:$AS$46,SMALL(IF(Empresas!$B$6:$B$46=Dados!$H$37,ROW(Empresas!$B$6:$B$46)-5),ROW($A14)),COLUMN(AH$1)),\"\")","v":""},{"$f":"IFERROR(INDEX(Empresas!$B$6:$AS$46,SMALL(IF(Empresas!$B$6:$B$46=Dados!$H$37,ROW(Empresas!$B$6:$B$46)-5),ROW($A14)),COLUMN(AI$1)),\"\")","v":""},{"$f":"IFERROR(INDEX(Empresas!$B$6:$AS$46,SMALL(IF(Empresas!$B$6:$B$46=Dados!$H$37,ROW(Empresas!$B$6:$B$46)-5),ROW($A14)),COLUMN(AJ$1)),\"\")","v":""},{"$f":"IFERROR(INDEX(Empresas!$B$6:$AS$46,SMALL(IF(Empresas!$B$6:$B$46=Dados!$H$37,ROW(Empresas!$B$6:$B$46)-5),ROW($A14)),COLUMN(AK$1)),\"\")","v":""},{"$f":"IFERROR(INDEX(Empresas!$B$6:$AS$46,SMALL(IF(Empresas!$B$6:$B$46=Dados!$H$37,ROW(Empresas!$B$6:$B$46)-5),ROW($A14)),COLUMN(AL$1)),\"\")","v":""},{"$f":"IFERROR(INDEX(Empresas!$B$6:$AS$46,SMALL(IF(Empresas!$B$6:$B$46=Dados!$H$37,ROW(Empresas!$B$6:$B$46)-5),ROW($A14)),COLUMN(AM$1)),\"\")","v":""},{"$f":"IFERROR(INDEX(Empresas!$B$6:$AS$46,SMALL(IF(Empresas!$B$6:$B$46=Dados!$H$37,ROW(Empresas!$B$6:$B$46)-5),ROW($A14)),COLUMN(AN$1)),\"\")","v":""},{"$f":"IFERROR(INDEX(Empresas!$B$6:$AS$46,SMALL(IF(Empresas!$B$6:$B$46=Dados!$H$37,ROW(Empresas!$B$6:$B$46)-5),ROW($A14)),COLUMN(AO$1)),\"\")","v":""},{"$f":"IFERROR(INDEX(Empresas!$B$6:$AS$46,SMALL(IF(Empresas!$B$6:$B$46=Dados!$H$37,ROW(Empresas!$B$6:$B$46)-5),ROW($A14)),COLUMN(AP$1)),\"\")","v":""},{"$f":"IFERROR(INDEX(Empresas!$B$6:$AS$46,SMALL(IF(Empresas!$B$6:$B$46=Dados!$H$37,ROW(Empresas!$B$6:$B$46)-5),ROW($A14)),COLUMN(AQ$1)),\"\")","v":""},{"$f":"IFERROR(INDEX(Empresas!$B$6:$AS$46,SMALL(IF(Empresas!$B$6:$B$46=Dados!$H$37,ROW(Empresas!$B$6:$B$46)-5),ROW($A14)),COLUMN(AR$1)),\"\")","v":""}]
[null,{"$f":"IFERROR(INDEX(Empresas!$B$6:$AS$46,SMALL(IF(Empresas!$B$6:$B$46=Dados!$H$37,ROW(Empresas!$B$6:$B$46)-5),ROW($A15)),COLUMN(B$1)),\"\")","v":""},{"$f":"IFERROR(INDEX(Empresas!$B$6:$AS$46,SMALL(IF(Empresas!$B$6:$B$46=Dados!$H$37,ROW(Empresas!$B$6:$B$46)-5),ROW($A15)),COLUMN(C$1)),\"\")","v":""},"",{"$f":"IFERROR(INDEX(Empresas!$B$6:$AS$46,SMALL(IF(Empresas!$B$6:$B$46=Dados!$H$37,ROW(Empresas!$B$6:$B$46)-5),ROW($A15)),COLUMN(F$1)),\"\")","v":""},{"$f":"IFERROR(INDEX(Empresas!$B$6:$AS$46,SMALL(IF(Empresas!$B$6:$B$46=Dados!$H$37,ROW(Empresas!$B$6:$B$46)-5),ROW($A15)),COLUMN(G$1)),\"\")","v":""},{"$f":"IFERROR(INDEX(Empresas!$B$6:$AS$46,SMALL(IF(Empresas!$B$6:$B$46=Dados!$H$37,ROW(Empresas!$B$6:$B$46)-5),ROW($A15)),COLUMN(H$1)),\"\")","v":""},{"$f":"IFERROR(INDEX(Empresas!$B$6:$AS$46,SMALL(IF(Empresas!$B$6:$B$46=Dados!$H$37,ROW(Empresas!$B$6:$B$46)-5),ROW($A15)),COLUMN(I$1)),\"\")","v":""},{"$f":"IFERROR(INDEX(Empresas!$B$6:$AS$46,SMALL(IF(Empresas!$B$6:$B$46=Dados!$H$37,ROW(Empresas!$B$6:$B$46)-5),ROW($A15)),COLUMN(J$1)),\"\")","v":""},{"$f":"IFERROR(INDEX(Empresas!$B$6:$AS$46,SMALL(IF(Empresas!$B$6:$B$46=Dados!$H$37,ROW(Empresas!$B$6:$B$46)-5),ROW($A15)),COLUMN(K$1)),\"\")","v":""},{"$f":"IFERROR(INDEX(Empresas!$B$6:$AS$46,SMALL(IF(Empresas!$B$6:$B$46=Dados!$H$37,ROW(Empresas!$B$6:$B$46)-5),ROW($A15)),COLUMN(L$1)),\"\")","v":""},{"$f":"IFERROR(INDEX(Empresas!$B$6:$AS$46,SMALL(IF(Empresas!$B$6:$B$46=Dados!$H$37,ROW(Empresas!$B$6:$B$46)-5),ROW($A15)),COLUMN(M$1)),\"\")","v":""},{"$f":"IFERROR(INDEX(Empresas!$B$6:$AS$46,SMALL(IF(Empresas!$B$6:$B$46=Dados!$H$37,ROW(Empresas!$B$6:$B$46)-5),ROW($A15)),COLUMN(N$1)),\"\")","v":""},{"$f":"IFERROR(INDEX(Empresas!$B$6:$AS$46,SMALL(IF(Empresas!$B$6:$B$46=Dados!$H$37,ROW(Empresas!$B$6:$B$46)-5),ROW($A15)),COLUMN(O$1)),\"\")","v":""},{"$f":"IFERROR(INDEX(Empresas!$B$6:$AS$46,SMALL(IF(Empresas!$B$6:$B$46=Dados!$H$37,ROW(Empresas!$B$6:$B$46)-5),ROW($A15)),COLUMN(P$1)),\"\")","v":""},{"$f":"IFERROR(INDEX(Empresas!$B$6:$AS$46,SMALL(IF(Empresas!$B$6:$B$46=Dados!$H$37,ROW(Empresas!$B$6:$B$46)-5),ROW($A15)),COLUMN(Q$1)),\"\")","v":""},{"$f":"IFERROR(INDEX(Empresas!$B$6:$AS$46,SMALL(IF(Empresas!$B$6:$B$46=Dados!$H$37,ROW(Empresas!$B$6:$B$46)-5),ROW($A15)),COLUMN(R$1)),\"\")","v":""},{"$f":"IFERROR(INDEX(Empresas!$B$6:$AS$46,SMALL(IF(Empresas!$B$6:$B$46=Dados!$H$37,ROW(Empresas!$B$6:$B$46)-5),ROW($A15)),COLUMN(S$1)),\"\")","v":""},{"$f":"IFERROR(INDEX(Empresas!$B$6:$AS$46,SMALL(IF(Empresas!$B$6:$B$46=Dados!$H$37,ROW(Empresas!$B$6:$B$46)-5),ROW($A15)),COLUMN(T$1)),\"\")","v":""},{"$f":"IFERROR(INDEX(Empresas!$B$6:$AS$46,SMALL(IF(Empresas!$B$6:$B$46=Dados!$H$37,ROW(Empresas!$B$6:$B$46)-5),ROW($A15)),COLUMN(U$1)),\"\")","v":""},{"$f":"IFERROR(INDEX(Empresas!$B$6:$AS$46,SMALL(IF(Empresas!$B$6:$B$46=Dados!$H$37,ROW(Empresas!$B$6:$B$46)-5),ROW($A15)),COLUMN(V$1)),\"\")","v":""},{"$f":"IFERROR(INDEX(Empresas!$B$6:$AS$46,SMALL(IF(Empresas!$B$6:$B$46=Dados!$H$37,ROW(Empresas!$B$6:$B$46)-5),ROW($A15)),COLUMN(W$1)),\"\")","v":""},{"$f":"IFERROR(INDEX(Empresas!$B$6:$AS$46,SMALL(IF(Empresas!$B$6:$B$46=Dados!$H$37,ROW(Empresas!$B$6:$B$46)-5),ROW($A15)),COLUMN(X$1)),\"\")","v":""},{"$f":"IFERROR(INDEX(Empresas!$B$6:$AS$46,SMALL(IF(Empresas!$B$6:$B$46=Dados!$H$37,ROW(Empresas!$B$6:$B$46)-5),ROW($A15)),COLUMN(Y$1)),\"\")","v":""},{"$f":"IFERROR(INDEX(Empresas!$B$6:$AS$46,SMALL(IF(Empresas!$B$6:$B$46=Dados!$H$37,ROW(Empresas!$B$6:$B$46)-5),ROW($A15)),COLUMN(Z$1)),\"\")","v":""},{"$f":"IFERROR(INDEX(Empresas!$B$6:$AS$46,SMALL(IF(Empresas!$B$6:$B$46=Dados!$H$37,ROW(Empresas!$B$6:$B$46)-5),ROW($A15)),COLUMN(AA$1)),\"\")","v":""},{"$f":"IFERROR(INDEX(Empresas!$B$6:$AS$46,SMALL(IF(Empresas!$B$6:$B$46=Dados!$H$37,ROW(Empresas!$B$6:$B$46)-5),ROW($A15)),COLUMN(AB$1)),\"\")","v":""},{"$f":"IFERROR(INDEX(Empresas!$B$6:$AS$46,SMALL(IF(Empresas!$B$6:$B$46=Dados!$H$37,ROW(Empresas!$B$6:$B$46)-5),ROW($A15)),COLUMN(AC$1)),\"\")","v":""},{"$f":"IFERROR(INDEX(Empresas!$B$6:$AS$46,SMALL(IF(Empresas!$B$6:$B$46=Dados!$H$37,ROW(Empresas!$B$6:$B$46)-5),ROW($A15)),COLUMN(AD$1)),\"\")","v":""},{"$f":"IFERROR(INDEX(Empresas!$B$6:$AS$46,SMALL(IF(Empresas!$B$6:$B$46=Dados!$H$37,ROW(Empresas!$B$6:$B$46)-5),ROW($A15)),COLUMN(AE$1)),\"\")","v":""},{"$f":"IFERROR(INDEX(Empresas!$B$6:$AS$46,SMALL(IF(Empresas!$B$6:$B$46=Dados!$H$37,ROW(Empresas!$B$6:$B$46)-5),ROW($A15)),COLUMN(AF$1)),\"\")","v":""},{"$f":"IFERROR(INDEX(Empresas!$B$6:$AS$46,SMALL(IF(Empresas!$B$6:$B$46=Dados!$H$37,ROW(Empresas!$B$6:$B$46)-5),ROW($A15)),COLUMN(AG$1)),\"\")","v":""},{"$f":"IFERROR(INDEX(Empresas!$B$6:$AS$46,SMALL(IF(Empresas!$B$6:$B$46=Dados!$H$37,ROW(Empresas!$B$6:$B$46)-5),ROW($A15)),COLUMN(AH$1)),\"\")","v":""},{"$f":"IFERROR(INDEX(Empresas!$B$6:$AS$46,SMALL(IF(Empresas!$B$6:$B$46=Dados!$H$37,ROW(Empresas!$B$6:$B$46)-5),ROW($A15)),COLUMN(AI$1)),\"\")","v":""},{"$f":"IFERROR(INDEX(Empresas!$B$6:$AS$46,SMALL(IF(Empresas!$B$6:$B$46=Dados!$H$37,ROW(Empresas!$B$6:$B$46)-5),ROW($A15)),COLUMN(AJ$1)),\"\")","v":""},{"$f":"IFERROR(INDEX(Empresas!$B$6:$AS$46,SMALL(IF(Empresas!$B$6:$B$46=Dados!$H$37,ROW(Empresas!$B$6:$B$46)-5),ROW($A15)),COLUMN(AK$1)),\"\")","v":""},{"$f":"IFERROR(INDEX(Empresas!$B$6:$AS$46,SMALL(IF(Empresas!$B$6:$B$46=Dados!$H$37,ROW(Empresas!$B$6:$B$46)-5),ROW($A15)),COLUMN(AL$1)),\"\")","v":""},{"$f":"IFERROR(INDEX(Empresas!$B$6:$AS$46,SMALL(IF(Empresas!$B$6:$B$46=Dados!$H$37,ROW(Empresas!$B$6:$B$46)-5),ROW($A15)),COLUMN(AM$1)),\"\")","v":""},{"$f":"IFERROR(INDEX(Empresas!$B$6:$AS$46,SMALL(IF(Empresas!$B$6:$B$46=Dados!$H$37,ROW(Empresas!$B$6:$B$46)-5),ROW($A15)),COLUMN(AN$1)),\"\")","v":""},{"$f":"IFERROR(INDEX(Empresas!$B$6:$AS$46,SMALL(IF(Empresas!$B$6:$B$46=Dados!$H$37,ROW(Empresas!$B$6:$B$46)-5),ROW($A15)),COLUMN(AO$1)),\"\")","v":""},{"$f":"IFERROR(INDEX(Empresas!$B$6:$AS$46,SMALL(IF(Empresas!$B$6:$B$46=Dados!$H$37,ROW(Empresas!$B$6:$B$46)-5),ROW($A15)),COLUMN(AP$1)),\"\")","v":""},{"$f":"IFERROR(INDEX(Empresas!$B$6:$AS$46,SMALL(IF(Empresas!$B$6:$B$46=Dados!$H$37,ROW(Empresas!$B$6:$B$46)-5),ROW($A15)),COLUMN(AQ$1)),\"\")","v":""},{"$f":"IFERROR(INDEX(Empresas!$B$6:$AS$46,SMALL(IF(Empresas!$B$6:$B$46=Dados!$H$37,ROW(Empresas!$B$6:$B$46)-5),ROW($A15)),COLUMN(AR$1)),\"\")","v":""}]
[null,{"$f":"IFERROR(INDEX(Empresas!$B$6:$AS$46,SMALL(IF(Empresas!$B$6:$B$46=Dados!$H$37,ROW(Empresas!$B$6:$B$46)-5),ROW($A16)),COLUMN(B$1)),\"\")","v":""},{"$f":"IFERROR(INDEX(Empresas!$B$6:$AS$46,SMALL(IF(Empresas!$B$6:$B$46=Dados!$H$37,ROW(Empresas!$B$6:$B$46)-5),ROW($A16)),COLUMN(C$1)),\"\")","v":""},"",{"$f":"IFERROR(INDEX(Empresas!$B$6:$AS$46,SMALL(IF(Empresas!$B$6:$B$46=Dados!$H$37,ROW(Empresas!$B$6:$B$46)-5),ROW($A16)),COLUMN(F$1)),\"\")","v":""},{"$f":"IFERROR(INDEX(Empresas!$B$6:$AS$46,SMALL(IF(Empresas!$B$6:$B$46=Dados!$H$37,ROW(Empresas!$B$6:$B$46)-5),ROW($A16)),COLUMN(G$1)),\"\")","v":""},{"$f":"IFERROR(INDEX(Empresas!$B$6:$AS$46,SMALL(IF(Empresas!$B$6:$B$46=Dados!$H$37,ROW(Empresas!$B$6:$B$46)-5),ROW($A16)),COLUMN(H$1)),\"\")","v":""},{"$f":"IFERROR(INDEX(Empresas!$B$6:$AS$46,SMALL(IF(Empresas!$B$6:$B$46=Dados!$H$37,ROW(Empresas!$B$6:$B$46)-5),ROW($A16)),COLUMN(I$1)),\"\")","v":""},{"$f":"IFERROR(INDEX(Empresas!$B$6:$AS$46,SMALL(IF(Empresas!$B$6:$B$46=Dados!$H$37,ROW(Empresas!$B$6:$B$46)-5),ROW($A16)),COLUMN(J$1)),\"\")","v":""},{"$f":"IFERROR(INDEX(Empresas!$B$6:$AS$46,SMALL(IF(Empresas!$B$6:$B$46=Dados!$H$37,ROW(Empresas!$B$6:$B$46)-5),ROW($A16)),COLUMN(K$1)),\"\")","v":""},{"$f":"IFERROR(INDEX(Empresas!$B$6:$AS$46,SMALL(IF(Empresas!$B$6:$B$46=Dados!$H$37,ROW(Empresas!$B$6:$B$46)-5),ROW($A16)),COLUMN(L$1)),\"\")","v":""},{"$f":"IFERROR(INDEX(Empresas!$B$6:$AS$46,SMALL(IF(Empresas!$B$6:$B$46=Dados!$H$37,ROW(Empresas!$B$6:$B$46)-5),ROW($A16)),COLUMN(M$1)),\"\")","v":""},{"$f":"IFERROR(INDEX(Empresas!$B$6:$AS$46,SMALL(IF(Empresas!$B$6:$B$46=Dados!$H$37,ROW(Empresas!$B$6:$B$46)-5),ROW($A16)),COLUMN(N$1)),\"\")","v":""},{"$f":"IFERROR(INDEX(Empresas!$B$6:$AS$46,SMALL(IF(Empresas!$B$6:$B$46=Dados!$H$37,ROW(Empresas!$B$6:$B$46)-5),ROW($A16)),COLUMN(O$1)),\"\")","v":""},{"$f":"IFERROR(INDEX(Empresas!$B$6:$AS$46,SMALL(IF(Empresas!$B$6:$B$46=Dados!$H$37,ROW(Empresas!$B$6:$B$46)-5),ROW($A16)),COLUMN(P$1)),\"\")","v":""},{"$f":"IFERROR(INDEX(Empresas!$B$6:$AS$46,SMALL(IF(Empresas!$B$6:$B$46=Dados!$H$37,ROW(Empresas!$B$6:$B$46)-5),ROW($A16)),COLUMN(Q$1)),\"\")","v":""},{"$f":"IFERROR(INDEX(Empresas!$B$6:$AS$46,SMALL(IF(Empresas!$B$6:$B$46=Dados!$H$37,ROW(Empresas!$B$6:$B$46)-5),ROW($A16)),COLUMN(R$1)),\"\")","v":""},{"$f":"IFERROR(INDEX(Empresas!$B$6:$AS$46,SMALL(IF(Empresas!$B$6:$B$46=Dados!$H$37,ROW(Empresas!$B$6:$B$46)-5),ROW($A16)),COLUMN(S$1)),\"\")","v":""},{"$f":"IFERROR(INDEX(Empresas!$B$6:$AS$46,SMALL(IF(Empresas!$B$6:$B$46=Dados!$H$37,ROW(Empresas!$B$6:$B$46)-5),ROW($A16)),COLUMN(T$1)),\"\")","v":""},{"$f":"IFERROR(INDEX(Empresas!$B$6:$AS$46,SMALL(IF(Empresas!$B$6:$B$46=Dados!$H$37,ROW(Empresas!$B$6:$B$46)-5),ROW($A16)),COLUMN(U$1)),\"\")","v":""},{"$f":"IFERROR(INDEX(Empresas!$B$6:$AS$46,SMALL(IF(Empresas!$B$6:$B$46=Dados!$H$37,ROW(Empresas!$B$6:$B$46)-5),ROW($A16)),COLUMN(V$1)),\"\")","v":""},{"$f":"IFERROR(INDEX(Empresas!$B$6:$AS$46,SMALL(IF(Empresas!$B$6:$B$46=Dados!$H$37,ROW(Empresas!$B$6:$B$46)-5),ROW($A16)),COLUMN(W$1)),\"\")","v":""},{"$f":"IFERROR(INDEX(Empresas!$B$6:$AS$46,SMALL(IF(Empresas!$B$6:$B$46=Dados!$H$37,ROW(Empresas!$B$6:$B$46)-5),ROW($A16)),COLUMN(X$1)),\"\")","v":""},{"$f":"IFERROR(INDEX(Empresas!$B$6:$AS$46,SMALL(IF(Empresas!$B$6:$B$46=Dados!$H$37,ROW(Empresas!$B$6:$B$46)-5),ROW($A16)),COLUMN(Y$1)),\"\")","v":""},{"$f":"IFERROR(INDEX(Empresas!$B$6:$AS$46,SMALL(IF(Empresas!$B$6:$B$46=Dados!$H$37,ROW(Empresas!$B$6:$B$46)-5),ROW($A16)),COLUMN(Z$1)),\"\")","v":""},{"$f":"IFERROR(INDEX(Empresas!$B$6:$AS$46,SMALL(IF(Empresas!$B$6:$B$46=Dados!$H$37,ROW(Empresas!$B$6:$B$46)-5),ROW($A16)),COLUMN(AA$1)),\"\")","v":""},{"$f":"IFERROR(INDEX(Empresas!$B$6:$AS$46,SMALL(IF(Empresas!$B$6:$B$46=Dados!$H$37,ROW(Empresas!$B$6:$B$46)-5),ROW($A16)),COLUMN(AB$1)),\"\")","v":""},{"$f":"IFERROR(INDEX(Empresas!$B$6:$AS$46,SMALL(IF(Empresas!$B$6:$B$46=Dados!$H$37,ROW(Empresas!$B$6:$B$46)-5),ROW($A16)),COLUMN(AC$1)),\"\")","v":""},{"$f":"IFERROR(INDEX(Empresas!$B$6:$AS$46,SMALL(IF(Empresas!$B$6:$B$46=Dados!$H$37,ROW(Empresas!$B$6:$B$46)-5),ROW($A16)),COLUMN(AD$1)),\"\")","v":""},{"$f":"IFERROR(INDEX(Empresas!$B$6:$AS$46,SMALL(IF(Empresas!$B$6:$B$46=Dados!$H$37,ROW(Empresas!$B$6:$B$46)-5),ROW($A16)),COLUMN(AE$1)),\"\")","v":""},{"$f":"IFERROR(INDEX(Empresas!$B$6:$AS$46,SMALL(IF(Empresas!$B$6:$B$46=Dados!$H$37,ROW(Empresas!$B$6:$B$46)-5),ROW($A16)),COLUMN(AF$1)),\"\")","v":""},{"$f":"IFERROR(INDEX(Empresas!$B$6:$AS$46,SMALL(IF(Empresas!$B$6:$B$46=Dados!$H$37,ROW(Empresas!$B$6:$B$46)-5),ROW($A16)),COLUMN(AG$1)),\"\")","v":""},{"$f":"IFERROR(INDEX(Empresas!$B$6:$AS$46,SMALL(IF(Empresas!$B$6:$B$46=Dados!$H$37,ROW(Empresas!$B$6:$B$46)-5),ROW($A16)),COLUMN(AH$1)),\"\")","v":""},{"$f":"IFERROR(INDEX(Empresas!$B$6:$AS$46,SMALL(IF(Empresas!$B$6:$B$46=Dados!$H$37,ROW(Empresas!$B$6:$B$46)-5),ROW($A16)),COLUMN(AI$1)),\"\")","v":""},{"$f":"IFERROR(INDEX(Empresas!$B$6:$AS$46,SMALL(IF(Empresas!$B$6:$B$46=Dados!$H$37,ROW(Empresas!$B$6:$B$46)-5),ROW($A16)),COLUMN(AJ$1)),\"\")","v":""},{"$f":"IFERROR(INDEX(Empresas!$B$6:$AS$46,SMALL(IF(Empresas!$B$6:$B$46=Dados!$H$37,ROW(Empresas!$B$6:$B$46)-5),ROW($A16)),COLUMN(AK$1)),\"\")","v":""},{"$f":"IFERROR(INDEX(Empresas!$B$6:$AS$46,SMALL(IF(Empresas!$B$6:$B$46=Dados!$H$37,ROW(Empresas!$B$6:$B$46)-5),ROW($A16)),COLUMN(AL$1)),\"\")","v":""},{"$f":"IFERROR(INDEX(Empresas!$B$6:$AS$46,SMALL(IF(Empresas!$B$6:$B$46=Dados!$H$37,ROW(Empresas!$B$6:$B$46)-5),ROW($A16)),COLUMN(AM$1)),\"\")","v":""},{"$f":"IFERROR(INDEX(Empresas!$B$6:$AS$46,SMALL(IF(Empresas!$B$6:$B$46=Dados!$H$37,ROW(Empresas!$B$6:$B$46)-5),ROW($A16)),COLUMN(AN$1)),\"\")","v":""},{"$f":"IFERROR(INDEX(Empresas!$B$6:$AS$46,SMALL(IF(Empresas!$B$6:$B$46=Dados!$H$37,ROW(Empresas!$B$6:$B$46)-5),ROW($A16)),COLUMN(AO$1)),\"\")","v":""},{"$f":"IFERROR(INDEX(Empresas!$B$6:$AS$46,SMALL(IF(Empresas!$B$6:$B$46=Dados!$H$37,ROW(Empresas!$B$6:$B$46)-5),ROW($A16)),COLUMN(AP$1)),\"\")","v":""},{"$f":"IFERROR(INDEX(Empresas!$B$6:$AS$46,SMALL(IF(Empresas!$B$6:$B$46=Dados!$H$37,ROW(Empresas!$B$6:$B$46)-5),ROW($A16)),COLUMN(AQ$1)),\"\")","v":""},{"$f":"IFERROR(INDEX(Empresas!$B$6:$AS$46,SMALL(IF(Empresas!$B$6:$B$46=Dados!$H$37,ROW(Empresas!$B$6:$B$46)-5),ROW($A16)),COLUMN(AR$1)),\"\")","v":""}]
[null,{"$f":"IFERROR(INDEX(Empresas!$B$6:$AS$46,SMALL(IF(Empresas!$B$6:$B$46=Dados!$H$37,ROW(Empresas!$B$6:$B$46)-5),ROW($A17)),COLUMN(B$1)),\"\")","v":""},{"$f":"IFERROR(INDEX(Empresas!$B$6:$AS$46,SMALL(IF(Empresas!$B$6:$B$46=Dados!$H$37,ROW(Empresas!$B$6:$B$46)-5),ROW($A17)),COLUMN(C$1)),\"\")","v":""},"",{"$f":"IFERROR(INDEX(Empresas!$B$6:$AS$46,SMALL(IF(Empresas!$B$6:$B$46=Dados!$H$37,ROW(Empresas!$B$6:$B$46)-5),ROW($A17)),COLUMN(F$1)),\"\")","v":""},{"$f":"IFERROR(INDEX(Empresas!$B$6:$AS$46,SMALL(IF(Empresas!$B$6:$B$46=Dados!$H$37,ROW(Empresas!$B$6:$B$46)-5),ROW($A17)),COLUMN(G$1)),\"\")","v":""},{"$f":"IFERROR(INDEX(Empresas!$B$6:$AS$46,SMALL(IF(Empresas!$B$6:$B$46=Dados!$H$37,ROW(Empresas!$B$6:$B$46)-5),ROW($A17)),COLUMN(H$1)),\"\")","v":""},{"$f":"IFERROR(INDEX(Empresas!$B$6:$AS$46,SMALL(IF(Empresas!$B$6:$B$46=Dados!$H$37,ROW(Empresas!$B$6:$B$46)-5),ROW($A17)),COLUMN(I$1)),\"\")","v":""},{"$f":"IFERROR(INDEX(Empresas!$B$6:$AS$46,SMALL(IF(Empresas!$B$6:$B$46=Dados!$H$37,ROW(Empresas!$B$6:$B$46)-5),ROW($A17)),COLUMN(J$1)),\"\")","v":""},{"$f":"IFERROR(INDEX(Empresas!$B$6:$AS$46,SMALL(IF(Empresas!$B$6:$B$46=Dados!$H$37,ROW(Empresas!$B$6:$B$46)-5),ROW($A17)),COLUMN(K$1)),\"\")","v":""},{"$f":"IFERROR(INDEX(Empresas!$B$6:$AS$46,SMALL(IF(Empresas!$B$6:$B$46=Dados!$H$37,ROW(Empresas!$B$6:$B$46)-5),ROW($A17)),COLUMN(L$1)),\"\")","v":""},{"$f":"IFERROR(INDEX(Empresas!$B$6:$AS$46,SMALL(IF(Empresas!$B$6:$B$46=Dados!$H$37,ROW(Empresas!$B$6:$B$46)-5),ROW($A17)),COLUMN(M$1)),\"\")","v":""},{"$f":"IFERROR(INDEX(Empresas!$B$6:$AS$46,SMALL(IF(Empresas!$B$6:$B$46=Dados!$H$37,ROW(Empresas!$B$6:$B$46)-5),ROW($A17)),COLUMN(N$1)),\"\")","v":""},{"$f":"IFERROR(INDEX(Empresas!$B$6:$AS$46,SMALL(IF(Empresas!$B$6:$B$46=Dados!$H$37,ROW(Empresas!$B$6:$B$46)-5),ROW($A17)),COLUMN(O$1)),\"\")","v":""},{"$f":"IFERROR(INDEX(Empresas!$B$6:$AS$46,SMALL(IF(Empresas!$B$6:$B$46=Dados!$H$37,ROW(Empresas!$B$6:$B$46)-5),ROW($A17)),COLUMN(P$1)),\"\")","v":""},{"$f":"IFERROR(INDEX(Empresas!$B$6:$AS$46,SMALL(IF(Empresas!$B$6:$B$46=Dados!$H$37,ROW(Empresas!$B$6:$B$46)-5),ROW($A17)),COLUMN(Q$1)),\"\")","v":""},{"$f":"IFERROR(INDEX(Empresas!$B$6:$AS$46,SMALL(IF(Empresas!$B$6:$B$46=Dados!$H$37,ROW(Empresas!$B$6:$B$46)-5),ROW($A17)),COLUMN(R$1)),\"\")","v":""},{"$f":"IFERROR(INDEX(Empresas!$B$6:$AS$46,SMALL(IF(Empresas!$B$6:$B$46=Dados!$H$37,ROW(Empresas!$B$6:$B$46)-5),ROW($A17)),COLUMN(S$1)),\"\")","v":""},{"$f":"IFERROR(INDEX(Empresas!$B$6:$AS$46,SMALL(IF(Empresas!$B$6:$B$46=Dados!$H$37,ROW(Empresas!$B$6:$B$46)-5),ROW($A17)),COLUMN(T$1)),\"\")","v":""},{"$f":"IFERROR(INDEX(Empresas!$B$6:$AS$46,SMALL(IF(Empresas!$B$6:$B$46=Dados!$H$37,ROW(Empresas!$B$6:$B$46)-5),ROW($A17)),COLUMN(U$1)),\"\")","v":""},{"$f":"IFERROR(INDEX(Empresas!$B$6:$AS$46,SMALL(IF(Empresas!$B$6:$B$46=Dados!$H$37,ROW(Empresas!$B$6:$B$46)-5),ROW($A17)),COLUMN(V$1)),\"\")","v":""},{"$f":"IFERROR(INDEX(Empresas!$B$6:$AS$46,SMALL(IF(Empresas!$B$6:$B$46=Dados!$H$37,ROW(Empresas!$B$6:$B$46)-5),ROW($A17)),COLUMN(W$1)),\"\")","v":""},{"$f":"IFERROR(INDEX(Empresas!$B$6:$AS$46,SMALL(IF(Empresas!$B$6:$B$46=Dados!$H$37,ROW(Empresas!$B$6:$B$46)-5),ROW($A17)),COLUMN(X$1)),\"\")","v":""},{"$f":"IFERROR(INDEX(Empresas!$B$6:$AS$46,SMALL(IF(Empresas!$B$6:$B$46=Dados!$H$37,ROW(Empresas!$B$6:$B$46)-5),ROW($A17)),COLUMN(Y$1)),\"\")","v":""},{"$f":"IFERROR(INDEX(Empresas!$B$6:$AS$46,SMALL(IF(Empresas!$B$6:$B$46=Dados!$H$37,ROW(Empresas!$B$6:$B$46)-5),ROW($A17)),COLUMN(Z$1)),\"\")","v":""},{"$f":"IFERROR(INDEX(Empresas!$B$6:$AS$46,SMALL(IF(Empresas!$B$6:$B$46=Dados!$H$37,ROW(Empresas!$B$6:$B$46)-5),ROW($A17)),COLUMN(AA$1)),\"\")","v":""},{"$f":"IFERROR(INDEX(Empresas!$B$6:$AS$46,SMALL(IF(Empresas!$B$6:$B$46=Dados!$H$37,ROW(Empresas!$B$6:$B$46)-5),ROW($A17)),COLUMN(AB$1)),\"\")","v":""},{"$f":"IFERROR(INDEX(Empresas!$B$6:$AS$46,SMALL(IF(Empresas!$B$6:$B$46=Dados!$H$37,ROW(Empresas!$B$6:$B$46)-5),ROW($A17)),COLUMN(AC$1)),\"\")","v":""},{"$f":"IFERROR(INDEX(Empresas!$B$6:$AS$46,SMALL(IF(Empresas!$B$6:$B$46=Dados!$H$37,ROW(Empresas!$B$6:$B$46)-5),ROW($A17)),COLUMN(AD$1)),\"\")","v":""},{"$f":"IFERROR(INDEX(Empresas!$B$6:$AS$46,SMALL(IF(Empresas!$B$6:$B$46=Dados!$H$37,ROW(Empresas!$B$6:$B$46)-5),ROW($A17)),COLUMN(AE$1)),\"\")","v":""},{"$f":"IFERROR(INDEX(Empresas!$B$6:$AS$46,SMALL(IF(Empresas!$B$6:$B$46=Dados!$H$37,ROW(Empresas!$B$6:$B$46)-5),ROW($A17)),COLUMN(AF$1)),\"\")","v":""},{"$f":"IFERROR(INDEX(Empresas!$B$6:$AS$46,SMALL(IF(Empresas!$B$6:$B$46=Dados!$H$37,ROW(Empresas!$B$6:$B$46)-5),ROW($A17)),COLUMN(AG$1)),\"\")","v":""},{"$f":"IFERROR(INDEX(Empresas!$B$6:$AS$46,SMALL(IF(Empresas!$B$6:$B$46=Dados!$H$37,ROW(Empresas!$B$6:$B$46)-5),ROW($A17)),COLUMN(AH$1)),\"\")","v":""},{"$f":"IFERROR(INDEX(Empresas!$B$6:$AS$46,SMALL(IF(Empresas!$B$6:$B$46=Dados!$H$37,ROW(Empresas!$B$6:$B$46)-5),ROW($A17)),COLUMN(AI$1)),\"\")","v":""},{"$f":"IFERROR(INDEX(Empresas!$B$6:$AS$46,SMALL(IF(Empresas!$B$6:$B$46=Dados!$H$37,ROW(Empresas!$B$6:$B$46)-5),ROW($A17)),COLUMN(AJ$1)),\"\")","v":""},{"$f":"IFERROR(INDEX(Empresas!$B$6:$AS$46,SMALL(IF(Empresas!$B$6:$B$46=Dados!$H$37,ROW(Empresas!$B$6:$B$46)-5),ROW($A17)),COLUMN(AK$1)),\"\")","v":""},{"$f":"IFERROR(INDEX(Empresas!$B$6:$AS$46,SMALL(IF(Empresas!$B$6:$B$46=Dados!$H$37,ROW(Empresas!$B$6:$B$46)-5),ROW($A17)),COLUMN(AL$1)),\"\")","v":""},{"$f":"IFERROR(INDEX(Empresas!$B$6:$AS$46,SMALL(IF(Empresas!$B$6:$B$46=Dados!$H$37,ROW(Empresas!$B$6:$B$46)-5),ROW($A17)),COLUMN(AM$1)),\"\")","v":""},{"$f":"IFERROR(INDEX(Empresas!$B$6:$AS$46,SMALL(IF(Empresas!$B$6:$B$46=Dados!$H$37,ROW(Empresas!$B$6:$B$46)-5),ROW($A17)),COLUMN(AN$1)),\"\")","v":""},{"$f":"IFERROR(INDEX(Empresas!$B$6:$AS$46,SMALL(IF(Empresas!$B$6:$B$46=Dados!$H$37,ROW(Empresas!$B$6:$B$46)-5),ROW($A17)),COLUMN(AO$1)),\"\")","v":""},{"$f":"IFERROR(INDEX(Empresas!$B$6:$AS$46,SMALL(IF(Empresas!$B$6:$B$46=Dados!$H$37,ROW(Empresas!$B$6:$B$46)-5),ROW($A17)),COLUMN(AP$1)),\"\")","v":""},{"$f":"IFERROR(INDEX(Empresas!$B$6:$AS$46,SMALL(IF(Empresas!$B$6:$B$46=Dados!$H$37,ROW(Empresas!$B$6:$B$46)-5),ROW($A17)),COLUMN(AQ$1)),\"\")","v":""},{"$f":"IFERROR(INDEX(Empresas!$B$6:$AS$46,SMALL(IF(Empresas!$B$6:$B$46=Dados!$H$37,ROW(Empresas!$B$6:$B$46)-5),ROW($A17)),COLUMN(AR$1)),\"\")","v":""}]
[null,{"$f":"IFERROR(INDEX(Empresas!$B$6:$AS$46,SMALL(IF(Empresas!$B$6:$B$46=Dados!$H$37,ROW(Empresas!$B$6:$B$46)-5),ROW($A18)),COLUMN(B$1)),\"\")","v":""},{"$f":"IFERROR(INDEX(Empresas!$B$6:$AS$46,SMALL(IF(Empresas!$B$6:$B$46=Dados!$H$37,ROW(Empresas!$B$6:$B$46)-5),ROW($A18)),COLUMN(C$1)),\"\")","v":""},"",{"$f":"IFERROR(INDEX(Empresas!$B$6:$AS$46,SMALL(IF(Empresas!$B$6:$B$46=Dados!$H$37,ROW(Empresas!$B$6:$B$46)-5),ROW($A18)),COLUMN(F$1)),\"\")","v":""},{"$f":"IFERROR(INDEX(Empresas!$B$6:$AS$46,SMALL(IF(Empresas!$B$6:$B$46=Dados!$H$37,ROW(Empresas!$B$6:$B$46)-5),ROW($A18)),COLUMN(G$1)),\"\")","v":""},{"$f":"IFERROR(INDEX(Empresas!$B$6:$AS$46,SMALL(IF(Empresas!$B$6:$B$46=Dados!$H$37,ROW(Empresas!$B$6:$B$46)-5),ROW($A18)),COLUMN(H$1)),\"\")","v":""},{"$f":"IFERROR(INDEX(Empresas!$B$6:$AS$46,SMALL(IF(Empresas!$B$6:$B$46=Dados!$H$37,ROW(Empresas!$B$6:$B$46)-5),ROW($A18)),COLUMN(I$1)),\"\")","v":""},{"$f":"IFERROR(INDEX(Empresas!$B$6:$AS$46,SMALL(IF(Empresas!$B$6:$B$46=Dados!$H$37,ROW(Empresas!$B$6:$B$46)-5),ROW($A18)),COLUMN(J$1)),\"\")","v":""},{"$f":"IFERROR(INDEX(Empresas!$B$6:$AS$46,SMALL(IF(Empresas!$B$6:$B$46=Dados!$H$37,ROW(Empresas!$B$6:$B$46)-5),ROW($A18)),COLUMN(K$1)),\"\")","v":""},{"$f":"IFERROR(INDEX(Empresas!$B$6:$AS$46,SMALL(IF(Empresas!$B$6:$B$46=Dados!$H$37,ROW(Empresas!$B$6:$B$46)-5),ROW($A18)),COLUMN(L$1)),\"\")","v":""},{"$f":"IFERROR(INDEX(Empresas!$B$6:$AS$46,SMALL(IF(Empresas!$B$6:$B$46=Dados!$H$37,ROW(Empresas!$B$6:$B$46)-5),ROW($A18)),COLUMN(M$1)),\"\")","v":""},{"$f":"IFERROR(INDEX(Empresas!$B$6:$AS$46,SMALL(IF(Empresas!$B$6:$B$46=Dados!$H$37,ROW(Empresas!$B$6:$B$46)-5),ROW($A18)),COLUMN(N$1)),\"\")","v":""},{"$f":"IFERROR(INDEX(Empresas!$B$6:$AS$46,SMALL(IF(Empresas!$B$6:$B$46=Dados!$H$37,ROW(Empresas!$B$6:$B$46)-5),ROW($A18)),COLUMN(O$1)),\"\")","v":""},{"$f":"IFERROR(INDEX(Empresas!$B$6:$AS$46,SMALL(IF(Empresas!$B$6:$B$46=Dados!$H$37,ROW(Empresas!$B$6:$B$46)-5),ROW($A18)),COLUMN(P$1)),\"\")","v":""},{"$f":"IFERROR(INDEX(Empresas!$B$6:$AS$46,SMALL(IF(Empresas!$B$6:$B$46=Dados!$H$37,ROW(Empresas!$B$6:$B$46)-5),ROW($A18)),COLUMN(Q$1)),\"\")","v":""},{"$f":"IFERROR(INDEX(Empresas!$B$6:$AS$46,SMALL(IF(Empresas!$B$6:$B$46=Dados!$H$37,ROW(Empresas!$B$6:$B$46)-5),ROW($A18)),COLUMN(R$1)),\"\")","v":""},{"$f":"IFERROR(INDEX(Empresas!$B$6:$AS$46,SMALL(IF(Empresas!$B$6:$B$46=Dados!$H$37,ROW(Empresas!$B$6:$B$46)-5),ROW($A18)),COLUMN(S$1)),\"\")","v":""},{"$f":"IFERROR(INDEX(Empresas!$B$6:$AS$46,SMALL(IF(Empresas!$B$6:$B$46=Dados!$H$37,ROW(Empresas!$B$6:$B$46)-5),ROW($A18)),COLUMN(T$1)),\"\")","v":""},{"$f":"IFERROR(INDEX(Empresas!$B$6:$AS$46,SMALL(IF(Empresas!$B$6:$B$46=Dados!$H$37,ROW(Empresas!$B$6:$B$46)-5),ROW($A18)),COLUMN(U$1)),\"\")","v":""},{"$f":"IFERROR(INDEX(Empresas!$B$6:$AS$46,SMALL(IF(Empresas!$B$6:$B$46=Dados!$H$37,ROW(Empresas!$B$6:$B$46)-5),ROW($A18)),COLUMN(V$1)),\"\")","v":""},{"$f":"IFERROR(INDEX(Empresas!$B$6:$AS$46,SMALL(IF(Empresas!$B$6:$B$46=Dados!$H$37,ROW(Empresas!$B$6:$B$46)-5),ROW($A18)),COLUMN(W$1)),\"\")","v":""},{"$f":"IFERROR(INDEX(Empresas!$B$6:$AS$46,SMALL(IF(Empresas!$B$6:$B$46=Dados!$H$37,ROW(Empresas!$B$6:$B$46)-5),ROW($A18)),COLUMN(X$1)),\"\")","v":""},{"$f":"IFERROR(INDEX(Empresas!$B$6:$AS$46,SMALL(IF(Empresas!$B$6:$B$46=Dados!$H$37,ROW(Empresas!$B$6:$B$46)-5),ROW($A18)),COLUMN(Y$1)),\"\")","v":""},{"$f":"IFERROR(INDEX(Empresas!$B$6:$AS$46,SMALL(IF(Empresas!$B$6:$B$46=Dados!$H$37,ROW(Empresas!$B$6:$B$46)-5),ROW($A18)),COLUMN(Z$1)),\"\")","v":""},{"$f":"IFERROR(INDEX(Empresas!$B$6:$AS$46,SMALL(IF(Empresas!$B$6:$B$46=Dados!$H$37,ROW(Empresas!$B$6:$B$46)-5),ROW($A18)),COLUMN(AA$1)),\"\")","v":""},{"$f":"IFERROR(INDEX(Empresas!$B$6:$AS$46,SMALL(IF(Empresas!$B$6:$B$46=Dados!$H$37,ROW(Empresas!$B$6:$B$46)-5),ROW($A18)),COLUMN(AB$1)),\"\")","v":""},{"$f":"IFERROR(INDEX(Empresas!$B$6:$AS$46,SMALL(IF(Empresas!$B$6:$B$46=Dados!$H$37,ROW(Empresas!$B$6:$B$46)-5),ROW($A18)),COLUMN(AC$1)),\"\")","v":""},{"$f":"IFERROR(INDEX(Empresas!$B$6:$AS$46,SMALL(IF(Empresas!$B$6:$B$46=Dados!$H$37,ROW(Empresas!$B$6:$B$46)-5),ROW($A18)),COLUMN(AD$1)),\"\")","v":""},{"$f":"IFERROR(INDEX(Empresas!$B$6:$AS$46,SMALL(IF(Empresas!$B$6:$B$46=Dados!$H$37,ROW(Empresas!$B$6:$B$46)-5),ROW($A18)),COLUMN(AE$1)),\"\")","v":""},{"$f":"IFERROR(INDEX(Empresas!$B$6:$AS$46,SMALL(IF(Empresas!$B$6:$B$46=Dados!$H$37,ROW(Empresas!$B$6:$B$46)-5),ROW($A18)),COLUMN(AF$1)),\"\")","v":""},{"$f":"IFERROR(INDEX(Empresas!$B$6:$AS$46,SMALL(IF(Empresas!$B$6:$B$46=Dados!$H$37,ROW(Empresas!$B$6:$B$46)-5),ROW($A18)),COLUMN(AG$1)),\"\")","v":""},{"$f":"IFERROR(INDEX(Empresas!$B$6:$AS$46,SMALL(IF(Empresas!$B$6:$B$46=Dados!$H$37,ROW(Empresas!$B$6:$B$46)-5),ROW($A18)),COLUMN(AH$1)),\"\")","v":""},{"$f":"IFERROR(INDEX(Empresas!$B$6:$AS$46,SMALL(IF(Empresas!$B$6:$B$46=Dados!$H$37,ROW(Empresas!$B$6:$B$46)-5),ROW($A18)),COLUMN(AI$1)),\"\")","v":""},{"$f":"IFERROR(INDEX(Empresas!$B$6:$AS$46,SMALL(IF(Empresas!$B$6:$B$46=Dados!$H$37,ROW(Empresas!$B$6:$B$46)-5),ROW($A18)),COLUMN(AJ$1)),\"\")","v":""},{"$f":"IFERROR(INDEX(Empresas!$B$6:$AS$46,SMALL(IF(Empresas!$B$6:$B$46=Dados!$H$37,ROW(Empresas!$B$6:$B$46)-5),ROW($A18)),COLUMN(AK$1)),\"\")","v":""},{"$f":"IFERROR(INDEX(Empresas!$B$6:$AS$46,SMALL(IF(Empresas!$B$6:$B$46=Dados!$H$37,ROW(Empresas!$B$6:$B$46)-5),ROW($A18)),COLUMN(AL$1)),\"\")","v":""},{"$f":"IFERROR(INDEX(Empresas!$B$6:$AS$46,SMALL(IF(Empresas!$B$6:$B$46=Dados!$H$37,ROW(Empresas!$B$6:$B$46)-5),ROW($A18)),COLUMN(AM$1)),\"\")","v":""},{"$f":"IFERROR(INDEX(Empresas!$B$6:$AS$46,SMALL(IF(Empresas!$B$6:$B$46=Dados!$H$37,ROW(Empresas!$B$6:$B$46)-5),ROW($A18)),COLUMN(AN$1)),\"\")","v":""},{"$f":"IFERROR(INDEX(Empresas!$B$6:$AS$46,SMALL(IF(Empresas!$B$6:$B$46=Dados!$H$37,ROW(Empresas!$B$6:$B$46)-5),ROW($A18)),COLUMN(AO$1)),\"\")","v":""},{"$f":"IFERROR(INDEX(Empresas!$B$6:$AS$46,SMALL(IF(Empresas!$B$6:$B$46=Dados!$H$37,ROW(Empresas!$B$6:$B$46)-5),ROW($A18)),COLUMN(AP$1)),\"\")","v":""},{"$f":"IFERROR(INDEX(Empresas!$B$6:$AS$46,SMALL(IF(Empresas!$B$6:$B$46=Dados!$H$37,ROW(Empresas!$B$6:$B$46)-5),ROW($A18)),COLUMN(AQ$1)),\"\")","v":""},{"$f":"IFERROR(INDEX(Empresas!$B$6:$AS$46,SMALL(IF(Empresas!$B$6:$B$46=Dados!$H$37,ROW(Empresas!$B$6:$B$46)-5),ROW($A18)),COLUMN(AR$1)),\"\")","v":""}]
[null,{"$f":"IFERROR(INDEX(Empresas!$B$6:$AS$46,SMALL(IF(Empresas!$B$6:$B$46=Dados!$H$37,ROW(Empresas!$B$6:$B$46)-5),ROW($A19)),COLUMN(B$1)),\"\")","v":""},{"$f":"IFERROR(INDEX(Empresas!$B$6:$AS$46,SMALL(IF(Empresas!$B$6:$B$46=Dados!$H$37,ROW(Empresas!$B$6:$B$46)-5),ROW($A19)),COLUMN(C$1)),\"\")","v":""},"",{"$f":"IFERROR(INDEX(Empresas!$B$6:$AS$46,SMALL(IF(Empresas!$B$6:$B$46=Dados!$H$37,ROW(Empresas!$B$6:$B$46)-5),ROW($A19)),COLUMN(F$1)),\"\")","v":""},{"$f":"IFERROR(INDEX(Empresas!$B$6:$AS$46,SMALL(IF(Empresas!$B$6:$B$46=Dados!$H$37,ROW(Empresas!$B$6:$B$46)-5),ROW($A19)),COLUMN(G$1)),\"\")","v":""},{"$f":"IFERROR(INDEX(Empresas!$B$6:$AS$46,SMALL(IF(Empresas!$B$6:$B$46=Dados!$H$37,ROW(Empresas!$B$6:$B$46)-5),ROW($A19)),COLUMN(H$1)),\"\")","v":""},{"$f":"IFERROR(INDEX(Empresas!$B$6:$AS$46,SMALL(IF(Empresas!$B$6:$B$46=Dados!$H$37,ROW(Empresas!$B$6:$B$46)-5),ROW($A19)),COLUMN(I$1)),\"\")","v":""},{"$f":"IFERROR(INDEX(Empresas!$B$6:$AS$46,SMALL(IF(Empresas!$B$6:$B$46=Dados!$H$37,ROW(Empresas!$B$6:$B$46)-5),ROW($A19)),COLUMN(J$1)),\"\")","v":""},{"$f":"IFERROR(INDEX(Empresas!$B$6:$AS$46,SMALL(IF(Empresas!$B$6:$B$46=Dados!$H$37,ROW(Empresas!$B$6:$B$46)-5),ROW($A19)),COLUMN(K$1)),\"\")","v":""},{"$f":"IFERROR(INDEX(Empresas!$B$6:$AS$46,SMALL(IF(Empresas!$B$6:$B$46=Dados!$H$37,ROW(Empresas!$B$6:$B$46)-5),ROW($A19)),COLUMN(L$1)),\"\")","v":""},{"$f":"IFERROR(INDEX(Empresas!$B$6:$AS$46,SMALL(IF(Empresas!$B$6:$B$46=Dados!$H$37,ROW(Empresas!$B$6:$B$46)-5),ROW($A19)),COLUMN(M$1)),\"\")","v":""},{"$f":"IFERROR(INDEX(Empresas!$B$6:$AS$46,SMALL(IF(Empresas!$B$6:$B$46=Dados!$H$37,ROW(Empresas!$B$6:$B$46)-5),ROW($A19)),COLUMN(N$1)),\"\")","v":""},{"$f":"IFERROR(INDEX(Empresas!$B$6:$AS$46,SMALL(IF(Empresas!$B$6:$B$46=Dados!$H$37,ROW(Empresas!$B$6:$B$46)-5),ROW($A19)),COLUMN(O$1)),\"\")","v":""},{"$f":"IFERROR(INDEX(Empresas!$B$6:$AS$46,SMALL(IF(Empresas!$B$6:$B$46=Dados!$H$37,ROW(Empresas!$B$6:$B$46)-5),ROW($A19)),COLUMN(P$1)),\"\")","v":""},{"$f":"IFERROR(INDEX(Empresas!$B$6:$AS$46,SMALL(IF(Empresas!$B$6:$B$46=Dados!$H$37,ROW(Empresas!$B$6:$B$46)-5),ROW($A19)),COLUMN(Q$1)),\"\")","v":""},{"$f":"IFERROR(INDEX(Empresas!$B$6:$AS$46,SMALL(IF(Empresas!$B$6:$B$46=Dados!$H$37,ROW(Empresas!$B$6:$B$46)-5),ROW($A19)),COLUMN(R$1)),\"\")","v":""},{"$f":"IFERROR(INDEX(Empresas!$B$6:$AS$46,SMALL(IF(Empresas!$B$6:$B$46=Dados!$H$37,ROW(Empresas!$B$6:$B$46)-5),ROW($A19)),COLUMN(S$1)),\"\")","v":""},{"$f":"IFERROR(INDEX(Empresas!$B$6:$AS$46,SMALL(IF(Empresas!$B$6:$B$46=Dados!$H$37,ROW(Empresas!$B$6:$B$46)-5),ROW($A19)),COLUMN(T$1)),\"\")","v":""},{"$f":"IFERROR(INDEX(Empresas!$B$6:$AS$46,SMALL(IF(Empresas!$B$6:$B$46=Dados!$H$37,ROW(Empresas!$B$6:$B$46)-5),ROW($A19)),COLUMN(U$1)),\"\")","v":""},{"$f":"IFERROR(INDEX(Empresas!$B$6:$AS$46,SMALL(IF(Empresas!$B$6:$B$46=Dados!$H$37,ROW(Empresas!$B$6:$B$46)-5),ROW($A19)),COLUMN(V$1)),\"\")","v":""},{"$f":"IFERROR(INDEX(Empresas!$B$6:$AS$46,SMALL(IF(Empresas!$B$6:$B$46=Dados!$H$37,ROW(Empresas!$B$6:$B$46)-5),ROW($A19)),COLUMN(W$1)),\"\")","v":""},{"$f":"IFERROR(INDEX(Empresas!$B$6:$AS$46,SMALL(IF(Empresas!$B$6:$B$46=Dados!$H$37,ROW(Empresas!$B$6:$B$46)-5),ROW($A19)),COLUMN(X$1)),\"\")","v":""},{"$f":"IFERROR(INDEX(Empresas!$B$6:$AS$46,SMALL(IF(Empresas!$B$6:$B$46=Dados!$H$37,ROW(Empresas!$B$6:$B$46)-5),ROW($A19)),COLUMN(Y$1)),\"\")","v":""},{"$f":"IFERROR(INDEX(Empresas!$B$6:$AS$46,SMALL(IF(Empresas!$B$6:$B$46=Dados!$H$37,ROW(Empresas!$B$6:$B$46)-5),ROW($A19)),COLUMN(Z$1)),\"\")","v":""},{"$f":"IFERROR(INDEX(Empresas!$B$6:$AS$46,SMALL(IF(Empresas!$B$6:$B$46=Dados!$H$37,ROW(Empresas!$B$6:$B$46)-5),ROW($A19)),COLUMN(AA$1)),\"\")","v":""},{"$f":"IFERROR(INDEX(Empresas!$B$6:$AS$46,SMALL(IF(Empresas!$B$6:$B$46=Dados!$H$37,ROW(Empresas!$B$6:$B$46)-5),ROW($A19)),COLUMN(AB$1)),\"\")","v":""},{"$f":"IFERROR(INDEX(Empresas!$B$6:$AS$46,SMALL(IF(Empresas!$B$6:$B$46=Dados!$H$37,ROW(Empresas!$B$6:$B$46)-5),ROW($A19)),COLUMN(AC$1)),\"\")","v":""},{"$f":"IFERROR(INDEX(Empresas!$B$6:$AS$46,SMALL(IF(Empresas!$B$6:$B$46=Dados!$H$37,ROW(Empresas!$B$6:$B$46)-5),ROW($A19)),COLUMN(AD$1)),\"\")","v":""},{"$f":"IFERROR(INDEX(Empresas!$B$6:$AS$46,SMALL(IF(Empresas!$B$6:$B$46=Dados!$H$37,ROW(Empresas!$B$6:$B$46)-5),ROW($A19)),COLUMN(AE$1)),\"\")","v":""},{"$f":"IFERROR(INDEX(Empresas!$B$6:$AS$46,SMALL(IF(Empresas!$B$6:$B$46=Dados!$H$37,ROW(Empresas!$B$6:$B$46)-5),ROW($A19)),COLUMN(AF$1)),\"\")","v":""},{"$f":"IFERROR(INDEX(Empresas!$B$6:$AS$46,SMALL(IF(Empresas!$B$6:$B$46=Dados!$H$37,ROW(Empresas!$B$6:$B$46)-5),ROW($A19)),COLUMN(AG$1)),\"\")","v":""},{"$f":"IFERROR(INDEX(Empresas!$B$6:$AS$46,SMALL(IF(Empresas!$B$6:$B$46=Dados!$H$37,ROW(Empresas!$B$6:$B$46)-5),ROW($A19)),COLUMN(AH$1)),\"\")","v":""},{"$f":"IFERROR(INDEX(Empresas!$B$6:$AS$46,SMALL(IF(Empresas!$B$6:$B$46=Dados!$H$37,ROW(Empresas!$B$6:$B$46)-5),ROW($A19)),COLUMN(AI$1)),\"\")","v":""},{"$f":"IFERROR(INDEX(Empresas!$B$6:$AS$46,SMALL(IF(Empresas!$B$6:$B$46=Dados!$H$37,ROW(Empresas!$B$6:$B$46)-5),ROW($A19)),COLUMN(AJ$1)),\"\")","v":""},{"$f":"IFERROR(INDEX(Empresas!$B$6:$AS$46,SMALL(IF(Empresas!$B$6:$B$46=Dados!$H$37,ROW(Empresas!$B$6:$B$46)-5),ROW($A19)),COLUMN(AK$1)),\"\")","v":""},{"$f":"IFERROR(INDEX(Empresas!$B$6:$AS$46,SMALL(IF(Empresas!$B$6:$B$46=Dados!$H$37,ROW(Empresas!$B$6:$B$46)-5),ROW($A19)),COLUMN(AL$1)),\"\")","v":""},{"$f":"IFERROR(INDEX(Empresas!$B$6:$AS$46,SMALL(IF(Empresas!$B$6:$B$46=Dados!$H$37,ROW(Empresas!$B$6:$B$46)-5),ROW($A19)),COLUMN(AM$1)),\"\")","v":""},{"$f":"IFERROR(INDEX(Empresas!$B$6:$AS$46,SMALL(IF(Empresas!$B$6:$B$46=Dados!$H$37,ROW(Empresas!$B$6:$B$46)-5),ROW($A19)),COLUMN(AN$1)),\"\")","v":""},{"$f":"IFERROR(INDEX(Empresas!$B$6:$AS$46,SMALL(IF(Empresas!$B$6:$B$46=Dados!$H$37,ROW(Empresas!$B$6:$B$46)-5),ROW($A19)),COLUMN(AO$1)),\"\")","v":""},{"$f":"IFERROR(INDEX(Empresas!$B$6:$AS$46,SMALL(IF(Empresas!$B$6:$B$46=Dados!$H$37,ROW(Empresas!$B$6:$B$46)-5),ROW($A19)),COLUMN(AP$1)),\"\")","v":""},{"$f":"IFERROR(INDEX(Empresas!$B$6:$AS$46,SMALL(IF(Empresas!$B$6:$B$46=Dados!$H$37,ROW(Empresas!$B$6:$B$46)-5),ROW($A19)),COLUMN(AQ$1)),\"\")","v":""},{"$f":"IFERROR(INDEX(Empresas!$B$6:$AS$46,SMALL(IF(Empresas!$B$6:$B$46=Dados!$H$37,ROW(Empresas!$B$6:$B$46)-5),ROW($A19)),COLUMN(AR$1)),\"\")","v":""}]
[null,{"$f":"IFERROR(INDEX(Empresas!$B$6:$AS$46,SMALL(IF(Empresas!$B$6:$B$46=Dados!$H$37,ROW(Empresas!$B$6:$B$46)-5),ROW($A20)),COLUMN(B$1)),\"\")","v":""},{"$f":"IFERROR(INDEX(Empresas!$B$6:$AS$46,SMALL(IF(Empresas!$B$6:$B$46=Dados!$H$37,ROW(Empresas!$B$6:$B$46)-5),ROW($A20)),COLUMN(C$1)),\"\")","v":""},"",{"$f":"IFERROR(INDEX(Empresas!$B$6:$AS$46,SMALL(IF(Empresas!$B$6:$B$46=Dados!$H$37,ROW(Empresas!$B$6:$B$46)-5),ROW($A20)),COLUMN(F$1)),\"\")","v":""},{"$f":"IFERROR(INDEX(Empresas!$B$6:$AS$46,SMALL(IF(Empresas!$B$6:$B$46=Dados!$H$37,ROW(Empresas!$B$6:$B$46)-5),ROW($A20)),COLUMN(G$1)),\"\")","v":""},{"$f":"IFERROR(INDEX(Empresas!$B$6:$AS$46,SMALL(IF(Empresas!$B$6:$B$46=Dados!$H$37,ROW(Empresas!$B$6:$B$46)-5),ROW($A20)),COLUMN(H$1)),\"\")","v":""},{"$f":"IFERROR(INDEX(Empresas!$B$6:$AS$46,SMALL(IF(Empresas!$B$6:$B$46=Dados!$H$37,ROW(Empresas!$B$6:$B$46)-5),ROW($A20)),COLUMN(I$1)),\"\")","v":""},{"$f":"IFERROR(INDEX(Empresas!$B$6:$AS$46,SMALL(IF(Empresas!$B$6:$B$46=Dados!$H$37,ROW(Empresas!$B$6:$B$46)-5),ROW($A20)),COLUMN(J$1)),\"\")","v":""},{"$f":"IFERROR(INDEX(Empresas!$B$6:$AS$46,SMALL(IF(Empresas!$B$6:$B$46=Dados!$H$37,ROW(Empresas!$B$6:$B$46)-5),ROW($A20)),COLUMN(K$1)),\"\")","v":""},{"$f":"IFERROR(INDEX(Empresas!$B$6:$AS$46,SMALL(IF(Empresas!$B$6:$B$46=Dados!$H$37,ROW(Empresas!$B$6:$B$46)-5),ROW($A20)),COLUMN(L$1)),\"\")","v":""},{"$f":"IFERROR(INDEX(Empresas!$B$6:$AS$46,SMALL(IF(Empresas!$B$6:$B$46=Dados!$H$37,ROW(Empresas!$B$6:$B$46)-5),ROW($A20)),COLUMN(M$1)),\"\")","v":""},{"$f":"IFERROR(INDEX(Empresas!$B$6:$AS$46,SMALL(IF(Empresas!$B$6:$B$46=Dados!$H$37,ROW(Empresas!$B$6:$B$46)-5),ROW($A20)),COLUMN(N$1)),\"\")","v":""},{"$f":"IFERROR(INDEX(Empresas!$B$6:$AS$46,SMALL(IF(Empresas!$B$6:$B$46=Dados!$H$37,ROW(Empresas!$B$6:$B$46)-5),ROW($A20)),COLUMN(O$1)),\"\")","v":""},{"$f":"IFERROR(INDEX(Empresas!$B$6:$AS$46,SMALL(IF(Empresas!$B$6:$B$46=Dados!$H$37,ROW(Empresas!$B$6:$B$46)-5),ROW($A20)),COLUMN(P$1)),\"\")","v":""},{"$f":"IFERROR(INDEX(Empresas!$B$6:$AS$46,SMALL(IF(Empresas!$B$6:$B$46=Dados!$H$37,ROW(Empresas!$B$6:$B$46)-5),ROW($A20)),COLUMN(Q$1)),\"\")","v":""},{"$f":"IFERROR(INDEX(Empresas!$B$6:$AS$46,SMALL(IF(Empresas!$B$6:$B$46=Dados!$H$37,ROW(Empresas!$B$6:$B$46)-5),ROW($A20)),COLUMN(R$1)),\"\")","v":""},{"$f":"IFERROR(INDEX(Empresas!$B$6:$AS$46,SMALL(IF(Empresas!$B$6:$B$46=Dados!$H$37,ROW(Empresas!$B$6:$B$46)-5),ROW($A20)),COLUMN(S$1)),\"\")","v":""},{"$f":"IFERROR(INDEX(Empresas!$B$6:$AS$46,SMALL(IF(Empresas!$B$6:$B$46=Dados!$H$37,ROW(Empresas!$B$6:$B$46)-5),ROW($A20)),COLUMN(T$1)),\"\")","v":""},{"$f":"IFERROR(INDEX(Empresas!$B$6:$AS$46,SMALL(IF(Empresas!$B$6:$B$46=Dados!$H$37,ROW(Empresas!$B$6:$B$46)-5),ROW($A20)),COLUMN(U$1)),\"\")","v":""},{"$f":"IFERROR(INDEX(Empresas!$B$6:$AS$46,SMALL(IF(Empresas!$B$6:$B$46=Dados!$H$37,ROW(Empresas!$B$6:$B$46)-5),ROW($A20)),COLUMN(V$1)),\"\")","v":""},{"$f":"IFERROR(INDEX(Empresas!$B$6:$AS$46,SMALL(IF(Empresas!$B$6:$B$46=Dados!$H$37,ROW(Empresas!$B$6:$B$46)-5),ROW($A20)),COLUMN(W$1)),\"\")","v":""},{"$f":"IFERROR(INDEX(Empresas!$B$6:$AS$46,SMALL(IF(Empresas!$B$6:$B$46=Dados!$H$37,ROW(Empresas!$B$6:$B$46)-5),ROW($A20)),COLUMN(X$1)),\"\")","v":""},{"$f":"IFERROR(INDEX(Empresas!$B$6:$AS$46,SMALL(IF(Empresas!$B$6:$B$46=Dados!$H$37,ROW(Empresas!$B$6:$B$46)-5),ROW($A20)),COLUMN(Y$1)),\"\")","v":""},{"$f":"IFERROR(INDEX(Empresas!$B$6:$AS$46,SMALL(IF(Empresas!$B$6:$B$46=Dados!$H$37,ROW(Empresas!$B$6:$B$46)-5),ROW($A20)),COLUMN(Z$1)),\"\")","v":""},{"$f":"IFERROR(INDEX(Empresas!$B$6:$AS$46,SMALL(IF(Empresas!$B$6:$B$46=Dados!$H$37,ROW(Empresas!$B$6:$B$46)-5),ROW($A20)),COLUMN(AA$1)),\"\")","v":""},{"$f":"IFERROR(INDEX(Empresas!$B$6:$AS$46,SMALL(IF(Empresas!$B$6:$B$46=Dados!$H$37,ROW(Empresas!$B$6:$B$46)-5),ROW($A20)),COLUMN(AB$1)),\"\")","v":""},{"$f":"IFERROR(INDEX(Empresas!$B$6:$AS$46,SMALL(IF(Empresas!$B$6:$B$46=Dados!$H$37,ROW(Empresas!$B$6:$B$46)-5),ROW($A20)),COLUMN(AC$1)),\"\")","v":""},{"$f":"IFERROR(INDEX(Empresas!$B$6:$AS$46,SMALL(IF(Empresas!$B$6:$B$46=Dados!$H$37,ROW(Empresas!$B$6:$B$46)-5),ROW($A20)),COLUMN(AD$1)),\"\")","v":""},{"$f":"IFERROR(INDEX(Empresas!$B$6:$AS$46,SMALL(IF(Empresas!$B$6:$B$46=Dados!$H$37,ROW(Empresas!$B$6:$B$46)-5),ROW($A20)),COLUMN(AE$1)),\"\")","v":""},{"$f":"IFERROR(INDEX(Empresas!$B$6:$AS$46,SMALL(IF(Empresas!$B$6:$B$46=Dados!$H$37,ROW(Empresas!$B$6:$B$46)-5),ROW($A20)),COLUMN(AF$1)),\"\")","v":""},{"$f":"IFERROR(INDEX(Empresas!$B$6:$AS$46,SMALL(IF(Empresas!$B$6:$B$46=Dados!$H$37,ROW(Empresas!$B$6:$B$46)-5),ROW($A20)),COLUMN(AG$1)),\"\")","v":""},{"$f":"IFERROR(INDEX(Empresas!$B$6:$AS$46,SMALL(IF(Empresas!$B$6:$B$46=Dados!$H$37,ROW(Empresas!$B$6:$B$46)-5),ROW($A20)),COLUMN(AH$1)),\"\")","v":""},{"$f":"IFERROR(INDEX(Empresas!$B$6:$AS$46,SMALL(IF(Empresas!$B$6:$B$46=Dados!$H$37,ROW(Empresas!$B$6:$B$46)-5),ROW($A20)),COLUMN(AI$1)),\"\")","v":""},{"$f":"IFERROR(INDEX(Empresas!$B$6:$AS$46,SMALL(IF(Empresas!$B$6:$B$46=Dados!$H$37,ROW(Empresas!$B$6:$B$46)-5),ROW($A20)),COLUMN(AJ$1)),\"\")","v":""},{"$f":"IFERROR(INDEX(Empresas!$B$6:$AS$46,SMALL(IF(Empresas!$B$6:$B$46=Dados!$H$37,ROW(Empresas!$B$6:$B$46)-5),ROW($A20)),COLUMN(AK$1)),\"\")","v":""},{"$f":"IFERROR(INDEX(Empresas!$B$6:$AS$46,SMALL(IF(Empresas!$B$6:$B$46=Dados!$H$37,ROW(Empresas!$B$6:$B$46)-5),ROW($A20)),COLUMN(AL$1)),\"\")","v":""},{"$f":"IFERROR(INDEX(Empresas!$B$6:$AS$46,SMALL(IF(Empresas!$B$6:$B$46=Dados!$H$37,ROW(Empresas!$B$6:$B$46)-5),ROW($A20)),COLUMN(AM$1)),\"\")","v":""},{"$f":"IFERROR(INDEX(Empresas!$B$6:$AS$46,SMALL(IF(Empresas!$B$6:$B$46=Dados!$H$37,ROW(Empresas!$B$6:$B$46)-5),ROW($A20)),COLUMN(AN$1)),\"\")","v":""},{"$f":"IFERROR(INDEX(Empresas!$B$6:$AS$46,SMALL(IF(Empresas!$B$6:$B$46=Dados!$H$37,ROW(Empresas!$B$6:$B$46)-5),ROW($A20)),COLUMN(AO$1)),\"\")","v":""},{"$f":"IFERROR(INDEX(Empresas!$B$6:$AS$46,SMALL(IF(Empresas!$B$6:$B$46=Dados!$H$37,ROW(Empresas!$B$6:$B$46)-5),ROW($A20)),COLUMN(AP$1)),\"\")","v":""},{"$f":"IFERROR(INDEX(Empresas!$B$6:$AS$46,SMALL(IF(Empresas!$B$6:$B$46=Dados!$H$37,ROW(Empresas!$B$6:$B$46)-5),ROW($A20)),COLUMN(AQ$1)),\"\")","v":""},{"$f":"IFERROR(INDEX(Empresas!$B$6:$AS$46,SMALL(IF(Empresas!$B$6:$B$46=Dados!$H$37,ROW(Empresas!$B$6:$B$46)-5),ROW($A20)),COLUMN(AR$1)),\"\")","v":""}]
[null,{"$f":"IFERROR(INDEX(Empresas!$B$6:$AS$46,SMALL(IF(Empresas!$B$6:$B$46=Dados!$H$37,ROW(Empresas!$B$6:$B$46)-5),ROW($A21)),COLUMN(B$1)),\"\")","v":""},{"$f":"IFERROR(INDEX(Empresas!$B$6:$AS$46,SMALL(IF(Empresas!$B$6:$B$46=Dados!$H$37,ROW(Empresas!$B$6:$B$46)-5),ROW($A21)),COLUMN(C$1)),\"\")","v":""},"",{"$f":"IFERROR(INDEX(Empresas!$B$6:$AS$46,SMALL(IF(Empresas!$B$6:$B$46=Dados!$H$37,ROW(Empresas!$B$6:$B$46)-5),ROW($A21)),COLUMN(F$1)),\"\")","v":""},{"$f":"IFERROR(INDEX(Empresas!$B$6:$AS$46,SMALL(IF(Empresas!$B$6:$B$46=Dados!$H$37,ROW(Empresas!$B$6:$B$46)-5),ROW($A21)),COLUMN(G$1)),\"\")","v":""},{"$f":"IFERROR(INDEX(Empresas!$B$6:$AS$46,SMALL(IF(Empresas!$B$6:$B$46=Dados!$H$37,ROW(Empresas!$B$6:$B$46)-5),ROW($A21)),COLUMN(H$1)),\"\")","v":""},{"$f":"IFERROR(INDEX(Empresas!$B$6:$AS$46,SMALL(IF(Empresas!$B$6:$B$46=Dados!$H$37,ROW(Empresas!$B$6:$B$46)-5),ROW($A21)),COLUMN(I$1)),\"\")","v":""},{"$f":"IFERROR(INDEX(Empresas!$B$6:$AS$46,SMALL(IF(Empresas!$B$6:$B$46=Dados!$H$37,ROW(Empresas!$B$6:$B$46)-5),ROW($A21)),COLUMN(J$1)),\"\")","v":""},{"$f":"IFERROR(INDEX(Empresas!$B$6:$AS$46,SMALL(IF(Empresas!$B$6:$B$46=Dados!$H$37,ROW(Empresas!$B$6:$B$46)-5),ROW($A21)),COLUMN(K$1)),\"\")","v":""},{"$f":"IFERROR(INDEX(Empresas!$B$6:$AS$46,SMALL(IF(Empresas!$B$6:$B$46=Dados!$H$37,ROW(Empresas!$B$6:$B$46)-5),ROW($A21)),COLUMN(L$1)),\"\")","v":""},{"$f":"IFERROR(INDEX(Empresas!$B$6:$AS$46,SMALL(IF(Empresas!$B$6:$B$46=Dados!$H$37,ROW(Empresas!$B$6:$B$46)-5),ROW($A21)),COLUMN(M$1)),\"\")","v":""},{"$f":"IFERROR(INDEX(Empresas!$B$6:$AS$46,SMALL(IF(Empresas!$B$6:$B$46=Dados!$H$37,ROW(Empresas!$B$6:$B$46)-5),ROW($A21)),COLUMN(N$1)),\"\")","v":""},{"$f":"IFERROR(INDEX(Empresas!$B$6:$AS$46,SMALL(IF(Empresas!$B$6:$B$46=Dados!$H$37,ROW(Empresas!$B$6:$B$46)-5),ROW($A21)),COLUMN(O$1)),\"\")","v":""},{"$f":"IFERROR(INDEX(Empresas!$B$6:$AS$46,SMALL(IF(Empresas!$B$6:$B$46=Dados!$H$37,ROW(Empresas!$B$6:$B$46)-5),ROW($A21)),COLUMN(P$1)),\"\")","v":""},{"$f":"IFERROR(INDEX(Empresas!$B$6:$AS$46,SMALL(IF(Empresas!$B$6:$B$46=Dados!$H$37,ROW(Empresas!$B$6:$B$46)-5),ROW($A21)),COLUMN(Q$1)),\"\")","v":""},{"$f":"IFERROR(INDEX(Empresas!$B$6:$AS$46,SMALL(IF(Empresas!$B$6:$B$46=Dados!$H$37,ROW(Empresas!$B$6:$B$46)-5),ROW($A21)),COLUMN(R$1)),\"\")","v":""},{"$f":"IFERROR(INDEX(Empresas!$B$6:$AS$46,SMALL(IF(Empresas!$B$6:$B$46=Dados!$H$37,ROW(Empresas!$B$6:$B$46)-5),ROW($A21)),COLUMN(S$1)),\"\")","v":""},{"$f":"IFERROR(INDEX(Empresas!$B$6:$AS$46,SMALL(IF(Empresas!$B$6:$B$46=Dados!$H$37,ROW(Empresas!$B$6:$B$46)-5),ROW($A21)),COLUMN(T$1)),\"\")","v":""},{"$f":"IFERROR(INDEX(Empresas!$B$6:$AS$46,SMALL(IF(Empresas!$B$6:$B$46=Dados!$H$37,ROW(Empresas!$B$6:$B$46)-5),ROW($A21)),COLUMN(U$1)),\"\")","v":""},{"$f":"IFERROR(INDEX(Empresas!$B$6:$AS$46,SMALL(IF(Empresas!$B$6:$B$46=Dados!$H$37,ROW(Empresas!$B$6:$B$46)-5),ROW($A21)),COLUMN(V$1)),\"\")","v":""},{"$f":"IFERROR(INDEX(Empresas!$B$6:$AS$46,SMALL(IF(Empresas!$B$6:$B$46=Dados!$H$37,ROW(Empresas!$B$6:$B$46)-5),ROW($A21)),COLUMN(W$1)),\"\")","v":""},{"$f":"IFERROR(INDEX(Empresas!$B$6:$AS$46,SMALL(IF(Empresas!$B$6:$B$46=Dados!$H$37,ROW(Empresas!$B$6:$B$46)-5),ROW($A21)),COLUMN(X$1)),\"\")","v":""},{"$f":"IFERROR(INDEX(Empresas!$B$6:$AS$46,SMALL(IF(Empresas!$B$6:$B$46=Dados!$H$37,ROW(Empresas!$B$6:$B$46)-5),ROW($A21)),COLUMN(Y$1)),\"\")","v":""},{"$f":"IFERROR(INDEX(Empresas!$B$6:$AS$46,SMALL(IF(Empresas!$B$6:$B$46=Dados!$H$37,ROW(Empresas!$B$6:$B$46)-5),ROW($A21)),COLUMN(Z$1)),\"\")","v":""},{"$f":"IFERROR(INDEX(Empresas!$B$6:$AS$46,SMALL(IF(Empresas!$B$6:$B$46=Dados!$H$37,ROW(Empresas!$B$6:$B$46)-5),ROW($A21)),COLUMN(AA$1)),\"\")","v":""},{"$f":"IFERROR(INDEX(Empresas!$B$6:$AS$46,SMALL(IF(Empresas!$B$6:$B$46=Dados!$H$37,ROW(Empresas!$B$6:$B$46)-5),ROW($A21)),COLUMN(AB$1)),\"\")","v":""},{"$f":"IFERROR(INDEX(Empresas!$B$6:$AS$46,SMALL(IF(Empresas!$B$6:$B$46=Dados!$H$37,ROW(Empresas!$B$6:$B$46)-5),ROW($A21)),COLUMN(AC$1)),\"\")","v":""},{"$f":"IFERROR(INDEX(Empresas!$B$6:$AS$46,SMALL(IF(Empresas!$B$6:$B$46=Dados!$H$37,ROW(Empresas!$B$6:$B$46)-5),ROW($A21)),COLUMN(AD$1)),\"\")","v":""},{"$f":"IFERROR(INDEX(Empresas!$B$6:$AS$46,SMALL(IF(Empresas!$B$6:$B$46=Dados!$H$37,ROW(Empresas!$B$6:$B$46)-5),ROW($A21)),COLUMN(AE$1)),\"\")","v":""},{"$f":"IFERROR(INDEX(Empresas!$B$6:$AS$46,SMALL(IF(Empresas!$B$6:$B$46=Dados!$H$37,ROW(Empresas!$B$6:$B$46)-5),ROW($A21)),COLUMN(AF$1)),\"\")","v":""},{"$f":"IFERROR(INDEX(Empresas!$B$6:$AS$46,SMALL(IF(Empresas!$B$6:$B$46=Dados!$H$37,ROW(Empresas!$B$6:$B$46)-5),ROW($A21)),COLUMN(AG$1)),\"\")","v":""},{"$f":"IFERROR(INDEX(Empresas!$B$6:$AS$46,SMALL(IF(Empresas!$B$6:$B$46=Dados!$H$37,ROW(Empresas!$B$6:$B$46)-5),ROW($A21)),COLUMN(AH$1)),\"\")","v":""},{"$f":"IFERROR(INDEX(Empresas!$B$6:$AS$46,SMALL(IF(Empresas!$B$6:$B$46=Dados!$H$37,ROW(Empresas!$B$6:$B$46)-5),ROW($A21)),COLUMN(AI$1)),\"\")","v":""},{"$f":"IFERROR(INDEX(Empresas!$B$6:$AS$46,SMALL(IF(Empresas!$B$6:$B$46=Dados!$H$37,ROW(Empresas!$B$6:$B$46)-5),ROW($A21)),COLUMN(AJ$1)),\"\")","v":""},{"$f":"IFERROR(INDEX(Empresas!$B$6:$AS$46,SMALL(IF(Empresas!$B$6:$B$46=Dados!$H$37,ROW(Empresas!$B$6:$B$46)-5),ROW($A21)),COLUMN(AK$1)),\"\")","v":""},{"$f":"IFERROR(INDEX(Empresas!$B$6:$AS$46,SMALL(IF(Empresas!$B$6:$B$46=Dados!$H$37,ROW(Empresas!$B$6:$B$46)-5),ROW($A21)),COLUMN(AL$1)),\"\")","v":""},{"$f":"IFERROR(INDEX(Empresas!$B$6:$AS$46,SMALL(IF(Empresas!$B$6:$B$46=Dados!$H$37,ROW(Empresas!$B$6:$B$46)-5),ROW($A21)),COLUMN(AM$1)),\"\")","v":""},{"$f":"IFERROR(INDEX(Empresas!$B$6:$AS$46,SMALL(IF(Empresas!$B$6:$B$46=Dados!$H$37,ROW(Empresas!$B$6:$B$46)-5),ROW($A21)),COLUMN(AN$1)),\"\")","v":""},{"$f":"IFERROR(INDEX(Empresas!$B$6:$AS$46,SMALL(IF(Empresas!$B$6:$B$46=Dados!$H$37,ROW(Empresas!$B$6:$B$46)-5),ROW($A21)),COLUMN(AO$1)),\"\")","v":""},{"$f":"IFERROR(INDEX(Empresas!$B$6:$AS$46,SMALL(IF(Empresas!$B$6:$B$46=Dados!$H$37,ROW(Empresas!$B$6:$B$46)-5),ROW($A21)),COLUMN(AP$1)),\"\")","v":""},{"$f":"IFERROR(INDEX(Empresas!$B$6:$AS$46,SMALL(IF(Empresas!$B$6:$B$46=Dados!$H$37,ROW(Empresas!$B$6:$B$46)-5),ROW($A21)),COLUMN(AQ$1)),\"\")","v":""},{"$f":"IFERROR(INDEX(Empresas!$B$6:$AS$46,SMALL(IF(Empresas!$B$6:$B$46=Dados!$H$37,ROW(Empresas!$B$6:$B$46)-5),ROW($A21)),COLUMN(AR$1)),\"\")","v":""}]
[null,{"$f":"IFERROR(INDEX(Empresas!$B$6:$AS$46,SMALL(IF(Empresas!$B$6:$B$46=Dados!$H$37,ROW(Empresas!$B$6:$B$46)-5),ROW($A22)),COLUMN(B$1)),\"\")","v":""},{"$f":"IFERROR(INDEX(Empresas!$B$6:$AS$46,SMALL(IF(Empresas!$B$6:$B$46=Dados!$H$37,ROW(Empresas!$B$6:$B$46)-5),ROW($A22)),COLUMN(C$1)),\"\")","v":""},"",{"$f":"IFERROR(INDEX(Empresas!$B$6:$AS$46,SMALL(IF(Empresas!$B$6:$B$46=Dados!$H$37,ROW(Empresas!$B$6:$B$46)-5),ROW($A22)),COLUMN(F$1)),\"\")","v":""},{"$f":"IFERROR(INDEX(Empresas!$B$6:$AS$46,SMALL(IF(Empresas!$B$6:$B$46=Dados!$H$37,ROW(Empresas!$B$6:$B$46)-5),ROW($A22)),COLUMN(G$1)),\"\")","v":""},{"$f":"IFERROR(INDEX(Empresas!$B$6:$AS$46,SMALL(IF(Empresas!$B$6:$B$46=Dados!$H$37,ROW(Empresas!$B$6:$B$46)-5),ROW($A22)),COLUMN(H$1)),\"\")","v":""},{"$f":"IFERROR(INDEX(Empresas!$B$6:$AS$46,SMALL(IF(Empresas!$B$6:$B$46=Dados!$H$37,ROW(Empresas!$B$6:$B$46)-5),ROW($A22)),COLUMN(I$1)),\"\")","v":""},{"$f":"IFERROR(INDEX(Empresas!$B$6:$AS$46,SMALL(IF(Empresas!$B$6:$B$46=Dados!$H$37,ROW(Empresas!$B$6:$B$46)-5),ROW($A22)),COLUMN(J$1)),\"\")","v":""},{"$f":"IFERROR(INDEX(Empresas!$B$6:$AS$46,SMALL(IF(Empresas!$B$6:$B$46=Dados!$H$37,ROW(Empresas!$B$6:$B$46)-5),ROW($A22)),COLUMN(K$1)),\"\")","v":""},{"$f":"IFERROR(INDEX(Empresas!$B$6:$AS$46,SMALL(IF(Empresas!$B$6:$B$46=Dados!$H$37,ROW(Empresas!$B$6:$B$46)-5),ROW($A22)),COLUMN(L$1)),\"\")","v":""},{"$f":"IFERROR(INDEX(Empresas!$B$6:$AS$46,SMALL(IF(Empresas!$B$6:$B$46=Dados!$H$37,ROW(Empresas!$B$6:$B$46)-5),ROW($A22)),COLUMN(M$1)),\"\")","v":""},{"$f":"IFERROR(INDEX(Empresas!$B$6:$AS$46,SMALL(IF(Empresas!$B$6:$B$46=Dados!$H$37,ROW(Empresas!$B$6:$B$46)-5),ROW($A22)),COLUMN(N$1)),\"\")","v":""},{"$f":"IFERROR(INDEX(Empresas!$B$6:$AS$46,SMALL(IF(Empresas!$B$6:$B$46=Dados!$H$37,ROW(Empresas!$B$6:$B$46)-5),ROW($A22)),COLUMN(O$1)),\"\")","v":""},{"$f":"IFERROR(INDEX(Empresas!$B$6:$AS$46,SMALL(IF(Empresas!$B$6:$B$46=Dados!$H$37,ROW(Empresas!$B$6:$B$46)-5),ROW($A22)),COLUMN(P$1)),\"\")","v":""},{"$f":"IFERROR(INDEX(Empresas!$B$6:$AS$46,SMALL(IF(Empresas!$B$6:$B$46=Dados!$H$37,ROW(Empresas!$B$6:$B$46)-5),ROW($A22)),COLUMN(Q$1)),\"\")","v":""},{"$f":"IFERROR(INDEX(Empresas!$B$6:$AS$46,SMALL(IF(Empresas!$B$6:$B$46=Dados!$H$37,ROW(Empresas!$B$6:$B$46)-5),ROW($A22)),COLUMN(R$1)),\"\")","v":""},{"$f":"IFERROR(INDEX(Empresas!$B$6:$AS$46,SMALL(IF(Empresas!$B$6:$B$46=Dados!$H$37,ROW(Empresas!$B$6:$B$46)-5),ROW($A22)),COLUMN(S$1)),\"\")","v":""},{"$f":"IFERROR(INDEX(Empresas!$B$6:$AS$46,SMALL(IF(Empresas!$B$6:$B$46=Dados!$H$37,ROW(Empresas!$B$6:$B$46)-5),ROW($A22)),COLUMN(T$1)),\"\")","v":""},{"$f":"IFERROR(INDEX(Empresas!$B$6:$AS$46,SMALL(IF(Empresas!$B$6:$B$46=Dados!$H$37,ROW(Empresas!$B$6:$B$46)-5),ROW($A22)),COLUMN(U$1)),\"\")","v":""},{"$f":"IFERROR(INDEX(Empresas!$B$6:$AS$46,SMALL(IF(Empresas!$B$6:$B$46=Dados!$H$37,ROW(Empresas!$B$6:$B$46)-5),ROW($A22)),COLUMN(V$1)),\"\")","v":""},{"$f":"IFERROR(INDEX(Empresas!$B$6:$AS$46,SMALL(IF(Empresas!$B$6:$B$46=Dados!$H$37,ROW(Empresas!$B$6:$B$46)-5),ROW($A22)),COLUMN(W$1)),\"\")","v":""},{"$f":"IFERROR(INDEX(Empresas!$B$6:$AS$46,SMALL(IF(Empresas!$B$6:$B$46=Dados!$H$37,ROW(Empresas!$B$6:$B$46)-5),ROW($A22)),COLUMN(X$1)),\"\")","v":""},{"$f":"IFERROR(INDEX(Empresas!$B$6:$AS$46,SMALL(IF(Empresas!$B$6:$B$46=Dados!$H$37,ROW(Empresas!$B$6:$B$46)-5),ROW($A22)),COLUMN(Y$1)),\"\")","v":""},{"$f":"IFERROR(INDEX(Empresas!$B$6:$AS$46,SMALL(IF(Empresas!$B$6:$B$46=Dados!$H$37,ROW(Empresas!$B$6:$B$46)-5),ROW($A22)),COLUMN(Z$1)),\"\")","v":""},{"$f":"IFERROR(INDEX(Empresas!$B$6:$AS$46,SMALL(IF(Empresas!$B$6:$B$46=Dados!$H$37,ROW(Empresas!$B$6:$B$46)-5),ROW($A22)),COLUMN(AA$1)),\"\")","v":""},{"$f":"IFERROR(INDEX(Empresas!$B$6:$AS$46,SMALL(IF(Empresas!$B$6:$B$46=Dados!$H$37,ROW(Empresas!$B$6:$B$46)-5),ROW($A22)),COLUMN(AB$1)),\"\")","v":""},{"$f":"IFERROR(INDEX(Empresas!$B$6:$AS$46,SMALL(IF(Empresas!$B$6:$B$46=Dados!$H$37,ROW(Empresas!$B$6:$B$46)-5),ROW($A22)),COLUMN(AC$1)),\"\")","v":""},{"$f":"IFERROR(INDEX(Empresas!$B$6:$AS$46,SMALL(IF(Empresas!$B$6:$B$46=Dados!$H$37,ROW(Empresas!$B$6:$B$46)-5),ROW($A22)),COLUMN(AD$1)),\"\")","v":""},{"$f":"IFERROR(INDEX(Empresas!$B$6:$AS$46,SMALL(IF(Empresas!$B$6:$B$46=Dados!$H$37,ROW(Empresas!$B$6:$B$46)-5),ROW($A22)),COLUMN(AE$1)),\"\")","v":""},{"$f":"IFERROR(INDEX(Empresas!$B$6:$AS$46,SMALL(IF(Empresas!$B$6:$B$46=Dados!$H$37,ROW(Empresas!$B$6:$B$46)-5),ROW($A22)),COLUMN(AF$1)),\"\")","v":""},{"$f":"IFERROR(INDEX(Empresas!$B$6:$AS$46,SMALL(IF(Empresas!$B$6:$B$46=Dados!$H$37,ROW(Empresas!$B$6:$B$46)-5),ROW($A22)),COLUMN(AG$1)),\"\")","v":""},{"$f":"IFERROR(INDEX(Empresas!$B$6:$AS$46,SMALL(IF(Empresas!$B$6:$B$46=Dados!$H$37,ROW(Empresas!$B$6:$B$46)-5),ROW($A22)),COLUMN(AH$1)),\"\")","v":""},{"$f":"IFERROR(INDEX(Empresas!$B$6:$AS$46,SMALL(IF(Empresas!$B$6:$B$46=Dados!$H$37,ROW(Empresas!$B$6:$B$46)-5),ROW($A22)),COLUMN(AI$1)),\"\")","v":""},{"$f":"IFERROR(INDEX(Empresas!$B$6:$AS$46,SMALL(IF(Empresas!$B$6:$B$46=Dados!$H$37,ROW(Empresas!$B$6:$B$46)-5),ROW($A22)),COLUMN(AJ$1)),\"\")","v":""},{"$f":"IFERROR(INDEX(Empresas!$B$6:$AS$46,SMALL(IF(Empresas!$B$6:$B$46=Dados!$H$37,ROW(Empresas!$B$6:$B$46)-5),ROW($A22)),COLUMN(AK$1)),\"\")","v":""},{"$f":"IFERROR(INDEX(Empresas!$B$6:$AS$46,SMALL(IF(Empresas!$B$6:$B$46=Dados!$H$37,ROW(Empresas!$B$6:$B$46)-5),ROW($A22)),COLUMN(AL$1)),\"\")","v":""},{"$f":"IFERROR(INDEX(Empresas!$B$6:$AS$46,SMALL(IF(Empresas!$B$6:$B$46=Dados!$H$37,ROW(Empresas!$B$6:$B$46)-5),ROW($A22)),COLUMN(AM$1)),\"\")","v":""},{"$f":"IFERROR(INDEX(Empresas!$B$6:$AS$46,SMALL(IF(Empresas!$B$6:$B$46=Dados!$H$37,ROW(Empresas!$B$6:$B$46)-5),ROW($A22)),COLUMN(AN$1)),\"\")","v":""},{"$f":"IFERROR(INDEX(Empresas!$B$6:$AS$46,SMALL(IF(Empresas!$B$6:$B$46=Dados!$H$37,ROW(Empresas!$B$6:$B$46)-5),ROW($A22)),COLUMN(AO$1)),\"\")","v":""},{"$f":"IFERROR(INDEX(Empresas!$B$6:$AS$46,SMALL(IF(Empresas!$B$6:$B$46=Dados!$H$37,ROW(Empresas!$B$6:$B$46)-5),ROW($A22)),COLUMN(AP$1)),\"\")","v":""},{"$f":"IFERROR(INDEX(Empresas!$B$6:$AS$46,SMALL(IF(Empresas!$B$6:$B$46=Dados!$H$37,ROW(Empresas!$B$6:$B$46)-5),ROW($A22)),COLUMN(AQ$1)),\"\")","v":""},{"$f":"IFERROR(INDEX(Empresas!$B$6:$AS$46,SMALL(IF(Empresas!$B$6:$B$46=Dados!$H$37,ROW(Empresas!$B$6:$B$46)-5),ROW($A22)),COLUMN(AR$1)),\"\")","v":""}]
[null,{"$f":"IFERROR(INDEX(Empresas!$B$6:$AS$46,SMALL(IF(Empresas!$B$6:$B$46=Dados!$H$37,ROW(Empresas!$B$6:$B$46)-5),ROW($A23)),COLUMN(B$1)),\"\")","v":""},{"$f":"IFERROR(INDEX(Empresas!$B$6:$AS$46,SMALL(IF(Empresas!$B$6:$B$46=Dados!$H$37,ROW(Empresas!$B$6:$B$46)-5),ROW($A23)),COLUMN(C$1)),\"\")","v":""},"",{"$f":"IFERROR(INDEX(Empresas!$B$6:$AS$46,SMALL(IF(Empresas!$B$6:$B$46=Dados!$H$37,ROW(Empresas!$B$6:$B$46)-5),ROW($A23)),COLUMN(F$1)),\"\")","v":""},{"$f":"IFERROR(INDEX(Empresas!$B$6:$AS$46,SMALL(IF(Empresas!$B$6:$B$46=Dados!$H$37,ROW(Empresas!$B$6:$B$46)-5),ROW($A23)),COLUMN(G$1)),\"\")","v":""},{"$f":"IFERROR(INDEX(Empresas!$B$6:$AS$46,SMALL(IF(Empresas!$B$6:$B$46=Dados!$H$37,ROW(Empresas!$B$6:$B$46)-5),ROW($A23)),COLUMN(H$1)),\"\")","v":""},{"$f":"IFERROR(INDEX(Empresas!$B$6:$AS$46,SMALL(IF(Empresas!$B$6:$B$46=Dados!$H$37,ROW(Empresas!$B$6:$B$46)-5),ROW($A23)),COLUMN(I$1)),\"\")","v":""},{"$f":"IFERROR(INDEX(Empresas!$B$6:$AS$46,SMALL(IF(Empresas!$B$6:$B$46=Dados!$H$37,ROW(Empresas!$B$6:$B$46)-5),ROW($A23)),COLUMN(J$1)),\"\")","v":""},{"$f":"IFERROR(INDEX(Empresas!$B$6:$AS$46,SMALL(IF(Empresas!$B$6:$B$46=Dados!$H$37,ROW(Empresas!$B$6:$B$46)-5),ROW($A23)),COLUMN(K$1)),\"\")","v":""},{"$f":"IFERROR(INDEX(Empresas!$B$6:$AS$46,SMALL(IF(Empresas!$B$6:$B$46=Dados!$H$37,ROW(Empresas!$B$6:$B$46)-5),ROW($A23)),COLUMN(L$1)),\"\")","v":""},{"$f":"IFERROR(INDEX(Empresas!$B$6:$AS$46,SMALL(IF(Empresas!$B$6:$B$46=Dados!$H$37,ROW(Empresas!$B$6:$B$46)-5),ROW($A23)),COLUMN(M$1)),\"\")","v":""},{"$f":"IFERROR(INDEX(Empresas!$B$6:$AS$46,SMALL(IF(Empresas!$B$6:$B$46=Dados!$H$37,ROW(Empresas!$B$6:$B$46)-5),ROW($A23)),COLUMN(N$1)),\"\")","v":""},{"$f":"IFERROR(INDEX(Empresas!$B$6:$AS$46,SMALL(IF(Empresas!$B$6:$B$46=Dados!$H$37,ROW(Empresas!$B$6:$B$46)-5),ROW($A23)),COLUMN(O$1)),\"\")","v":""},{"$f":"IFERROR(INDEX(Empresas!$B$6:$AS$46,SMALL(IF(Empresas!$B$6:$B$46=Dados!$H$37,ROW(Empresas!$B$6:$B$46)-5),ROW($A23)),COLUMN(P$1)),\"\")","v":""},{"$f":"IFERROR(INDEX(Empresas!$B$6:$AS$46,SMALL(IF(Empresas!$B$6:$B$46=Dados!$H$37,ROW(Empresas!$B$6:$B$46)-5),ROW($A23)),COLUMN(Q$1)),\"\")","v":""},{"$f":"IFERROR(INDEX(Empresas!$B$6:$AS$46,SMALL(IF(Empresas!$B$6:$B$46=Dados!$H$37,ROW(Empresas!$B$6:$B$46)-5),ROW($A23)),COLUMN(R$1)),\"\")","v":""},{"$f":"IFERROR(INDEX(Empresas!$B$6:$AS$46,SMALL(IF(Empresas!$B$6:$B$46=Dados!$H$37,ROW(Empresas!$B$6:$B$46)-5),ROW($A23)),COLUMN(S$1)),\"\")","v":""},{"$f":"IFERROR(INDEX(Empresas!$B$6:$AS$46,SMALL(IF(Empresas!$B$6:$B$46=Dados!$H$37,ROW(Empresas!$B$6:$B$46)-5),ROW($A23)),COLUMN(T$1)),\"\")","v":""},{"$f":"IFERROR(INDEX(Empresas!$B$6:$AS$46,SMALL(IF(Empresas!$B$6:$B$46=Dados!$H$37,ROW(Empresas!$B$6:$B$46)-5),ROW($A23)),COLUMN(U$1)),\"\")","v":""},{"$f":"IFERROR(INDEX(Empresas!$B$6:$AS$46,SMALL(IF(Empresas!$B$6:$B$46=Dados!$H$37,ROW(Empresas!$B$6:$B$46)-5),ROW($A23)),COLUMN(V$1)),\"\")","v":""},{"$f":"IFERROR(INDEX(Empresas!$B$6:$AS$46,SMALL(IF(Empresas!$B$6:$B$46=Dados!$H$37,ROW(Empresas!$B$6:$B$46)-5),ROW($A23)),COLUMN(W$1)),\"\")","v":""},{"$f":"IFERROR(INDEX(Empresas!$B$6:$AS$46,SMALL(IF(Empresas!$B$6:$B$46=Dados!$H$37,ROW(Empresas!$B$6:$B$46)-5),ROW($A23)),COLUMN(X$1)),\"\")","v":""},{"$f":"IFERROR(INDEX(Empresas!$B$6:$AS$46,SMALL(IF(Empresas!$B$6:$B$46=Dados!$H$37,ROW(Empresas!$B$6:$B$46)-5),ROW($A23)),COLUMN(Y$1)),\"\")","v":""},{"$f":"IFERROR(INDEX(Empresas!$B$6:$AS$46,SMALL(IF(Empresas!$B$6:$B$46=Dados!$H$37,ROW(Empresas!$B$6:$B$46)-5),ROW($A23)),COLUMN(Z$1)),\"\")","v":""},{"$f":"IFERROR(INDEX(Empresas!$B$6:$AS$46,SMALL(IF(Empresas!$B$6:$B$46=Dados!$H$37,ROW(Empresas!$B$6:$B$46)-5),ROW($A23)),COLUMN(AA$1)),\"\")","v":""},{"$f":"IFERROR(INDEX(Empresas!$B$6:$AS$46,SMALL(IF(Empresas!$B$6:$B$46=Dados!$H$37,ROW(Empresas!$B$6:$B$46)-5),ROW($A23)),COLUMN(AB$1)),\"\")","v":""},{"$f":"IFERROR(INDEX(Empresas!$B$6:$AS$46,SMALL(IF(Empresas!$B$6:$B$46=Dados!$H$37,ROW(Empresas!$B$6:$B$46)-5),ROW($A23)),COLUMN(AC$1)),\"\")","v":""},{"$f":"IFERROR(INDEX(Empresas!$B$6:$AS$46,SMALL(IF(Empresas!$B$6:$B$46=Dados!$H$37,ROW(Empresas!$B$6:$B$46)-5),ROW($A23)),COLUMN(AD$1)),\"\")","v":""},{"$f":"IFERROR(INDEX(Empresas!$B$6:$AS$46,SMALL(IF(Empresas!$B$6:$B$46=Dados!$H$37,ROW(Empresas!$B$6:$B$46)-5),ROW($A23)),COLUMN(AE$1)),\"\")","v":""},{"$f":"IFERROR(INDEX(Empresas!$B$6:$AS$46,SMALL(IF(Empresas!$B$6:$B$46=Dados!$H$37,ROW(Empresas!$B$6:$B$46)-5),ROW($A23)),COLUMN(AF$1)),\"\")","v":""},{"$f":"IFERROR(INDEX(Empresas!$B$6:$AS$46,SMALL(IF(Empresas!$B$6:$B$46=Dados!$H$37,ROW(Empresas!$B$6:$B$46)-5),ROW($A23)),COLUMN(AG$1)),\"\")","v":""},{"$f":"IFERROR(INDEX(Empresas!$B$6:$AS$46,SMALL(IF(Empresas!$B$6:$B$46=Dados!$H$37,ROW(Empresas!$B$6:$B$46)-5),ROW($A23)),COLUMN(AH$1)),\"\")","v":""},{"$f":"IFERROR(INDEX(Empresas!$B$6:$AS$46,SMALL(IF(Empresas!$B$6:$B$46=Dados!$H$37,ROW(Empresas!$B$6:$B$46)-5),ROW($A23)),COLUMN(AI$1)),\"\")","v":""},{"$f":"IFERROR(INDEX(Empresas!$B$6:$AS$46,SMALL(IF(Empresas!$B$6:$B$46=Dados!$H$37,ROW(Empresas!$B$6:$B$46)-5),ROW($A23)),COLUMN(AJ$1)),\"\")","v":""},{"$f":"IFERROR(INDEX(Empresas!$B$6:$AS$46,SMALL(IF(Empresas!$B$6:$B$46=Dados!$H$37,ROW(Empresas!$B$6:$B$46)-5),ROW($A23)),COLUMN(AK$1)),\"\")","v":""},{"$f":"IFERROR(INDEX(Empresas!$B$6:$AS$46,SMALL(IF(Empresas!$B$6:$B$46=Dados!$H$37,ROW(Empresas!$B$6:$B$46)-5),ROW($A23)),COLUMN(AL$1)),\"\")","v":""},{"$f":"IFERROR(INDEX(Empresas!$B$6:$AS$46,SMALL(IF(Empresas!$B$6:$B$46=Dados!$H$37,ROW(Empresas!$B$6:$B$46)-5),ROW($A23)),COLUMN(AM$1)),\"\")","v":""},{"$f":"IFERROR(INDEX(Empresas!$B$6:$AS$46,SMALL(IF(Empresas!$B$6:$B$46=Dados!$H$37,ROW(Empresas!$B$6:$B$46)-5),ROW($A23)),COLUMN(AN$1)),\"\")","v":""},{"$f":"IFERROR(INDEX(Empresas!$B$6:$AS$46,SMALL(IF(Empresas!$B$6:$B$46=Dados!$H$37,ROW(Empresas!$B$6:$B$46)-5),ROW($A23)),COLUMN(AO$1)),\"\")","v":""},{"$f":"IFERROR(INDEX(Empresas!$B$6:$AS$46,SMALL(IF(Empresas!$B$6:$B$46=Dados!$H$37,ROW(Empresas!$B$6:$B$46)-5),ROW($A23)),COLUMN(AP$1)),\"\")","v":""},{"$f":"IFERROR(INDEX(Empresas!$B$6:$AS$46,SMALL(IF(Empresas!$B$6:$B$46=Dados!$H$37,ROW(Empresas!$B$6:$B$46)-5),ROW($A23)),COLUMN(AQ$1)),\"\")","v":""},{"$f":"IFERROR(INDEX(Empresas!$B$6:$AS$46,SMALL(IF(Empresas!$B$6:$B$46=Dados!$H$37,ROW(Empresas!$B$6:$B$46)-5),ROW($A23)),COLUMN(AR$1)),\"\")","v":""}]
[null,{"$f":"IFERROR(INDEX(Empresas!$B$6:$AS$46,SMALL(IF(Empresas!$B$6:$B$46=Dados!$H$37,ROW(Empresas!$B$6:$B$46)-5),ROW($A24)),COLUMN(B$1)),\"\")","v":""},{"$f":"IFERROR(INDEX(Empresas!$B$6:$AS$46,SMALL(IF(Empresas!$B$6:$B$46=Dados!$H$37,ROW(Empresas!$B$6:$B$46)-5),ROW($A24)),COLUMN(C$1)),\"\")","v":""},"",{"$f":"IFERROR(INDEX(Empresas!$B$6:$AS$46,SMALL(IF(Empresas!$B$6:$B$46=Dados!$H$37,ROW(Empresas!$B$6:$B$46)-5),ROW($A24)),COLUMN(F$1)),\"\")","v":""},{"$f":"IFERROR(INDEX(Empresas!$B$6:$AS$46,SMALL(IF(Empresas!$B$6:$B$46=Dados!$H$37,ROW(Empresas!$B$6:$B$46)-5),ROW($A24)),COLUMN(G$1)),\"\")","v":""},{"$f":"IFERROR(INDEX(Empresas!$B$6:$AS$46,SMALL(IF(Empresas!$B$6:$B$46=Dados!$H$37,ROW(Empresas!$B$6:$B$46)-5),ROW($A24)),COLUMN(H$1)),\"\")","v":""},{"$f":"IFERROR(INDEX(Empresas!$B$6:$AS$46,SMALL(IF(Empresas!$B$6:$B$46=Dados!$H$37,ROW(Empresas!$B$6:$B$46)-5),ROW($A24)),COLUMN(I$1)),\"\")","v":""},{"$f":"IFERROR(INDEX(Empresas!$B$6:$AS$46,SMALL(IF(Empresas!$B$6:$B$46=Dados!$H$37,ROW(Empresas!$B$6:$B$46)-5),ROW($A24)),COLUMN(J$1)),\"\")","v":""},{"$f":"IFERROR(INDEX(Empresas!$B$6:$AS$46,SMALL(IF(Empresas!$B$6:$B$46=Dados!$H$37,ROW(Empresas!$B$6:$B$46)-5),ROW($A24)),COLUMN(K$1)),\"\")","v":""},{"$f":"IFERROR(INDEX(Empresas!$B$6:$AS$46,SMALL(IF(Empresas!$B$6:$B$46=Dados!$H$37,ROW(Empresas!$B$6:$B$46)-5),ROW($A24)),COLUMN(L$1)),\"\")","v":""},{"$f":"IFERROR(INDEX(Empresas!$B$6:$AS$46,SMALL(IF(Empresas!$B$6:$B$46=Dados!$H$37,ROW(Empresas!$B$6:$B$46)-5),ROW($A24)),COLUMN(M$1)),\"\")","v":""},{"$f":"IFERROR(INDEX(Empresas!$B$6:$AS$46,SMALL(IF(Empresas!$B$6:$B$46=Dados!$H$37,ROW(Empresas!$B$6:$B$46)-5),ROW($A24)),COLUMN(N$1)),\"\")","v":""},{"$f":"IFERROR(INDEX(Empresas!$B$6:$AS$46,SMALL(IF(Empresas!$B$6:$B$46=Dados!$H$37,ROW(Empresas!$B$6:$B$46)-5),ROW($A24)),COLUMN(O$1)),\"\")","v":""},{"$f":"IFERROR(INDEX(Empresas!$B$6:$AS$46,SMALL(IF(Empresas!$B$6:$B$46=Dados!$H$37,ROW(Empresas!$B$6:$B$46)-5),ROW($A24)),COLUMN(P$1)),\"\")","v":""},{"$f":"IFERROR(INDEX(Empresas!$B$6:$AS$46,SMALL(IF(Empresas!$B$6:$B$46=Dados!$H$37,ROW(Empresas!$B$6:$B$46)-5),ROW($A24)),COLUMN(Q$1)),\"\")","v":""},{"$f":"IFERROR(INDEX(Empresas!$B$6:$AS$46,SMALL(IF(Empresas!$B$6:$B$46=Dados!$H$37,ROW(Empresas!$B$6:$B$46)-5),ROW($A24)),COLUMN(R$1)),\"\")","v":""},{"$f":"IFERROR(INDEX(Empresas!$B$6:$AS$46,SMALL(IF(Empresas!$B$6:$B$46=Dados!$H$37,ROW(Empresas!$B$6:$B$46)-5),ROW($A24)),COLUMN(S$1)),\"\")","v":""},{"$f":"IFERROR(INDEX(Empresas!$B$6:$AS$46,SMALL(IF(Empresas!$B$6:$B$46=Dados!$H$37,ROW(Empresas!$B$6:$B$46)-5),ROW($A24)),COLUMN(T$1)),\"\")","v":""},{"$f":"IFERROR(INDEX(Empresas!$B$6:$AS$46,SMALL(IF(Empresas!$B$6:$B$46=Dados!$H$37,ROW(Empresas!$B$6:$B$46)-5),ROW($A24)),COLUMN(U$1)),\"\")","v":""},{"$f":"IFERROR(INDEX(Empresas!$B$6:$AS$46,SMALL(IF(Empresas!$B$6:$B$46=Dados!$H$37,ROW(Empresas!$B$6:$B$46)-5),ROW($A24)),COLUMN(V$1)),\"\")","v":""},{"$f":"IFERROR(INDEX(Empresas!$B$6:$AS$46,SMALL(IF(Empresas!$B$6:$B$46=Dados!$H$37,ROW(Empresas!$B$6:$B$46)-5),ROW($A24)),COLUMN(W$1)),\"\")","v":""},{"$f":"IFERROR(INDEX(Empresas!$B$6:$AS$46,SMALL(IF(Empresas!$B$6:$B$46=Dados!$H$37,ROW(Empresas!$B$6:$B$46)-5),ROW($A24)),COLUMN(X$1)),\"\")","v":""},{"$f":"IFERROR(INDEX(Empresas!$B$6:$AS$46,SMALL(IF(Empresas!$B$6:$B$46=Dados!$H$37,ROW(Empresas!$B$6:$B$46)-5),ROW($A24)),COLUMN(Y$1)),\"\")","v":""},{"$f":"IFERROR(INDEX(Empresas!$B$6:$AS$46,SMALL(IF(Empresas!$B$6:$B$46=Dados!$H$37,ROW(Empresas!$B$6:$B$46)-5),ROW($A24)),COLUMN(Z$1)),\"\")","v":""},{"$f":"IFERROR(INDEX(Empresas!$B$6:$AS$46,SMALL(IF(Empresas!$B$6:$B$46=Dados!$H$37,ROW(Empresas!$B$6:$B$46)-5),ROW($A24)),COLUMN(AA$1)),\"\")","v":""},{"$f":"IFERROR(INDEX(Empresas!$B$6:$AS$46,SMALL(IF(Empresas!$B$6:$B$46=Dados!$H$37,ROW(Empresas!$B$6:$B$46)-5),ROW($A24)),COLUMN(AB$1)),\"\")","v":""},{"$f":"IFERROR(INDEX(Empresas!$B$6:$AS$46,SMALL(IF(Empresas!$B$6:$B$46=Dados!$H$37,ROW(Empresas!$B$6:$B$46)-5),ROW($A24)),COLUMN(AC$1)),\"\")","v":""},{"$f":"IFERROR(INDEX(Empresas!$B$6:$AS$46,SMALL(IF(Empresas!$B$6:$B$46=Dados!$H$37,ROW(Empresas!$B$6:$B$46)-5),ROW($A24)),COLUMN(AD$1)),\"\")","v":""},{"$f":"IFERROR(INDEX(Empresas!$B$6:$AS$46,SMALL(IF(Empresas!$B$6:$B$46=Dados!$H$37,ROW(Empresas!$B$6:$B$46)-5),ROW($A24)),COLUMN(AE$1)),\"\")","v":""},{"$f":"IFERROR(INDEX(Empresas!$B$6:$AS$46,SMALL(IF(Empresas!$B$6:$B$46=Dados!$H$37,ROW(Empresas!$B$6:$B$46)-5),ROW($A24)),COLUMN(AF$1)),\"\")","v":""},{"$f":"IFERROR(INDEX(Empresas!$B$6:$AS$46,SMALL(IF(Empresas!$B$6:$B$46=Dados!$H$37,ROW(Empresas!$B$6:$B$46)-5),ROW($A24)),COLUMN(AG$1)),\"\")","v":""},{"$f":"IFERROR(INDEX(Empresas!$B$6:$AS$46,SMALL(IF(Empresas!$B$6:$B$46=Dados!$H$37,ROW(Empresas!$B$6:$B$46)-5),ROW($A24)),COLUMN(AH$1)),\"\")","v":""},{"$f":"IFERROR(INDEX(Empresas!$B$6:$AS$46,SMALL(IF(Empresas!$B$6:$B$46=Dados!$H$37,ROW(Empresas!$B$6:$B$46)-5),ROW($A24)),COLUMN(AI$1)),\"\")","v":""},{"$f":"IFERROR(INDEX(Empresas!$B$6:$AS$46,SMALL(IF(Empresas!$B$6:$B$46=Dados!$H$37,ROW(Empresas!$B$6:$B$46)-5),ROW($A24)),COLUMN(AJ$1)),\"\")","v":""},{"$f":"IFERROR(INDEX(Empresas!$B$6:$AS$46,SMALL(IF(Empresas!$B$6:$B$46=Dados!$H$37,ROW(Empresas!$B$6:$B$46)-5),ROW($A24)),COLUMN(AK$1)),\"\")","v":""},{"$f":"IFERROR(INDEX(Empresas!$B$6:$AS$46,SMALL(IF(Empresas!$B$6:$B$46=Dados!$H$37,ROW(Empresas!$B$6:$B$46)-5),ROW($A24)),COLUMN(AL$1)),\"\")","v":""},{"$f":"IFERROR(INDEX(Empresas!$B$6:$AS$46,SMALL(IF(Empresas!$B$6:$B$46=Dados!$H$37,ROW(Empresas!$B$6:$B$46)-5),ROW($A24)),COLUMN(AM$1)),\"\")","v":""},{"$f":"IFERROR(INDEX(Empresas!$B$6:$AS$46,SMALL(IF(Empresas!$B$6:$B$46=Dados!$H$37,ROW(Empresas!$B$6:$B$46)-5),ROW($A24)),COLUMN(AN$1)),\"\")","v":""},{"$f":"IFERROR(INDEX(Empresas!$B$6:$AS$46,SMALL(IF(Empresas!$B$6:$B$46=Dados!$H$37,ROW(Empresas!$B$6:$B$46)-5),ROW($A24)),COLUMN(AO$1)),\"\")","v":""},{"$f":"IFERROR(INDEX(Empresas!$B$6:$AS$46,SMALL(IF(Empresas!$B$6:$B$46=Dados!$H$37,ROW(Empresas!$B$6:$B$46)-5),ROW($A24)),COLUMN(AP$1)),\"\")","v":""},{"$f":"IFERROR(INDEX(Empresas!$B$6:$AS$46,SMALL(IF(Empresas!$B$6:$B$46=Dados!$H$37,ROW(Empresas!$B$6:$B$46)-5),ROW($A24)),COLUMN(AQ$1)),\"\")","v":""},{"$f":"IFERROR(INDEX(Empresas!$B$6:$AS$46,SMALL(IF(Empresas!$B$6:$B$46=Dados!$H$37,ROW(Empresas!$B$6:$B$46)-5),ROW($A24)),COLUMN(AR$1)),\"\")","v":""}]
[null,{"$f":"IFERROR(INDEX(Empresas!$B$6:$AS$46,SMALL(IF(Empresas!$B$6:$B$46=Dados!$H$37,ROW(Empresas!$B$6:$B$46)-5),ROW($A25)),COLUMN(B$1)),\"\")","v":""},{"$f":"IFERROR(INDEX(Empresas!$B$6:$AS$46,SMALL(IF(Empresas!$B$6:$B$46=Dados!$H$37,ROW(Empresas!$B$6:$B$46)-5),ROW($A25)),COLUMN(C$1)),\"\")","v":""},"",{"$f":"IFERROR(INDEX(Empresas!$B$6:$AS$46,SMALL(IF(Empresas!$B$6:$B$46=Dados!$H$37,ROW(Empresas!$B$6:$B$46)-5),ROW($A25)),COLUMN(F$1)),\"\")","v":""},{"$f":"IFERROR(INDEX(Empresas!$B$6:$AS$46,SMALL(IF(Empresas!$B$6:$B$46=Dados!$H$37,ROW(Empresas!$B$6:$B$46)-5),ROW($A25)),COLUMN(G$1)),\"\")","v":""},{"$f":"IFERROR(INDEX(Empresas!$B$6:$AS$46,SMALL(IF(Empresas!$B$6:$B$46=Dados!$H$37,ROW(Empresas!$B$6:$B$46)-5),ROW($A25)),COLUMN(H$1)),\"\")","v":""},{"$f":"IFERROR(INDEX(Empresas!$B$6:$AS$46,SMALL(IF(Empresas!$B$6:$B$46=Dados!$H$37,ROW(Empresas!$B$6:$B$46)-5),ROW($A25)),COLUMN(I$1)),\"\")","v":""},{"$f":"IFERROR(INDEX(Empresas!$B$6:$AS$46,SMALL(IF(Empresas!$B$6:$B$46=Dados!$H$37,ROW(Empresas!$B$6:$B$46)-5),ROW($A25)),COLUMN(J$1)),\"\")","v":""},{"$f":"IFERROR(INDEX(Empresas!$B$6:$AS$46,SMALL(IF(Empresas!$B$6:$B$46=Dados!$H$37,ROW(Empresas!$B$6:$B$46)-5),ROW($A25)),COLUMN(K$1)),\"\")","v":""},{"$f":"IFERROR(INDEX(Empresas!$B$6:$AS$46,SMALL(IF(Empresas!$B$6:$B$46=Dados!$H$37,ROW(Empresas!$B$6:$B$46)-5),ROW($A25)),COLUMN(L$1)),\"\")","v":""},{"$f":"IFERROR(INDEX(Empresas!$B$6:$AS$46,SMALL(IF(Empresas!$B$6:$B$46=Dados!$H$37,ROW(Empresas!$B$6:$B$46)-5),ROW($A25)),COLUMN(M$1)),\"\")","v":""},{"$f":"IFERROR(INDEX(Empresas!$B$6:$AS$46,SMALL(IF(Empresas!$B$6:$B$46=Dados!$H$37,ROW(Empresas!$B$6:$B$46)-5),ROW($A25)),COLUMN(N$1)),\"\")","v":""},{"$f":"IFERROR(INDEX(Empresas!$B$6:$AS$46,SMALL(IF(Empresas!$B$6:$B$46=Dados!$H$37,ROW(Empresas!$B$6:$B$46)-5),ROW($A25)),COLUMN(O$1)),\"\")","v":""},{"$f":"IFERROR(INDEX(Empresas!$B$6:$AS$46,SMALL(IF(Empresas!$B$6:$B$46=Dados!$H$37,ROW(Empresas!$B$6:$B$46)-5),ROW($A25)),COLUMN(P$1)),\"\")","v":""},{"$f":"IFERROR(INDEX(Empresas!$B$6:$AS$46,SMALL(IF(Empresas!$B$6:$B$46=Dados!$H$37,ROW(Empresas!$B$6:$B$46)-5),ROW($A25)),COLUMN(Q$1)),\"\")","v":""},{"$f":"IFERROR(INDEX(Empresas!$B$6:$AS$46,SMALL(IF(Empresas!$B$6:$B$46=Dados!$H$37,ROW(Empresas!$B$6:$B$46)-5),ROW($A25)),COLUMN(R$1)),\"\")","v":""},{"$f":"IFERROR(INDEX(Empresas!$B$6:$AS$46,SMALL(IF(Empresas!$B$6:$B$46=Dados!$H$37,ROW(Empresas!$B$6:$B$46)-5),ROW($A25)),COLUMN(S$1)),\"\")","v":""},{"$f":"IFERROR(INDEX(Empresas!$B$6:$AS$46,SMALL(IF(Empresas!$B$6:$B$46=Dados!$H$37,ROW(Empresas!$B$6:$B$46)-5),ROW($A25)),COLUMN(T$1)),\"\")","v":""},{"$f":"IFERROR(INDEX(Empresas!$B$6:$AS$46,SMALL(IF(Empresas!$B$6:$B$46=Dados!$H$37,ROW(Empresas!$B$6:$B$46)-5),ROW($A25)),COLUMN(U$1)),\"\")","v":""},{"$f":"IFERROR(INDEX(Empresas!$B$6:$AS$46,SMALL(IF(Empresas!$B$6:$B$46=Dados!$H$37,ROW(Empresas!$B$6:$B$46)-5),ROW($A25)),COLUMN(V$1)),\"\")","v":""},{"$f":"IFERROR(INDEX(Empresas!$B$6:$AS$46,SMALL(IF(Empresas!$B$6:$B$46=Dados!$H$37,ROW(Empresas!$B$6:$B$46)-5),ROW($A25)),COLUMN(W$1)),\"\")","v":""},{"$f":"IFERROR(INDEX(Empresas!$B$6:$AS$46,SMALL(IF(Empresas!$B$6:$B$46=Dados!$H$37,ROW(Empresas!$B$6:$B$46)-5),ROW($A25)),COLUMN(X$1)),\"\")","v":""},{"$f":"IFERROR(INDEX(Empresas!$B$6:$AS$46,SMALL(IF(Empresas!$B$6:$B$46=Dados!$H$37,ROW(Empresas!$B$6:$B$46)-5),ROW($A25)),COLUMN(Y$1)),\"\")","v":""},{"$f":"IFERROR(INDEX(Empresas!$B$6:$AS$46,SMALL(IF(Empresas!$B$6:$B$46=Dados!$H$37,ROW(Empresas!$B$6:$B$46)-5),ROW($A25)),COLUMN(Z$1)),\"\")","v":""},{"$f":"IFERROR(INDEX(Empresas!$B$6:$AS$46,SMALL(IF(Empresas!$B$6:$B$46=Dados!$H$37,ROW(Empresas!$B$6:$B$46)-5),ROW($A25)),COLUMN(AA$1)),\"\")","v":""},{"$f":"IFERROR(INDEX(Empresas!$B$6:$AS$46,SMALL(IF(Empresas!$B$6:$B$46=Dados!$H$37,ROW(Empresas!$B$6:$B$46)-5),ROW($A25)),COLUMN(AB$1)),\"\")","v":""},{"$f":"IFERROR(INDEX(Empresas!$B$6:$AS$46,SMALL(IF(Empresas!$B$6:$B$46=Dados!$H$37,ROW(Empresas!$B$6:$B$46)-5),ROW($A25)),COLUMN(AC$1)),\"\")","v":""},{"$f":"IFERROR(INDEX(Empresas!$B$6:$AS$46,SMALL(IF(Empresas!$B$6:$B$46=Dados!$H$37,ROW(Empresas!$B$6:$B$46)-5),ROW($A25)),COLUMN(AD$1)),\"\")","v":""},{"$f":"IFERROR(INDEX(Empresas!$B$6:$AS$46,SMALL(IF(Empresas!$B$6:$B$46=Dados!$H$37,ROW(Empresas!$B$6:$B$46)-5),ROW($A25)),COLUMN(AE$1)),\"\")","v":""},{"$f":"IFERROR(INDEX(Empresas!$B$6:$AS$46,SMALL(IF(Empresas!$B$6:$B$46=Dados!$H$37,ROW(Empresas!$B$6:$B$46)-5),ROW($A25)),COLUMN(AF$1)),\"\")","v":""},{"$f":"IFERROR(INDEX(Empresas!$B$6:$AS$46,SMALL(IF(Empresas!$B$6:$B$46=Dados!$H$37,ROW(Empresas!$B$6:$B$46)-5),ROW($A25)),COLUMN(AG$1)),\"\")","v":""},{"$f":"IFERROR(INDEX(Empresas!$B$6:$AS$46,SMALL(IF(Empresas!$B$6:$B$46=Dados!$H$37,ROW(Empresas!$B$6:$B$46)-5),ROW($A25)),COLUMN(AH$1)),\"\")","v":""},{"$f":"IFERROR(INDEX(Empresas!$B$6:$AS$46,SMALL(IF(Empresas!$B$6:$B$46=Dados!$H$37,ROW(Empresas!$B$6:$B$46)-5),ROW($A25)),COLUMN(AI$1)),\"\")","v":""},{"$f":"IFERROR(INDEX(Empresas!$B$6:$AS$46,SMALL(IF(Empresas!$B$6:$B$46=Dados!$H$37,ROW(Empresas!$B$6:$B$46)-5),ROW($A25)),COLUMN(AJ$1)),\"\")","v":""},{"$f":"IFERROR(INDEX(Empresas!$B$6:$AS$46,SMALL(IF(Empresas!$B$6:$B$46=Dados!$H$37,ROW(Empresas!$B$6:$B$46)-5),ROW($A25)),COLUMN(AK$1)),\"\")","v":""},{"$f":"IFERROR(INDEX(Empresas!$B$6:$AS$46,SMALL(IF(Empresas!$B$6:$B$46=Dados!$H$37,ROW(Empresas!$B$6:$B$46)-5),ROW($A25)),COLUMN(AL$1)),\"\")","v":""},{"$f":"IFERROR(INDEX(Empresas!$B$6:$AS$46,SMALL(IF(Empresas!$B$6:$B$46=Dados!$H$37,ROW(Empresas!$B$6:$B$46)-5),ROW($A25)),COLUMN(AM$1)),\"\")","v":""},{"$f":"IFERROR(INDEX(Empresas!$B$6:$AS$46,SMALL(IF(Empresas!$B$6:$B$46=Dados!$H$37,ROW(Empresas!$B$6:$B$46)-5),ROW($A25)),COLUMN(AN$1)),\"\")","v":""},{"$f":"IFERROR(INDEX(Empresas!$B$6:$AS$46,SMALL(IF(Empresas!$B$6:$B$46=Dados!$H$37,ROW(Empresas!$B$6:$B$46)-5),ROW($A25)),COLUMN(AO$1)),\"\")","v":""},{"$f":"IFERROR(INDEX(Empresas!$B$6:$AS$46,SMALL(IF(Empresas!$B$6:$B$46=Dados!$H$37,ROW(Empresas!$B$6:$B$46)-5),ROW($A25)),COLUMN(AP$1)),\"\")","v":""},{"$f":"IFERROR(INDEX(Empresas!$B$6:$AS$46,SMALL(IF(Empresas!$B$6:$B$46=Dados!$H$37,ROW(Empresas!$B$6:$B$46)-5),ROW($A25)),COLUMN(AQ$1)),\"\")","v":""},{"$f":"IFERROR(INDEX(Empresas!$B$6:$AS$46,SMALL(IF(Empresas!$B$6:$B$46=Dados!$H$37,ROW(Empresas!$B$6:$B$46)-5),ROW($A25)),COLUMN(AR$1)),\"\")","v":""}]
[null,{"$f":"IFERROR(INDEX(Empresas!$B$6:$AS$46,SMALL(IF(Empresas!$B$6:$B$46=Dados!$H$37,ROW(Empresas!$B$6:$B$46)-5),ROW($A26)),COLUMN(B$1)),\"\")","v":""},{"$f":"IFERROR(INDEX(Empresas!$B$6:$AS$46,SMALL(IF(Empresas!$B$6:$B$46=Dados!$H$37,ROW(Empresas!$B$6:$B$46)-5),ROW($A26)),COLUMN(C$1)),\"\")","v":""},"",{"$f":"IFERROR(INDEX(Empresas!$B$6:$AS$46,SMALL(IF(Empresas!$B$6:$B$46=Dados!$H$37,ROW(Empresas!$B$6:$B$46)-5),ROW($A26)),COLUMN(F$1)),\"\")","v":""},{"$f":"IFERROR(INDEX(Empresas!$B$6:$AS$46,SMALL(IF(Empresas!$B$6:$B$46=Dados!$H$37,ROW(Empresas!$B$6:$B$46)-5),ROW($A26)),COLUMN(G$1)),\"\")","v":""},{"$f":"IFERROR(INDEX(Empresas!$B$6:$AS$46,SMALL(IF(Empresas!$B$6:$B$46=Dados!$H$37,ROW(Empresas!$B$6:$B$46)-5),ROW($A26)),COLUMN(H$1)),\"\")","v":""},{"$f":"IFERROR(INDEX(Empresas!$B$6:$AS$46,SMALL(IF(Empresas!$B$6:$B$46=Dados!$H$37,ROW(Empresas!$B$6:$B$46)-5),ROW($A26)),COLUMN(I$1)),\"\")","v":""},{"$f":"IFERROR(INDEX(Empresas!$B$6:$AS$46,SMALL(IF(Empresas!$B$6:$B$46=Dados!$H$37,ROW(Empresas!$B$6:$B$46)-5),ROW($A26)),COLUMN(J$1)),\"\")","v":""},{"$f":"IFERROR(INDEX(Empresas!$B$6:$AS$46,SMALL(IF(Empresas!$B$6:$B$46=Dados!$H$37,ROW(Empresas!$B$6:$B$46)-5),ROW($A26)),COLUMN(K$1)),\"\")","v":""},{"$f":"IFERROR(INDEX(Empresas!$B$6:$AS$46,SMALL(IF(Empresas!$B$6:$B$46=Dados!$H$37,ROW(Empresas!$B$6:$B$46)-5),ROW($A26)),COLUMN(L$1)),\"\")","v":""},{"$f":"IFERROR(INDEX(Empresas!$B$6:$AS$46,SMALL(IF(Empresas!$B$6:$B$46=Dados!$H$37,ROW(Empresas!$B$6:$B$46)-5),ROW($A26)),COLUMN(M$1)),\"\")","v":""},{"$f":"IFERROR(INDEX(Empresas!$B$6:$AS$46,SMALL(IF(Empresas!$B$6:$B$46=Dados!$H$37,ROW(Empresas!$B$6:$B$46)-5),ROW($A26)),COLUMN(N$1)),\"\")","v":""},{"$f":"IFERROR(INDEX(Empresas!$B$6:$AS$46,SMALL(IF(Empresas!$B$6:$B$46=Dados!$H$37,ROW(Empresas!$B$6:$B$46)-5),ROW($A26)),COLUMN(O$1)),\"\")","v":""},{"$f":"IFERROR(INDEX(Empresas!$B$6:$AS$46,SMALL(IF(Empresas!$B$6:$B$46=Dados!$H$37,ROW(Empresas!$B$6:$B$46)-5),ROW($A26)),COLUMN(P$1)),\"\")","v":""},{"$f":"IFERROR(INDEX(Empresas!$B$6:$AS$46,SMALL(IF(Empresas!$B$6:$B$46=Dados!$H$37,ROW(Empresas!$B$6:$B$46)-5),ROW($A26)),COLUMN(Q$1)),\"\")","v":""},{"$f":"IFERROR(INDEX(Empresas!$B$6:$AS$46,SMALL(IF(Empresas!$B$6:$B$46=Dados!$H$37,ROW(Empresas!$B$6:$B$46)-5),ROW($A26)),COLUMN(R$1)),\"\")","v":""},{"$f":"IFERROR(INDEX(Empresas!$B$6:$AS$46,SMALL(IF(Empresas!$B$6:$B$46=Dados!$H$37,ROW(Empresas!$B$6:$B$46)-5),ROW($A26)),COLUMN(S$1)),\"\")","v":""},{"$f":"IFERROR(INDEX(Empresas!$B$6:$AS$46,SMALL(IF(Empresas!$B$6:$B$46=Dados!$H$37,ROW(Empresas!$B$6:$B$46)-5),ROW($A26)),COLUMN(T$1)),\"\")","v":""},{"$f":"IFERROR(INDEX(Empresas!$B$6:$AS$46,SMALL(IF(Empresas!$B$6:$B$46=Dados!$H$37,ROW(Empresas!$B$6:$B$46)-5),ROW($A26)),COLUMN(U$1)),\"\")","v":""},{"$f":"IFERROR(INDEX(Empresas!$B$6:$AS$46,SMALL(IF(Empresas!$B$6:$B$46=Dados!$H$37,ROW(Empresas!$B$6:$B$46)-5),ROW($A26)),COLUMN(V$1)),\"\")","v":""},{"$f":"IFERROR(INDEX(Empresas!$B$6:$AS$46,SMALL(IF(Empresas!$B$6:$B$46=Dados!$H$37,ROW(Empresas!$B$6:$B$46)-5),ROW($A26)),COLUMN(W$1)),\"\")","v":""},{"$f":"IFERROR(INDEX(Empresas!$B$6:$AS$46,SMALL(IF(Empresas!$B$6:$B$46=Dados!$H$37,ROW(Empresas!$B$6:$B$46)-5),ROW($A26)),COLUMN(X$1)),\"\")","v":""},{"$f":"IFERROR(INDEX(Empresas!$B$6:$AS$46,SMALL(IF(Empresas!$B$6:$B$46=Dados!$H$37,ROW(Empresas!$B$6:$B$46)-5),ROW($A26)),COLUMN(Y$1)),\"\")","v":""},{"$f":"IFERROR(INDEX(Empresas!$B$6:$AS$46,SMALL(IF(Empresas!$B$6:$B$46=Dados!$H$37,ROW(Empresas!$B$6:$B$46)-5),ROW($A26)),COLUMN(Z$1)),\"\")","v":""},{"$f":"IFERROR(INDEX(Empresas!$B$6:$AS$46,SMALL(IF(Empresas!$B$6:$B$46=Dados!$H$37,ROW(Empresas!$B$6:$B$46)-5),ROW($A26)),COLUMN(AA$1)),\"\")","v":""},{"$f":"IFERROR(INDEX(Empresas!$B$6:$AS$46,SMALL(IF(Empresas!$B$6:$B$46=Dados!$H$37,ROW(Empresas!$B$6:$B$46)-5),ROW($A26)),COLUMN(AB$1)),\"\")","v":""},{"$f":"IFERROR(INDEX(Empresas!$B$6:$AS$46,SMALL(IF(Empresas!$B$6:$B$46=Dados!$H$37,ROW(Empresas!$B$6:$B$46)-5),ROW($A26)),COLUMN(AC$1)),\"\")","v":""},{"$f":"IFERROR(INDEX(Empresas!$B$6:$AS$46,SMALL(IF(Empresas!$B$6:$B$46=Dados!$H$37,ROW(Empresas!$B$6:$B$46)-5),ROW($A26)),COLUMN(AD$1)),\"\")","v":""},{"$f":"IFERROR(INDEX(Empresas!$B$6:$AS$46,SMALL(IF(Empresas!$B$6:$B$46=Dados!$H$37,ROW(Empresas!$B$6:$B$46)-5),ROW($A26)),COLUMN(AE$1)),\"\")","v":""},{"$f":"IFERROR(INDEX(Empresas!$B$6:$AS$46,SMALL(IF(Empresas!$B$6:$B$46=Dados!$H$37,ROW(Empresas!$B$6:$B$46)-5),ROW($A26)),COLUMN(AF$1)),\"\")","v":""},{"$f":"IFERROR(INDEX(Empresas!$B$6:$AS$46,SMALL(IF(Empresas!$B$6:$B$46=Dados!$H$37,ROW(Empresas!$B$6:$B$46)-5),ROW($A26)),COLUMN(AG$1)),\"\")","v":""},{"$f":"IFERROR(INDEX(Empresas!$B$6:$AS$46,SMALL(IF(Empresas!$B$6:$B$46=Dados!$H$37,ROW(Empresas!$B$6:$B$46)-5),ROW($A26)),COLUMN(AH$1)),\"\")","v":""},{"$f":"IFERROR(INDEX(Empresas!$B$6:$AS$46,SMALL(IF(Empresas!$B$6:$B$46=Dados!$H$37,ROW(Empresas!$B$6:$B$46)-5),ROW($A26)),COLUMN(AI$1)),\"\")","v":""},{"$f":"IFERROR(INDEX(Empresas!$B$6:$AS$46,SMALL(IF(Empresas!$B$6:$B$46=Dados!$H$37,ROW(Empresas!$B$6:$B$46)-5),ROW($A26)),COLUMN(AJ$1)),\"\")","v":""},{"$f":"IFERROR(INDEX(Empresas!$B$6:$AS$46,SMALL(IF(Empresas!$B$6:$B$46=Dados!$H$37,ROW(Empresas!$B$6:$B$46)-5),ROW($A26)),COLUMN(AK$1)),\"\")","v":""},{"$f":"IFERROR(INDEX(Empresas!$B$6:$AS$46,SMALL(IF(Empresas!$B$6:$B$46=Dados!$H$37,ROW(Empresas!$B$6:$B$46)-5),ROW($A26)),COLUMN(AL$1)),\"\")","v":""},{"$f":"IFERROR(INDEX(Empresas!$B$6:$AS$46,SMALL(IF(Empresas!$B$6:$B$46=Dados!$H$37,ROW(Empresas!$B$6:$B$46)-5),ROW($A26)),COLUMN(AM$1)),\"\")","v":""},{"$f":"IFERROR(INDEX(Empresas!$B$6:$AS$46,SMALL(IF(Empresas!$B$6:$B$46=Dados!$H$37,ROW(Empresas!$B$6:$B$46)-5),ROW($A26)),COLUMN(AN$1)),\"\")","v":""},{"$f":"IFERROR(INDEX(Empresas!$B$6:$AS$46,SMALL(IF(Empresas!$B$6:$B$46=Dados!$H$37,ROW(Empresas!$B$6:$B$46)-5),ROW($A26)),COLUMN(AO$1)),\"\")","v":""},{"$f":"IFERROR(INDEX(Empresas!$B$6:$AS$46,SMALL(IF(Empresas!$B$6:$B$46=Dados!$H$37,ROW(Empresas!$B$6:$B$46)-5),ROW($A26)),COLUMN(AP$1)),\"\")","v":""},{"$f":"IFERROR(INDEX(Empresas!$B$6:$AS$46,SMALL(IF(Empresas!$B$6:$B$46=Dados!$H$37,ROW(Empresas!$B$6:$B$46)-5),ROW($A26)),COLUMN(AQ$1)),\"\")","v":""},{"$f":"IFERROR(INDEX(Empresas!$B$6:$AS$46,SMALL(IF(Empresas!$B$6:$B$46=Dados!$H$37,ROW(Empresas!$B$6:$B$46)-5),ROW($A26)),COLUMN(AR$1)),\"\")","v":""}]
[null,{"$f":"IFERROR(INDEX(Empresas!$B$6:$AS$46,SMALL(IF(Empresas!$B$6:$B$46=Dados!$H$37,ROW(Empresas!$B$6:$B$46)-5),ROW($A27)),COLUMN(B$1)),\"\")","v":""},{"$f":"IFERROR(INDEX(Empresas!$B$6:$AS$46,SMALL(IF(Empresas!$B$6:$B$46=Dados!$H$37,ROW(Empresas!$B$6:$B$46)-5),ROW($A27)),COLUMN(C$1)),\"\")","v":""},"",{"$f":"IFERROR(INDEX(Empresas!$B$6:$AS$46,SMALL(IF(Empresas!$B$6:$B$46=Dados!$H$37,ROW(Empresas!$B$6:$B$46)-5),ROW($A27)),COLUMN(F$1)),\"\")","v":""},{"$f":"IFERROR(INDEX(Empresas!$B$6:$AS$46,SMALL(IF(Empresas!$B$6:$B$46=Dados!$H$37,ROW(Empresas!$B$6:$B$46)-5),ROW($A27)),COLUMN(G$1)),\"\")","v":""},{"$f":"IFERROR(INDEX(Empresas!$B$6:$AS$46,SMALL(IF(Empresas!$B$6:$B$46=Dados!$H$37,ROW(Empresas!$B$6:$B$46)-5),ROW($A27)),COLUMN(H$1)),\"\")","v":""},{"$f":"IFERROR(INDEX(Empresas!$B$6:$AS$46,SMALL(IF(Empresas!$B$6:$B$46=Dados!$H$37,ROW(Empresas!$B$6:$B$46)-5),ROW($A27)),COLUMN(I$1)),\"\")","v":""},{"$f":"IFERROR(INDEX(Empresas!$B$6:$AS$46,SMALL(IF(Empresas!$B$6:$B$46=Dados!$H$37,ROW(Empresas!$B$6:$B$46)-5),ROW($A27)),COLUMN(J$1)),\"\")","v":""},{"$f":"IFERROR(INDEX(Empresas!$B$6:$AS$46,SMALL(IF(Empresas!$B$6:$B$46=Dados!$H$37,ROW(Empresas!$B$6:$B$46)-5),ROW($A27)),COLUMN(K$1)),\"\")","v":""},{"$f":"IFERROR(INDEX(Empresas!$B$6:$AS$46,SMALL(IF(Empresas!$B$6:$B$46=Dados!$H$37,ROW(Empresas!$B$6:$B$46)-5),ROW($A27)),COLUMN(L$1)),\"\")","v":""},{"$f":"IFERROR(INDEX(Empresas!$B$6:$AS$46,SMALL(IF(Empresas!$B$6:$B$46=Dados!$H$37,ROW(Empresas!$B$6:$B$46)-5),ROW($A27)),COLUMN(M$1)),\"\")","v":""},{"$f":"IFERROR(INDEX(Empresas!$B$6:$AS$46,SMALL(IF(Empresas!$B$6:$B$46=Dados!$H$37,ROW(Empresas!$B$6:$B$46)-5),ROW($A27)),COLUMN(N$1)),\"\")","v":""},{"$f":"IFERROR(INDEX(Empresas!$B$6:$AS$46,SMALL(IF(Empresas!$B$6:$B$46=Dados!$H$37,ROW(Empresas!$B$6:$B$46)-5),ROW($A27)),COLUMN(O$1)),\"\")","v":""},{"$f":"IFERROR(INDEX(Empresas!$B$6:$AS$46,SMALL(IF(Empresas!$B$6:$B$46=Dados!$H$37,ROW(Empresas!$B$6:$B$46)-5),ROW($A27)),COLUMN(P$1)),\"\")","v":""},{"$f":"IFERROR(INDEX(Empresas!$B$6:$AS$46,SMALL(IF(Empresas!$B$6:$B$46=Dados!$H$37,ROW(Empresas!$B$6:$B$46)-5),ROW($A27)),COLUMN(Q$1)),\"\")","v":""},{"$f":"IFERROR(INDEX(Empresas!$B$6:$AS$46,SMALL(IF(Empresas!$B$6:$B$46=Dados!$H$37,ROW(Empresas!$B$6:$B$46)-5),ROW($A27)),COLUMN(R$1)),\"\")","v":""},{"$f":"IFERROR(INDEX(Empresas!$B$6:$AS$46,SMALL(IF(Empresas!$B$6:$B$46=Dados!$H$37,ROW(Empresas!$B$6:$B$46)-5),ROW($A27)),COLUMN(S$1)),\"\")","v":""},{"$f":"IFERROR(INDEX(Empresas!$B$6:$AS$46,SMALL(IF(Empresas!$B$6:$B$46=Dados!$H$37,ROW(Empresas!$B$6:$B$46)-5),ROW($A27)),COLUMN(T$1)),\"\")","v":""},{"$f":"IFERROR(INDEX(Empresas!$B$6:$AS$46,SMALL(IF(Empresas!$B$6:$B$46=Dados!$H$37,ROW(Empresas!$B$6:$B$46)-5),ROW($A27)),COLUMN(U$1)),\"\")","v":""},{"$f":"IFERROR(INDEX(Empresas!$B$6:$AS$46,SMALL(IF(Empresas!$B$6:$B$46=Dados!$H$37,ROW(Empresas!$B$6:$B$46)-5),ROW($A27)),COLUMN(V$1)),\"\")","v":""},{"$f":"IFERROR(INDEX(Empresas!$B$6:$AS$46,SMALL(IF(Empresas!$B$6:$B$46=Dados!$H$37,ROW(Empresas!$B$6:$B$46)-5),ROW($A27)),COLUMN(W$1)),\"\")","v":""},{"$f":"IFERROR(INDEX(Empresas!$B$6:$AS$46,SMALL(IF(Empresas!$B$6:$B$46=Dados!$H$37,ROW(Empresas!$B$6:$B$46)-5),ROW($A27)),COLUMN(X$1)),\"\")","v":""},{"$f":"IFERROR(INDEX(Empresas!$B$6:$AS$46,SMALL(IF(Empresas!$B$6:$B$46=Dados!$H$37,ROW(Empresas!$B$6:$B$46)-5),ROW($A27)),COLUMN(Y$1)),\"\")","v":""},{"$f":"IFERROR(INDEX(Empresas!$B$6:$AS$46,SMALL(IF(Empresas!$B$6:$B$46=Dados!$H$37,ROW(Empresas!$B$6:$B$46)-5),ROW($A27)),COLUMN(Z$1)),\"\")","v":""},{"$f":"IFERROR(INDEX(Empresas!$B$6:$AS$46,SMALL(IF(Empresas!$B$6:$B$46=Dados!$H$37,ROW(Empresas!$B$6:$B$46)-5),ROW($A27)),COLUMN(AA$1)),\"\")","v":""},{"$f":"IFERROR(INDEX(Empresas!$B$6:$AS$46,SMALL(IF(Empresas!$B$6:$B$46=Dados!$H$37,ROW(Empresas!$B$6:$B$46)-5),ROW($A27)),COLUMN(AB$1)),\"\")","v":""},{"$f":"IFERROR(INDEX(Empresas!$B$6:$AS$46,SMALL(IF(Empresas!$B$6:$B$46=Dados!$H$37,ROW(Empresas!$B$6:$B$46)-5),ROW($A27)),COLUMN(AC$1)),\"\")","v":""},{"$f":"IFERROR(INDEX(Empresas!$B$6:$AS$46,SMALL(IF(Empresas!$B$6:$B$46=Dados!$H$37,ROW(Empresas!$B$6:$B$46)-5),ROW($A27)),COLUMN(AD$1)),\"\")","v":""},{"$f":"IFERROR(INDEX(Empresas!$B$6:$AS$46,SMALL(IF(Empresas!$B$6:$B$46=Dados!$H$37,ROW(Empresas!$B$6:$B$46)-5),ROW($A27)),COLUMN(AE$1)),\"\")","v":""},{"$f":"IFERROR(INDEX(Empresas!$B$6:$AS$46,SMALL(IF(Empresas!$B$6:$B$46=Dados!$H$37,ROW(Empresas!$B$6:$B$46)-5),ROW($A27)),COLUMN(AF$1)),\"\")","v":""},{"$f":"IFERROR(INDEX(Empresas!$B$6:$AS$46,SMALL(IF(Empresas!$B$6:$B$46=Dados!$H$37,ROW(Empresas!$B$6:$B$46)-5),ROW($A27)),COLUMN(AG$1)),\"\")","v":""},{"$f":"IFERROR(INDEX(Empresas!$B$6:$AS$46,SMALL(IF(Empresas!$B$6:$B$46=Dados!$H$37,ROW(Empresas!$B$6:$B$46)-5),ROW($A27)),COLUMN(AH$1)),\"\")","v":""},{"$f":"IFERROR(INDEX(Empresas!$B$6:$AS$46,SMALL(IF(Empresas!$B$6:$B$46=Dados!$H$37,ROW(Empresas!$B$6:$B$46)-5),ROW($A27)),COLUMN(AI$1)),\"\")","v":""},{"$f":"IFERROR(INDEX(Empresas!$B$6:$AS$46,SMALL(IF(Empresas!$B$6:$B$46=Dados!$H$37,ROW(Empresas!$B$6:$B$46)-5),ROW($A27)),COLUMN(AJ$1)),\"\")","v":""},{"$f":"IFERROR(INDEX(Empresas!$B$6:$AS$46,SMALL(IF(Empresas!$B$6:$B$46=Dados!$H$37,ROW(Empresas!$B$6:$B$46)-5),ROW($A27)),COLUMN(AK$1)),\"\")","v":""},{"$f":"IFERROR(INDEX(Empresas!$B$6:$AS$46,SMALL(IF(Empresas!$B$6:$B$46=Dados!$H$37,ROW(Empresas!$B$6:$B$46)-5),ROW($A27)),COLUMN(AL$1)),\"\")","v":""},{"$f":"IFERROR(INDEX(Empresas!$B$6:$AS$46,SMALL(IF(Empresas!$B$6:$B$46=Dados!$H$37,ROW(Empresas!$B$6:$B$46)-5),ROW($A27)),COLUMN(AM$1)),\"\")","v":""},{"$f":"IFERROR(INDEX(Empresas!$B$6:$AS$46,SMALL(IF(Empresas!$B$6:$B$46=Dados!$H$37,ROW(Empresas!$B$6:$B$46)-5),ROW($A27)),COLUMN(AN$1)),\"\")","v":""},{"$f":"IFERROR(INDEX(Empresas!$B$6:$AS$46,SMALL(IF(Empresas!$B$6:$B$46=Dados!$H$37,ROW(Empresas!$B$6:$B$46)-5),ROW($A27)),COLUMN(AO$1)),\"\")","v":""},{"$f":"IFERROR(INDEX(Empresas!$B$6:$AS$46,SMALL(IF(Empresas!$B$6:$B$46=Dados!$H$37,ROW(Empresas!$B$6:$B$46)-5),ROW($A27)),COLUMN(AP$1)),\"\")","v":""},{"$f":"IFERROR(INDEX(Empresas!$B$6:$AS$46,SMALL(IF(Empresas!$B$6:$B$46=Dados!$H$37,ROW(Empresas!$B$6:$B$46)-5),ROW($A27)),COLUMN(AQ$1)),\"\")","v":""},{"$f":"IFERROR(INDEX(Empresas!$B$6:$AS$46,SMALL(IF(Empresas!$B$6:$B$46=Dados!$H$37,ROW(Empresas!$B$6:$B$46)-5),ROW($A27)),COLUMN(AR$1)),\"\")","v":""}]
[null,{"$f":"IFERROR(INDEX(Empresas!$B$6:$AS$46,SMALL(IF(Empresas!$B$6:$B$46=Dados!$H$37,ROW(Empresas!$B$6:$B$46)-5),ROW($A28)),COLUMN(B$1)),\"\")","v":""},{"$f":"IFERROR(INDEX(Empresas!$B$6:$AS$46,SMALL(IF(Empresas!$B$6:$B$46=Dados!$H$37,ROW(Empresas!$B$6:$B$46)-5),ROW($A28)),COLUMN(C$1)),\"\")","v":""},"",{"$f":"IFERROR(INDEX(Empresas!$B$6:$AS$46,SMALL(IF(Empresas!$B$6:$B$46=Dados!$H$37,ROW(Empresas!$B$6:$B$46)-5),ROW($A28)),COLUMN(F$1)),\"\")","v":""},{"$f":"IFERROR(INDEX(Empresas!$B$6:$AS$46,SMALL(IF(Empresas!$B$6:$B$46=Dados!$H$37,ROW(Empresas!$B$6:$B$46)-5),ROW($A28)),COLUMN(G$1)),\"\")","v":""},{"$f":"IFERROR(INDEX(Empresas!$B$6:$AS$46,SMALL(IF(Empresas!$B$6:$B$46=Dados!$H$37,ROW(Empresas!$B$6:$B$46)-5),ROW($A28)),COLUMN(H$1)),\"\")","v":""},{"$f":"IFERROR(INDEX(Empresas!$B$6:$AS$46,SMALL(IF(Empresas!$B$6:$B$46=Dados!$H$37,ROW(Empresas!$B$6:$B$46)-5),ROW($A28)),COLUMN(I$1)),\"\")","v":""},{"$f":"IFERROR(INDEX(Empresas!$B$6:$AS$46,SMALL(IF(Empresas!$B$6:$B$46=Dados!$H$37,ROW(Empresas!$B$6:$B$46)-5),ROW($A28)),COLUMN(J$1)),\"\")","v":""},{"$f":"IFERROR(INDEX(Empresas!$B$6:$AS$46,SMALL(IF(Empresas!$B$6:$B$46=Dados!$H$37,ROW(Empresas!$B$6:$B$46)-5),ROW($A28)),COLUMN(K$1)),\"\")","v":""},{"$f":"IFERROR(INDEX(Empresas!$B$6:$AS$46,SMALL(IF(Empresas!$B$6:$B$46=Dados!$H$37,ROW(Empresas!$B$6:$B$46)-5),ROW($A28)),COLUMN(L$1)),\"\")","v":""},{"$f":"IFERROR(INDEX(Empresas!$B$6:$AS$46,SMALL(IF(Empresas!$B$6:$B$46=Dados!$H$37,ROW(Empresas!$B$6:$B$46)-5),ROW($A28)),COLUMN(M$1)),\"\")","v":""},{"$f":"IFERROR(INDEX(Empresas!$B$6:$AS$46,SMALL(IF(Empresas!$B$6:$B$46=Dados!$H$37,ROW(Empresas!$B$6:$B$46)-5),ROW($A28)),COLUMN(N$1)),\"\")","v":""},{"$f":"IFERROR(INDEX(Empresas!$B$6:$AS$46,SMALL(IF(Empresas!$B$6:$B$46=Dados!$H$37,ROW(Empresas!$B$6:$B$46)-5),ROW($A28)),COLUMN(O$1)),\"\")","v":""},{"$f":"IFERROR(INDEX(Empresas!$B$6:$AS$46,SMALL(IF(Empresas!$B$6:$B$46=Dados!$H$37,ROW(Empresas!$B$6:$B$46)-5),ROW($A28)),COLUMN(P$1)),\"\")","v":""},{"$f":"IFERROR(INDEX(Empresas!$B$6:$AS$46,SMALL(IF(Empresas!$B$6:$B$46=Dados!$H$37,ROW(Empresas!$B$6:$B$46)-5),ROW($A28)),COLUMN(Q$1)),\"\")","v":""},{"$f":"IFERROR(INDEX(Empresas!$B$6:$AS$46,SMALL(IF(Empresas!$B$6:$B$46=Dados!$H$37,ROW(Empresas!$B$6:$B$46)-5),ROW($A28)),COLUMN(R$1)),\"\")","v":""},{"$f":"IFERROR(INDEX(Empresas!$B$6:$AS$46,SMALL(IF(Empresas!$B$6:$B$46=Dados!$H$37,ROW(Empresas!$B$6:$B$46)-5),ROW($A28)),COLUMN(S$1)),\"\")","v":""},{"$f":"IFERROR(INDEX(Empresas!$B$6:$AS$46,SMALL(IF(Empresas!$B$6:$B$46=Dados!$H$37,ROW(Empresas!$B$6:$B$46)-5),ROW($A28)),COLUMN(T$1)),\"\")","v":""},{"$f":"IFERROR(INDEX(Empresas!$B$6:$AS$46,SMALL(IF(Empresas!$B$6:$B$46=Dados!$H$37,ROW(Empresas!$B$6:$B$46)-5),ROW($A28)),COLUMN(U$1)),\"\")","v":""},{"$f":"IFERROR(INDEX(Empresas!$B$6:$AS$46,SMALL(IF(Empresas!$B$6:$B$46=Dados!$H$37,ROW(Empresas!$B$6:$B$46)-5),ROW($A28)),COLUMN(V$1)),\"\")","v":""},{"$f":"IFERROR(INDEX(Empresas!$B$6:$AS$46,SMALL(IF(Empresas!$B$6:$B$46=Dados!$H$37,ROW(Empresas!$B$6:$B$46)-5),ROW($A28)),COLUMN(W$1)),\"\")","v":""},{"$f":"IFERROR(INDEX(Empresas!$B$6:$AS$46,SMALL(IF(Empresas!$B$6:$B$46=Dados!$H$37,ROW(Empresas!$B$6:$B$46)-5),ROW($A28)),COLUMN(X$1)),\"\")","v":""},{"$f":"IFERROR(INDEX(Empresas!$B$6:$AS$46,SMALL(IF(Empresas!$B$6:$B$46=Dados!$H$37,ROW(Empresas!$B$6:$B$46)-5),ROW($A28)),COLUMN(Y$1)),\"\")","v":""},{"$f":"IFERROR(INDEX(Empresas!$B$6:$AS$46,SMALL(IF(Empresas!$B$6:$B$46=Dados!$H$37,ROW(Empresas!$B$6:$B$46)-5),ROW($A28)),COLUMN(Z$1)),\"\")","v":""},{"$f":"IFERROR(INDEX(Empresas!$B$6:$AS$46,SMALL(IF(Empresas!$B$6:$B$46=Dados!$H$37,ROW(Empresas!$B$6:$B$46)-5),ROW($A28)),COLUMN(AA$1)),\"\")","v":""},{"$f":"IFERROR(INDEX(Empresas!$B$6:$AS$46,SMALL(IF(Empresas!$B$6:$B$46=Dados!$H$37,ROW(Empresas!$B$6:$B$46)-5),ROW($A28)),COLUMN(AB$1)),\"\")","v":""},{"$f":"IFERROR(INDEX(Empresas!$B$6:$AS$46,SMALL(IF(Empresas!$B$6:$B$46=Dados!$H$37,ROW(Empresas!$B$6:$B$46)-5),ROW($A28)),COLUMN(AC$1)),\"\")","v":""},{"$f":"IFERROR(INDEX(Empresas!$B$6:$AS$46,SMALL(IF(Empresas!$B$6:$B$46=Dados!$H$37,ROW(Empresas!$B$6:$B$46)-5),ROW($A28)),COLUMN(AD$1)),\"\")","v":""},{"$f":"IFERROR(INDEX(Empresas!$B$6:$AS$46,SMALL(IF(Empresas!$B$6:$B$46=Dados!$H$37,ROW(Empresas!$B$6:$B$46)-5),ROW($A28)),COLUMN(AE$1)),\"\")","v":""},{"$f":"IFERROR(INDEX(Empresas!$B$6:$AS$46,SMALL(IF(Empresas!$B$6:$B$46=Dados!$H$37,ROW(Empresas!$B$6:$B$46)-5),ROW($A28)),COLUMN(AF$1)),\"\")","v":""},{"$f":"IFERROR(INDEX(Empresas!$B$6:$AS$46,SMALL(IF(Empresas!$B$6:$B$46=Dados!$H$37,ROW(Empresas!$B$6:$B$46)-5),ROW($A28)),COLUMN(AG$1)),\"\")","v":""},{"$f":"IFERROR(INDEX(Empresas!$B$6:$AS$46,SMALL(IF(Empresas!$B$6:$B$46=Dados!$H$37,ROW(Empresas!$B$6:$B$46)-5),ROW($A28)),COLUMN(AH$1)),\"\")","v":""},{"$f":"IFERROR(INDEX(Empresas!$B$6:$AS$46,SMALL(IF(Empresas!$B$6:$B$46=Dados!$H$37,ROW(Empresas!$B$6:$B$46)-5),ROW($A28)),COLUMN(AI$1)),\"\")","v":""},{"$f":"IFERROR(INDEX(Empresas!$B$6:$AS$46,SMALL(IF(Empresas!$B$6:$B$46=Dados!$H$37,ROW(Empresas!$B$6:$B$46)-5),ROW($A28)),COLUMN(AJ$1)),\"\")","v":""},{"$f":"IFERROR(INDEX(Empresas!$B$6:$AS$46,SMALL(IF(Empresas!$B$6:$B$46=Dados!$H$37,ROW(Empresas!$B$6:$B$46)-5),ROW($A28)),COLUMN(AK$1)),\"\")","v":""},{"$f":"IFERROR(INDEX(Empresas!$B$6:$AS$46,SMALL(IF(Empresas!$B$6:$B$46=Dados!$H$37,ROW(Empresas!$B$6:$B$46)-5),ROW($A28)),COLUMN(AL$1)),\"\")","v":""},{"$f":"IFERROR(INDEX(Empresas!$B$6:$AS$46,SMALL(IF(Empresas!$B$6:$B$46=Dados!$H$37,ROW(Empresas!$B$6:$B$46)-5),ROW($A28)),COLUMN(AM$1)),\"\")","v":""},{"$f":"IFERROR(INDEX(Empresas!$B$6:$AS$46,SMALL(IF(Empresas!$B$6:$B$46=Dados!$H$37,ROW(Empresas!$B$6:$B$46)-5),ROW($A28)),COLUMN(AN$1)),\"\")","v":""},{"$f":"IFERROR(INDEX(Empresas!$B$6:$AS$46,SMALL(IF(Empresas!$B$6:$B$46=Dados!$H$37,ROW(Empresas!$B$6:$B$46)-5),ROW($A28)),COLUMN(AO$1)),\"\")","v":""},{"$f":"IFERROR(INDEX(Empresas!$B$6:$AS$46,SMALL(IF(Empresas!$B$6:$B$46=Dados!$H$37,ROW(Empresas!$B$6:$B$46)-5),ROW($A28)),COLUMN(AP$1)),\"\")","v":""},{"$f":"IFERROR(INDEX(Empresas!$B$6:$AS$46,SMALL(IF(Empresas!$B$6:$B$46=Dados!$H$37,ROW(Empresas!$B$6:$B$46)-5),ROW($A28)),COLUMN(AQ$1)),\"\")","v":""},{"$f":"IFERROR(INDEX(Empresas!$B$6:$AS$46,SMALL(IF(Empresas!$B$6:$B$46=Dados!$H$37,ROW(Empresas!$B$6:$B$46)-5),ROW($A28)),COLUMN(AR$1)),\"\")","v":""}]
[null,{"$f":"IFERROR(INDEX(Empresas!$B$6:$AS$46,SMALL(IF(Empresas!$B$6:$B$46=Dados!$H$37,ROW(Empresas!$B$6:$B$46)-5),ROW($A29)),COLUMN(B$1)),\"\")","v":""},{"$f":"IFERROR(INDEX(Empresas!$B$6:$AS$46,SMALL(IF(Empresas!$B$6:$B$46=Dados!$H$37,ROW(Empresas!$B$6:$B$46)-5),ROW($A29)),COLUMN(C$1)),\"\")","v":""},"",{"$f":"IFERROR(INDEX(Empresas!$B$6:$AS$46,SMALL(IF(Empresas!$B$6:$B$46=Dados!$H$37,ROW(Empresas!$B$6:$B$46)-5),ROW($A29)),COLUMN(F$1)),\"\")","v":""},{"$f":"IFERROR(INDEX(Empresas!$B$6:$AS$46,SMALL(IF(Empresas!$B$6:$B$46=Dados!$H$37,ROW(Empresas!$B$6:$B$46)-5),ROW($A29)),COLUMN(G$1)),\"\")","v":""},{"$f":"IFERROR(INDEX(Empresas!$B$6:$AS$46,SMALL(IF(Empresas!$B$6:$B$46=Dados!$H$37,ROW(Empresas!$B$6:$B$46)-5),ROW($A29)),COLUMN(H$1)),\"\")","v":""},{"$f":"IFERROR(INDEX(Empresas!$B$6:$AS$46,SMALL(IF(Empresas!$B$6:$B$46=Dados!$H$37,ROW(Empresas!$B$6:$B$46)-5),ROW($A29)),COLUMN(I$1)),\"\")","v":""},{"$f":"IFERROR(INDEX(Empresas!$B$6:$AS$46,SMALL(IF(Empresas!$B$6:$B$46=Dados!$H$37,ROW(Empresas!$B$6:$B$46)-5),ROW($A29)),COLUMN(J$1)),\"\")","v":""},{"$f":"IFERROR(INDEX(Empresas!$B$6:$AS$46,SMALL(IF(Empresas!$B$6:$B$46=Dados!$H$37,ROW(Empresas!$B$6:$B$46)-5),ROW($A29)),COLUMN(K$1)),\"\")","v":""},{"$f":"IFERROR(INDEX(Empresas!$B$6:$AS$46,SMALL(IF(Empresas!$B$6:$B$46=Dados!$H$37,ROW(Empresas!$B$6:$B$46)-5),ROW($A29)),COLUMN(L$1)),\"\")","v":""},{"$f":"IFERROR(INDEX(Empresas!$B$6:$AS$46,SMALL(IF(Empresas!$B$6:$B$46=Dados!$H$37,ROW(Empresas!$B$6:$B$46)-5),ROW($A29)),COLUMN(M$1)),\"\")","v":""},{"$f":"IFERROR(INDEX(Empresas!$B$6:$AS$46,SMALL(IF(Empresas!$B$6:$B$46=Dados!$H$37,ROW(Empresas!$B$6:$B$46)-5),ROW($A29)),COLUMN(N$1)),\"\")","v":""},{"$f":"IFERROR(INDEX(Empresas!$B$6:$AS$46,SMALL(IF(Empresas!$B$6:$B$46=Dados!$H$37,ROW(Empresas!$B$6:$B$46)-5),ROW($A29)),COLUMN(O$1)),\"\")","v":""},{"$f":"IFERROR(INDEX(Empresas!$B$6:$AS$46,SMALL(IF(Empresas!$B$6:$B$46=Dados!$H$37,ROW(Empresas!$B$6:$B$46)-5),ROW($A29)),COLUMN(P$1)),\"\")","v":""},{"$f":"IFERROR(INDEX(Empresas!$B$6:$AS$46,SMALL(IF(Empresas!$B$6:$B$46=Dados!$H$37,ROW(Empresas!$B$6:$B$46)-5),ROW($A29)),COLUMN(Q$1)),\"\")","v":""},{"$f":"IFERROR(INDEX(Empresas!$B$6:$AS$46,SMALL(IF(Empresas!$B$6:$B$46=Dados!$H$37,ROW(Empresas!$B$6:$B$46)-5),ROW($A29)),COLUMN(R$1)),\"\")","v":""},{"$f":"IFERROR(INDEX(Empresas!$B$6:$AS$46,SMALL(IF(Empresas!$B$6:$B$46=Dados!$H$37,ROW(Empresas!$B$6:$B$46)-5),ROW($A29)),COLUMN(S$1)),\"\")","v":""},{"$f":"IFERROR(INDEX(Empresas!$B$6:$AS$46,SMALL(IF(Empresas!$B$6:$B$46=Dados!$H$37,ROW(Empresas!$B$6:$B$46)-5),ROW($A29)),COLUMN(T$1)),\"\")","v":""},{"$f":"IFERROR(INDEX(Empresas!$B$6:$AS$46,SMALL(IF(Empresas!$B$6:$B$46=Dados!$H$37,ROW(Empresas!$B$6:$B$46)-5),ROW($A29)),COLUMN(U$1)),\"\")","v":""},{"$f":"IFERROR(INDEX(Empresas!$B$6:$AS$46,SMALL(IF(Empresas!$B$6:$B$46=Dados!$H$37,ROW(Empresas!$B$6:$B$46)-5),ROW($A29)),COLUMN(V$1)),\"\")","v":""},{"$f":"IFERROR(INDEX(Empresas!$B$6:$AS$46,SMALL(IF(Empresas!$B$6:$B$46=Dados!$H$37,ROW(Empresas!$B$6:$B$46)-5),ROW($A29)),COLUMN(W$1)),\"\")","v":""},{"$f":"IFERROR(INDEX(Empresas!$B$6:$AS$46,SMALL(IF(Empresas!$B$6:$B$46=Dados!$H$37,ROW(Empresas!$B$6:$B$46)-5),ROW($A29)),COLUMN(X$1)),\"\")","v":""},{"$f":"IFERROR(INDEX(Empresas!$B$6:$AS$46,SMALL(IF(Empresas!$B$6:$B$46=Dados!$H$37,ROW(Empresas!$B$6:$B$46)-5),ROW($A29)),COLUMN(Y$1)),\"\")","v":""},{"$f":"IFERROR(INDEX(Empresas!$B$6:$AS$46,SMALL(IF(Empresas!$B$6:$B$46=Dados!$H$37,ROW(Empresas!$B$6:$B$46)-5),ROW($A29)),COLUMN(Z$1)),\"\")","v":""},{"$f":"IFERROR(INDEX(Empresas!$B$6:$AS$46,SMALL(IF(Empresas!$B$6:$B$46=Dados!$H$37,ROW(Empresas!$B$6:$B$46)-5),ROW($A29)),COLUMN(AA$1)),\"\")","v":""},{"$f":"IFERROR(INDEX(Empresas!$B$6:$AS$46,SMALL(IF(Empresas!$B$6:$B$46=Dados!$H$37,ROW(Empresas!$B$6:$B$46)-5),ROW($A29)),COLUMN(AB$1)),\"\")","v":""},{"$f":"IFERROR(INDEX(Empresas!$B$6:$AS$46,SMALL(IF(Empresas!$B$6:$B$46=Dados!$H$37,ROW(Empresas!$B$6:$B$46)-5),ROW($A29)),COLUMN(AC$1)),\"\")","v":""},{"$f":"IFERROR(INDEX(Empresas!$B$6:$AS$46,SMALL(IF(Empresas!$B$6:$B$46=Dados!$H$37,ROW(Empresas!$B$6:$B$46)-5),ROW($A29)),COLUMN(AD$1)),\"\")","v":""},{"$f":"IFERROR(INDEX(Empresas!$B$6:$AS$46,SMALL(IF(Empresas!$B$6:$B$46=Dados!$H$37,ROW(Empresas!$B$6:$B$46)-5),ROW($A29)),COLUMN(AE$1)),\"\")","v":""},{"$f":"IFERROR(INDEX(Empresas!$B$6:$AS$46,SMALL(IF(Empresas!$B$6:$B$46=Dados!$H$37,ROW(Empresas!$B$6:$B$46)-5),ROW($A29)),COLUMN(AF$1)),\"\")","v":""},{"$f":"IFERROR(INDEX(Empresas!$B$6:$AS$46,SMALL(IF(Empresas!$B$6:$B$46=Dados!$H$37,ROW(Empresas!$B$6:$B$46)-5),ROW($A29)),COLUMN(AG$1)),\"\")","v":""},{"$f":"IFERROR(INDEX(Empresas!$B$6:$AS$46,SMALL(IF(Empresas!$B$6:$B$46=Dados!$H$37,ROW(Empresas!$B$6:$B$46)-5),ROW($A29)),COLUMN(AH$1)),\"\")","v":""},{"$f":"IFERROR(INDEX(Empresas!$B$6:$AS$46,SMALL(IF(Empresas!$B$6:$B$46=Dados!$H$37,ROW(Empresas!$B$6:$B$46)-5),ROW($A29)),COLUMN(AI$1)),\"\")","v":""},{"$f":"IFERROR(INDEX(Empresas!$B$6:$AS$46,SMALL(IF(Empresas!$B$6:$B$46=Dados!$H$37,ROW(Empresas!$B$6:$B$46)-5),ROW($A29)),COLUMN(AJ$1)),\"\")","v":""},{"$f":"IFERROR(INDEX(Empresas!$B$6:$AS$46,SMALL(IF(Empresas!$B$6:$B$46=Dados!$H$37,ROW(Empresas!$B$6:$B$46)-5),ROW($A29)),COLUMN(AK$1)),\"\")","v":""},{"$f":"IFERROR(INDEX(Empresas!$B$6:$AS$46,SMALL(IF(Empresas!$B$6:$B$46=Dados!$H$37,ROW(Empresas!$B$6:$B$46)-5),ROW($A29)),COLUMN(AL$1)),\"\")","v":""},{"$f":"IFERROR(INDEX(Empresas!$B$6:$AS$46,SMALL(IF(Empresas!$B$6:$B$46=Dados!$H$37,ROW(Empresas!$B$6:$B$46)-5),ROW($A29)),COLUMN(AM$1)),\"\")","v":""},{"$f":"IFERROR(INDEX(Empresas!$B$6:$AS$46,SMALL(IF(Empresas!$B$6:$B$46=Dados!$H$37,ROW(Empresas!$B$6:$B$46)-5),ROW($A29)),COLUMN(AN$1)),\"\")","v":""},{"$f":"IFERROR(INDEX(Empresas!$B$6:$AS$46,SMALL(IF(Empresas!$B$6:$B$46=Dados!$H$37,ROW(Empresas!$B$6:$B$46)-5),ROW($A29)),COLUMN(AO$1)),\"\")","v":""},{"$f":"IFERROR(INDEX(Empresas!$B$6:$AS$46,SMALL(IF(Empresas!$B$6:$B$46=Dados!$H$37,ROW(Empresas!$B$6:$B$46)-5),ROW($A29)),COLUMN(AP$1)),\"\")","v":""},{"$f":"IFERROR(INDEX(Empresas!$B$6:$AS$46,SMALL(IF(Empresas!$B$6:$B$46=Dados!$H$37,ROW(Empresas!$B$6:$B$46)-5),ROW($A29)),COLUMN(AQ$1)),\"\")","v":""},{"$f":"IFERROR(INDEX(Empresas!$B$6:$AS$46,SMALL(IF(Empresas!$B$6:$B$46=Dados!$H$37,ROW(Empresas!$B$6:$B$46)-5),ROW($A29)),COLUMN(AR$1)),\"\")","v":""}]
[null,{"$f":"IFERROR(INDEX(Empresas!$B$6:$AS$46,SMALL(IF(Empresas!$B$6:$B$46=Dados!$H$37,ROW(Empresas!$B$6:$B$46)-5),ROW($A30)),COLUMN(B$1)),\"\")","v":""},{"$f":"IFERROR(INDEX(Empresas!$B$6:$AS$46,SMALL(IF(Empresas!$B$6:$B$46=Dados!$H$37,ROW(Empresas!$B$6:$B$46)-5),ROW($A30)),COLUMN(C$1)),\"\")","v":""},"",{"$f":"IFERROR(INDEX(Empresas!$B$6:$AS$46,SMALL(IF(Empresas!$B$6:$B$46=Dados!$H$37,ROW(Empresas!$B$6:$B$46)-5),ROW($A30)),COLUMN(F$1)),\"\")","v":""},{"$f":"IFERROR(INDEX(Empresas!$B$6:$AS$46,SMALL(IF(Empresas!$B$6:$B$46=Dados!$H$37,ROW(Empresas!$B$6:$B$46)-5),ROW($A30)),COLUMN(G$1)),\"\")","v":""},{"$f":"IFERROR(INDEX(Empresas!$B$6:$AS$46,SMALL(IF(Empresas!$B$6:$B$46=Dados!$H$37,ROW(Empresas!$B$6:$B$46)-5),ROW($A30)),COLUMN(H$1)),\"\")","v":""},{"$f":"IFERROR(INDEX(Empresas!$B$6:$AS$46,SMALL(IF(Empresas!$B$6:$B$46=Dados!$H$37,ROW(Empresas!$B$6:$B$46)-5),ROW($A30)),COLUMN(I$1)),\"\")","v":""},{"$f":"IFERROR(INDEX(Empresas!$B$6:$AS$46,SMALL(IF(Empresas!$B$6:$B$46=Dados!$H$37,ROW(Empresas!$B$6:$B$46)-5),ROW($A30)),COLUMN(J$1)),\"\")","v":""},{"$f":"IFERROR(INDEX(Empresas!$B$6:$AS$46,SMALL(IF(Empresas!$B$6:$B$46=Dados!$H$37,ROW(Empresas!$B$6:$B$46)-5),ROW($A30)),COLUMN(K$1)),\"\")","v":""},{"$f":"IFERROR(INDEX(Empresas!$B$6:$AS$46,SMALL(IF(Empresas!$B$6:$B$46=Dados!$H$37,ROW(Empresas!$B$6:$B$46)-5),ROW($A30)),COLUMN(L$1)),\"\")","v":""},{"$f":"IFERROR(INDEX(Empresas!$B$6:$AS$46,SMALL(IF(Empresas!$B$6:$B$46=Dados!$H$37,ROW(Empresas!$B$6:$B$46)-5),ROW($A30)),COLUMN(M$1)),\"\")","v":""},{"$f":"IFERROR(INDEX(Empresas!$B$6:$AS$46,SMALL(IF(Empresas!$B$6:$B$46=Dados!$H$37,ROW(Empresas!$B$6:$B$46)-5),ROW($A30)),COLUMN(N$1)),\"\")","v":""},{"$f":"IFERROR(INDEX(Empresas!$B$6:$AS$46,SMALL(IF(Empresas!$B$6:$B$46=Dados!$H$37,ROW(Empresas!$B$6:$B$46)-5),ROW($A30)),COLUMN(O$1)),\"\")","v":""},{"$f":"IFERROR(INDEX(Empresas!$B$6:$AS$46,SMALL(IF(Empresas!$B$6:$B$46=Dados!$H$37,ROW(Empresas!$B$6:$B$46)-5),ROW($A30)),COLUMN(P$1)),\"\")","v":""},{"$f":"IFERROR(INDEX(Empresas!$B$6:$AS$46,SMALL(IF(Empresas!$B$6:$B$46=Dados!$H$37,ROW(Empresas!$B$6:$B$46)-5),ROW($A30)),COLUMN(Q$1)),\"\")","v":""},{"$f":"IFERROR(INDEX(Empresas!$B$6:$AS$46,SMALL(IF(Empresas!$B$6:$B$46=Dados!$H$37,ROW(Empresas!$B$6:$B$46)-5),ROW($A30)),COLUMN(R$1)),\"\")","v":""},{"$f":"IFERROR(INDEX(Empresas!$B$6:$AS$46,SMALL(IF(Empresas!$B$6:$B$46=Dados!$H$37,ROW(Empresas!$B$6:$B$46)-5),ROW($A30)),COLUMN(S$1)),\"\")","v":""},{"$f":"IFERROR(INDEX(Empresas!$B$6:$AS$46,SMALL(IF(Empresas!$B$6:$B$46=Dados!$H$37,ROW(Empresas!$B$6:$B$46)-5),ROW($A30)),COLUMN(T$1)),\"\")","v":""},{"$f":"IFERROR(INDEX(Empresas!$B$6:$AS$46,SMALL(IF(Empresas!$B$6:$B$46=Dados!$H$37,ROW(Empresas!$B$6:$B$46)-5),ROW($A30)),COLUMN(U$1)),\"\")","v":""},{"$f":"IFERROR(INDEX(Empresas!$B$6:$AS$46,SMALL(IF(Empresas!$B$6:$B$46=Dados!$H$37,ROW(Empresas!$B$6:$B$46)-5),ROW($A30)),COLUMN(V$1)),\"\")","v":""},{"$f":"IFERROR(INDEX(Empresas!$B$6:$AS$46,SMALL(IF(Empresas!$B$6:$B$46=Dados!$H$37,ROW(Empresas!$B$6:$B$46)-5),ROW($A30)),COLUMN(W$1)),\"\")","v":""},{"$f":"IFERROR(INDEX(Empresas!$B$6:$AS$46,SMALL(IF(Empresas!$B$6:$B$46=Dados!$H$37,ROW(Empresas!$B$6:$B$46)-5),ROW($A30)),COLUMN(X$1)),\"\")","v":""},{"$f":"IFERROR(INDEX(Empresas!$B$6:$AS$46,SMALL(IF(Empresas!$B$6:$B$46=Dados!$H$37,ROW(Empresas!$B$6:$B$46)-5),ROW($A30)),COLUMN(Y$1)),\"\")","v":""},{"$f":"IFERROR(INDEX(Empresas!$B$6:$AS$46,SMALL(IF(Empresas!$B$6:$B$46=Dados!$H$37,ROW(Empresas!$B$6:$B$46)-5),ROW($A30)),COLUMN(Z$1)),\"\")","v":""},{"$f":"IFERROR(INDEX(Empresas!$B$6:$AS$46,SMALL(IF(Empresas!$B$6:$B$46=Dados!$H$37,ROW(Empresas!$B$6:$B$46)-5),ROW($A30)),COLUMN(AA$1)),\"\")","v":""},{"$f":"IFERROR(INDEX(Empresas!$B$6:$AS$46,SMALL(IF(Empresas!$B$6:$B$46=Dados!$H$37,ROW(Empresas!$B$6:$B$46)-5),ROW($A30)),COLUMN(AB$1)),\"\")","v":""},{"$f":"IFERROR(INDEX(Empresas!$B$6:$AS$46,SMALL(IF(Empresas!$B$6:$B$46=Dados!$H$37,ROW(Empresas!$B$6:$B$46)-5),ROW($A30)),COLUMN(AC$1)),\"\")","v":""},{"$f":"IFERROR(INDEX(Empresas!$B$6:$AS$46,SMALL(IF(Empresas!$B$6:$B$46=Dados!$H$37,ROW(Empresas!$B$6:$B$46)-5),ROW($A30)),COLUMN(AD$1)),\"\")","v":""},{"$f":"IFERROR(INDEX(Empresas!$B$6:$AS$46,SMALL(IF(Empresas!$B$6:$B$46=Dados!$H$37,ROW(Empresas!$B$6:$B$46)-5),ROW($A30)),COLUMN(AE$1)),\"\")","v":""},{"$f":"IFERROR(INDEX(Empresas!$B$6:$AS$46,SMALL(IF(Empresas!$B$6:$B$46=Dados!$H$37,ROW(Empresas!$B$6:$B$46)-5),ROW($A30)),COLUMN(AF$1)),\"\")","v":""},{"$f":"IFERROR(INDEX(Empresas!$B$6:$AS$46,SMALL(IF(Empresas!$B$6:$B$46=Dados!$H$37,ROW(Empresas!$B$6:$B$46)-5),ROW($A30)),COLUMN(AG$1)),\"\")","v":""},{"$f":"IFERROR(INDEX(Empresas!$B$6:$AS$46,SMALL(IF(Empresas!$B$6:$B$46=Dados!$H$37,ROW(Empresas!$B$6:$B$46)-5),ROW($A30)),COLUMN(AH$1)),\"\")","v":""},{"$f":"IFERROR(INDEX(Empresas!$B$6:$AS$46,SMALL(IF(Empresas!$B$6:$B$46=Dados!$H$37,ROW(Empresas!$B$6:$B$46)-5),ROW($A30)),COLUMN(AI$1)),\"\")","v":""},{"$f":"IFERROR(INDEX(Empresas!$B$6:$AS$46,SMALL(IF(Empresas!$B$6:$B$46=Dados!$H$37,ROW(Empresas!$B$6:$B$46)-5),ROW($A30)),COLUMN(AJ$1)),\"\")","v":""},{"$f":"IFERROR(INDEX(Empresas!$B$6:$AS$46,SMALL(IF(Empresas!$B$6:$B$46=Dados!$H$37,ROW(Empresas!$B$6:$B$46)-5),ROW($A30)),COLUMN(AK$1)),\"\")","v":""},{"$f":"IFERROR(INDEX(Empresas!$B$6:$AS$46,SMALL(IF(Empresas!$B$6:$B$46=Dados!$H$37,ROW(Empresas!$B$6:$B$46)-5),ROW($A30)),COLUMN(AL$1)),\"\")","v":""},{"$f":"IFERROR(INDEX(Empresas!$B$6:$AS$46,SMALL(IF(Empresas!$B$6:$B$46=Dados!$H$37,ROW(Empresas!$B$6:$B$46)-5),ROW($A30)),COLUMN(AM$1)),\"\")","v":""},{"$f":"IFERROR(INDEX(Empresas!$B$6:$AS$46,SMALL(IF(Empresas!$B$6:$B$46=Dados!$H$37,ROW(Empresas!$B$6:$B$46)-5),ROW($A30)),COLUMN(AN$1)),\"\")","v":""},{"$f":"IFERROR(INDEX(Empresas!$B$6:$AS$46,SMALL(IF(Empresas!$B$6:$B$46=Dados!$H$37,ROW(Empresas!$B$6:$B$46)-5),ROW($A30)),COLUMN(AO$1)),\"\")","v":""},{"$f":"IFERROR(INDEX(Empresas!$B$6:$AS$46,SMALL(IF(Empresas!$B$6:$B$46=Dados!$H$37,ROW(Empresas!$B$6:$B$46)-5),ROW($A30)),COLUMN(AP$1)),\"\")","v":""},{"$f":"IFERROR(INDEX(Empresas!$B$6:$AS$46,SMALL(IF(Empresas!$B$6:$B$46=Dados!$H$37,ROW(Empresas!$B$6:$B$46)-5),ROW($A30)),COLUMN(AQ$1)),\"\")","v":""},{"$f":"IFERROR(INDEX(Empresas!$B$6:$AS$46,SMALL(IF(Empresas!$B$6:$B$46=Dados!$H$37,ROW(Empresas!$B$6:$B$46)-5),ROW($A30)),COLUMN(AR$1)),\"\")","v":""}]
[null,{"$f":"IFERROR(INDEX(Empresas!$B$6:$AS$46,SMALL(IF(Empresas!$B$6:$B$46=Dados!$H$37,ROW(Empresas!$B$6:$B$46)-5),ROW($A31)),COLUMN(B$1)),\"\")","v":""},{"$f":"IFERROR(INDEX(Empresas!$B$6:$AS$46,SMALL(IF(Empresas!$B$6:$B$46=Dados!$H$37,ROW(Empresas!$B$6:$B$46)-5),ROW($A31)),COLUMN(C$1)),\"\")","v":""},"",{"$f":"IFERROR(INDEX(Empresas!$B$6:$AS$46,SMALL(IF(Empresas!$B$6:$B$46=Dados!$H$37,ROW(Empresas!$B$6:$B$46)-5),ROW($A31)),COLUMN(F$1)),\"\")","v":""},{"$f":"IFERROR(INDEX(Empresas!$B$6:$AS$46,SMALL(IF(Empresas!$B$6:$B$46=Dados!$H$37,ROW(Empresas!$B$6:$B$46)-5),ROW($A31)),COLUMN(G$1)),\"\")","v":""},{"$f":"IFERROR(INDEX(Empresas!$B$6:$AS$46,SMALL(IF(Empresas!$B$6:$B$46=Dados!$H$37,ROW(Empresas!$B$6:$B$46)-5),ROW($A31)),COLUMN(H$1)),\"\")","v":""},{"$f":"IFERROR(INDEX(Empresas!$B$6:$AS$46,SMALL(IF(Empresas!$B$6:$B$46=Dados!$H$37,ROW(Empresas!$B$6:$B$46)-5),ROW($A31)),COLUMN(I$1)),\"\")","v":""},{"$f":"IFERROR(INDEX(Empresas!$B$6:$AS$46,SMALL(IF(Empresas!$B$6:$B$46=Dados!$H$37,ROW(Empresas!$B$6:$B$46)-5),ROW($A31)),COLUMN(J$1)),\"\")","v":""},{"$f":"IFERROR(INDEX(Empresas!$B$6:$AS$46,SMALL(IF(Empresas!$B$6:$B$46=Dados!$H$37,ROW(Empresas!$B$6:$B$46)-5),ROW($A31)),COLUMN(K$1)),\"\")","v":""},{"$f":"IFERROR(INDEX(Empresas!$B$6:$AS$46,SMALL(IF(Empresas!$B$6:$B$46=Dados!$H$37,ROW(Empresas!$B$6:$B$46)-5),ROW($A31)),COLUMN(L$1)),\"\")","v":""},{"$f":"IFERROR(INDEX(Empresas!$B$6:$AS$46,SMALL(IF(Empresas!$B$6:$B$46=Dados!$H$37,ROW(Empresas!$B$6:$B$46)-5),ROW($A31)),COLUMN(M$1)),\"\")","v":""},{"$f":"IFERROR(INDEX(Empresas!$B$6:$AS$46,SMALL(IF(Empresas!$B$6:$B$46=Dados!$H$37,ROW(Empresas!$B$6:$B$46)-5),ROW($A31)),COLUMN(N$1)),\"\")","v":""},{"$f":"IFERROR(INDEX(Empresas!$B$6:$AS$46,SMALL(IF(Empresas!$B$6:$B$46=Dados!$H$37,ROW(Empresas!$B$6:$B$46)-5),ROW($A31)),COLUMN(O$1)),\"\")","v":""},{"$f":"IFERROR(INDEX(Empresas!$B$6:$AS$46,SMALL(IF(Empresas!$B$6:$B$46=Dados!$H$37,ROW(Empresas!$B$6:$B$46)-5),ROW($A31)),COLUMN(P$1)),\"\")","v":""},{"$f":"IFERROR(INDEX(Empresas!$B$6:$AS$46,SMALL(IF(Empresas!$B$6:$B$46=Dados!$H$37,ROW(Empresas!$B$6:$B$46)-5),ROW($A31)),COLUMN(Q$1)),\"\")","v":""},{"$f":"IFERROR(INDEX(Empresas!$B$6:$AS$46,SMALL(IF(Empresas!$B$6:$B$46=Dados!$H$37,ROW(Empresas!$B$6:$B$46)-5),ROW($A31)),COLUMN(R$1)),\"\")","v":""},{"$f":"IFERROR(INDEX(Empresas!$B$6:$AS$46,SMALL(IF(Empresas!$B$6:$B$46=Dados!$H$37,ROW(Empresas!$B$6:$B$46)-5),ROW($A31)),COLUMN(S$1)),\"\")","v":""},{"$f":"IFERROR(INDEX(Empresas!$B$6:$AS$46,SMALL(IF(Empresas!$B$6:$B$46=Dados!$H$37,ROW(Empresas!$B$6:$B$46)-5),ROW($A31)),COLUMN(T$1)),\"\")","v":""},{"$f":"IFERROR(INDEX(Empresas!$B$6:$AS$46,SMALL(IF(Empresas!$B$6:$B$46=Dados!$H$37,ROW(Empresas!$B$6:$B$46)-5),ROW($A31)),COLUMN(U$1)),\"\")","v":""},{"$f":"IFERROR(INDEX(Empresas!$B$6:$AS$46,SMALL(IF(Empresas!$B$6:$B$46=Dados!$H$37,ROW(Empresas!$B$6:$B$46)-5),ROW($A31)),COLUMN(V$1)),\"\")","v":""},{"$f":"IFERROR(INDEX(Empresas!$B$6:$AS$46,SMALL(IF(Empresas!$B$6:$B$46=Dados!$H$37,ROW(Empresas!$B$6:$B$46)-5),ROW($A31)),COLUMN(W$1)),\"\")","v":""},{"$f":"IFERROR(INDEX(Empresas!$B$6:$AS$46,SMALL(IF(Empresas!$B$6:$B$46=Dados!$H$37,ROW(Empresas!$B$6:$B$46)-5),ROW($A31)),COLUMN(X$1)),\"\")","v":""},{"$f":"IFERROR(INDEX(Empresas!$B$6:$AS$46,SMALL(IF(Empresas!$B$6:$B$46=Dados!$H$37,ROW(Empresas!$B$6:$B$46)-5),ROW($A31)),COLUMN(Y$1)),\"\")","v":""},{"$f":"IFERROR(INDEX(Empresas!$B$6:$AS$46,SMALL(IF(Empresas!$B$6:$B$46=Dados!$H$37,ROW(Empresas!$B$6:$B$46)-5),ROW($A31)),COLUMN(Z$1)),\"\")","v":""},{"$f":"IFERROR(INDEX(Empresas!$B$6:$AS$46,SMALL(IF(Empresas!$B$6:$B$46=Dados!$H$37,ROW(Empresas!$B$6:$B$46)-5),ROW($A31)),COLUMN(AA$1)),\"\")","v":""},{"$f":"IFERROR(INDEX(Empresas!$B$6:$AS$46,SMALL(IF(Empresas!$B$6:$B$46=Dados!$H$37,ROW(Empresas!$B$6:$B$46)-5),ROW($A31)),COLUMN(AB$1)),\"\")","v":""},{"$f":"IFERROR(INDEX(Empresas!$B$6:$AS$46,SMALL(IF(Empresas!$B$6:$B$46=Dados!$H$37,ROW(Empresas!$B$6:$B$46)-5),ROW($A31)),COLUMN(AC$1)),\"\")","v":""},{"$f":"IFERROR(INDEX(Empresas!$B$6:$AS$46,SMALL(IF(Empresas!$B$6:$B$46=Dados!$H$37,ROW(Empresas!$B$6:$B$46)-5),ROW($A31)),COLUMN(AD$1)),\"\")","v":""},{"$f":"IFERROR(INDEX(Empresas!$B$6:$AS$46,SMALL(IF(Empresas!$B$6:$B$46=Dados!$H$37,ROW(Empresas!$B$6:$B$46)-5),ROW($A31)),COLUMN(AE$1)),\"\")","v":""},{"$f":"IFERROR(INDEX(Empresas!$B$6:$AS$46,SMALL(IF(Empresas!$B$6:$B$46=Dados!$H$37,ROW(Empresas!$B$6:$B$46)-5),ROW($A31)),COLUMN(AF$1)),\"\")","v":""},{"$f":"IFERROR(INDEX(Empresas!$B$6:$AS$46,SMALL(IF(Empresas!$B$6:$B$46=Dados!$H$37,ROW(Empresas!$B$6:$B$46)-5),ROW($A31)),COLUMN(AG$1)),\"\")","v":""},{"$f":"IFERROR(INDEX(Empresas!$B$6:$AS$46,SMALL(IF(Empresas!$B$6:$B$46=Dados!$H$37,ROW(Empresas!$B$6:$B$46)-5),ROW($A31)),COLUMN(AH$1)),\"\")","v":""},{"$f":"IFERROR(INDEX(Empresas!$B$6:$AS$46,SMALL(IF(Empresas!$B$6:$B$46=Dados!$H$37,ROW(Empresas!$B$6:$B$46)-5),ROW($A31)),COLUMN(AI$1)),\"\")","v":""},{"$f":"IFERROR(INDEX(Empresas!$B$6:$AS$46,SMALL(IF(Empresas!$B$6:$B$46=Dados!$H$37,ROW(Empresas!$B$6:$B$46)-5),ROW($A31)),COLUMN(AJ$1)),\"\")","v":""},{"$f":"IFERROR(INDEX(Empresas!$B$6:$AS$46,SMALL(IF(Empresas!$B$6:$B$46=Dados!$H$37,ROW(Empresas!$B$6:$B$46)-5),ROW($A31)),COLUMN(AK$1)),\"\")","v":""},{"$f":"IFERROR(INDEX(Empresas!$B$6:$AS$46,SMALL(IF(Empresas!$B$6:$B$46=Dados!$H$37,ROW(Empresas!$B$6:$B$46)-5),ROW($A31)),COLUMN(AL$1)),\"\")","v":""},{"$f":"IFERROR(INDEX(Empresas!$B$6:$AS$46,SMALL(IF(Empresas!$B$6:$B$46=Dados!$H$37,ROW(Empresas!$B$6:$B$46)-5),ROW($A31)),COLUMN(AM$1)),\"\")","v":""},{"$f":"IFERROR(INDEX(Empresas!$B$6:$AS$46,SMALL(IF(Empresas!$B$6:$B$46=Dados!$H$37,ROW(Empresas!$B$6:$B$46)-5),ROW($A31)),COLUMN(AN$1)),\"\")","v":""},{"$f":"IFERROR(INDEX(Empresas!$B$6:$AS$46,SMALL(IF(Empresas!$B$6:$B$46=Dados!$H$37,ROW(Empresas!$B$6:$B$46)-5),ROW($A31)),COLUMN(AO$1)),\"\")","v":""},{"$f":"IFERROR(INDEX(Empresas!$B$6:$AS$46,SMALL(IF(Empresas!$B$6:$B$46=Dados!$H$37,ROW(Empresas!$B$6:$B$46)-5),ROW($A31)),COLUMN(AP$1)),\"\")","v":""},{"$f":"IFERROR(INDEX(Empresas!$B$6:$AS$46,SMALL(IF(Empresas!$B$6:$B$46=Dados!$H$37,ROW(Empresas!$B$6:$B$46)-5),ROW($A31)),COLUMN(AQ$1)),\"\")","v":""},{"$f":"IFERROR(INDEX(Empresas!$B$6:$AS$46,SMALL(IF(Empresas!$B$6:$B$46=Dados!$H$37,ROW(Empresas!$B$6:$B$46)-5),ROW($A31)),COLUMN(AR$1)),\"\")","v":""}]
[null,{"$f":"IFERROR(INDEX(Empresas!$B$6:$AS$46,SMALL(IF(Empresas!$B$6:$B$46=Dados!$H$37,ROW(Empresas!$B$6:$B$46)-5),ROW($A32)),COLUMN(B$1)),\"\")","v":""},{"$f":"IFERROR(INDEX(Empresas!$B$6:$AS$46,SMALL(IF(Empresas!$B$6:$B$46=Dados!$H$37,ROW(Empresas!$B$6:$B$46)-5),ROW($A32)),COLUMN(C$1)),\"\")","v":""},"",{"$f":"IFERROR(INDEX(Empresas!$B$6:$AS$46,SMALL(IF(Empresas!$B$6:$B$46=Dados!$H$37,ROW(Empresas!$B$6:$B$46)-5),ROW($A32)),COLUMN(F$1)),\"\")","v":""},{"$f":"IFERROR(INDEX(Empresas!$B$6:$AS$46,SMALL(IF(Empresas!$B$6:$B$46=Dados!$H$37,ROW(Empresas!$B$6:$B$46)-5),ROW($A32)),COLUMN(G$1)),\"\")","v":""},{"$f":"IFERROR(INDEX(Empresas!$B$6:$AS$46,SMALL(IF(Empresas!$B$6:$B$46=Dados!$H$37,ROW(Empresas!$B$6:$B$46)-5),ROW($A32)),COLUMN(H$1)),\"\")","v":""},{"$f":"IFERROR(INDEX(Empresas!$B$6:$AS$46,SMALL(IF(Empresas!$B$6:$B$46=Dados!$H$37,ROW(Empresas!$B$6:$B$46)-5),ROW($A32)),COLUMN(I$1)),\"\")","v":""},{"$f":"IFERROR(INDEX(Empresas!$B$6:$AS$46,SMALL(IF(Empresas!$B$6:$B$46=Dados!$H$37,ROW(Empresas!$B$6:$B$46)-5),ROW($A32)),COLUMN(J$1)),\"\")","v":""},{"$f":"IFERROR(INDEX(Empresas!$B$6:$AS$46,SMALL(IF(Empresas!$B$6:$B$46=Dados!$H$37,ROW(Empresas!$B$6:$B$46)-5),ROW($A32)),COLUMN(K$1)),\"\")","v":""},{"$f":"IFERROR(INDEX(Empresas!$B$6:$AS$46,SMALL(IF(Empresas!$B$6:$B$46=Dados!$H$37,ROW(Empresas!$B$6:$B$46)-5),ROW($A32)),COLUMN(L$1)),\"\")","v":""},{"$f":"IFERROR(INDEX(Empresas!$B$6:$AS$46,SMALL(IF(Empresas!$B$6:$B$46=Dados!$H$37,ROW(Empresas!$B$6:$B$46)-5),ROW($A32)),COLUMN(M$1)),\"\")","v":""},{"$f":"IFERROR(INDEX(Empresas!$B$6:$AS$46,SMALL(IF(Empresas!$B$6:$B$46=Dados!$H$37,ROW(Empresas!$B$6:$B$46)-5),ROW($A32)),COLUMN(N$1)),\"\")","v":""},{"$f":"IFERROR(INDEX(Empresas!$B$6:$AS$46,SMALL(IF(Empresas!$B$6:$B$46=Dados!$H$37,ROW(Empresas!$B$6:$B$46)-5),ROW($A32)),COLUMN(O$1)),\"\")","v":""},{"$f":"IFERROR(INDEX(Empresas!$B$6:$AS$46,SMALL(IF(Empresas!$B$6:$B$46=Dados!$H$37,ROW(Empresas!$B$6:$B$46)-5),ROW($A32)),COLUMN(P$1)),\"\")","v":""},{"$f":"IFERROR(INDEX(Empresas!$B$6:$AS$46,SMALL(IF(Empresas!$B$6:$B$46=Dados!$H$37,ROW(Empresas!$B$6:$B$46)-5),ROW($A32)),COLUMN(Q$1)),\"\")","v":""},{"$f":"IFERROR(INDEX(Empresas!$B$6:$AS$46,SMALL(IF(Empresas!$B$6:$B$46=Dados!$H$37,ROW(Empresas!$B$6:$B$46)-5),ROW($A32)),COLUMN(R$1)),\"\")","v":""},{"$f":"IFERROR(INDEX(Empresas!$B$6:$AS$46,SMALL(IF(Empresas!$B$6:$B$46=Dados!$H$37,ROW(Empresas!$B$6:$B$46)-5),ROW($A32)),COLUMN(S$1)),\"\")","v":""},{"$f":"IFERROR(INDEX(Empresas!$B$6:$AS$46,SMALL(IF(Empresas!$B$6:$B$46=Dados!$H$37,ROW(Empresas!$B$6:$B$46)-5),ROW($A32)),COLUMN(T$1)),\"\")","v":""},{"$f":"IFERROR(INDEX(Empresas!$B$6:$AS$46,SMALL(IF(Empresas!$B$6:$B$46=Dados!$H$37,ROW(Empresas!$B$6:$B$46)-5),ROW($A32)),COLUMN(U$1)),\"\")","v":""},{"$f":"IFERROR(INDEX(Empresas!$B$6:$AS$46,SMALL(IF(Empresas!$B$6:$B$46=Dados!$H$37,ROW(Empresas!$B$6:$B$46)-5),ROW($A32)),COLUMN(V$1)),\"\")","v":""},{"$f":"IFERROR(INDEX(Empresas!$B$6:$AS$46,SMALL(IF(Empresas!$B$6:$B$46=Dados!$H$37,ROW(Empresas!$B$6:$B$46)-5),ROW($A32)),COLUMN(W$1)),\"\")","v":""},{"$f":"IFERROR(INDEX(Empresas!$B$6:$AS$46,SMALL(IF(Empresas!$B$6:$B$46=Dados!$H$37,ROW(Empresas!$B$6:$B$46)-5),ROW($A32)),COLUMN(X$1)),\"\")","v":""},{"$f":"IFERROR(INDEX(Empresas!$B$6:$AS$46,SMALL(IF(Empresas!$B$6:$B$46=Dados!$H$37,ROW(Empresas!$B$6:$B$46)-5),ROW($A32)),COLUMN(Y$1)),\"\")","v":""},{"$f":"IFERROR(INDEX(Empresas!$B$6:$AS$46,SMALL(IF(Empresas!$B$6:$B$46=Dados!$H$37,ROW(Empresas!$B$6:$B$46)-5),ROW($A32)),COLUMN(Z$1)),\"\")","v":""},{"$f":"IFERROR(INDEX(Empresas!$B$6:$AS$46,SMALL(IF(Empresas!$B$6:$B$46=Dados!$H$37,ROW(Empresas!$B$6:$B$46)-5),ROW($A32)),COLUMN(AA$1)),\"\")","v":""},{"$f":"IFERROR(INDEX(Empresas!$B$6:$AS$46,SMALL(IF(Empresas!$B$6:$B$46=Dados!$H$37,ROW(Empresas!$B$6:$B$46)-5),ROW($A32)),COLUMN(AB$1)),\"\")","v":""},{"$f":"IFERROR(INDEX(Empresas!$B$6:$AS$46,SMALL(IF(Empresas!$B$6:$B$46=Dados!$H$37,ROW(Empresas!$B$6:$B$46)-5),ROW($A32)),COLUMN(AC$1)),\"\")","v":""},{"$f":"IFERROR(INDEX(Empresas!$B$6:$AS$46,SMALL(IF(Empresas!$B$6:$B$46=Dados!$H$37,ROW(Empresas!$B$6:$B$46)-5),ROW($A32)),COLUMN(AD$1)),\"\")","v":""},{"$f":"IFERROR(INDEX(Empresas!$B$6:$AS$46,SMALL(IF(Empresas!$B$6:$B$46=Dados!$H$37,ROW(Empresas!$B$6:$B$46)-5),ROW($A32)),COLUMN(AE$1)),\"\")","v":""},{"$f":"IFERROR(INDEX(Empresas!$B$6:$AS$46,SMALL(IF(Empresas!$B$6:$B$46=Dados!$H$37,ROW(Empresas!$B$6:$B$46)-5),ROW($A32)),COLUMN(AF$1)),\"\")","v":""},{"$f":"IFERROR(INDEX(Empresas!$B$6:$AS$46,SMALL(IF(Empresas!$B$6:$B$46=Dados!$H$37,ROW(Empresas!$B$6:$B$46)-5),ROW($A32)),COLUMN(AG$1)),\"\")","v":""},{"$f":"IFERROR(INDEX(Empresas!$B$6:$AS$46,SMALL(IF(Empresas!$B$6:$B$46=Dados!$H$37,ROW(Empresas!$B$6:$B$46)-5),ROW($A32)),COLUMN(AH$1)),\"\")","v":""},{"$f":"IFERROR(INDEX(Empresas!$B$6:$AS$46,SMALL(IF(Empresas!$B$6:$B$46=Dados!$H$37,ROW(Empresas!$B$6:$B$46)-5),ROW($A32)),COLUMN(AI$1)),\"\")","v":""},{"$f":"IFERROR(INDEX(Empresas!$B$6:$AS$46,SMALL(IF(Empresas!$B$6:$B$46=Dados!$H$37,ROW(Empresas!$B$6:$B$46)-5),ROW($A32)),COLUMN(AJ$1)),\"\")","v":""},{"$f":"IFERROR(INDEX(Empresas!$B$6:$AS$46,SMALL(IF(Empresas!$B$6:$B$46=Dados!$H$37,ROW(Empresas!$B$6:$B$46)-5),ROW($A32)),COLUMN(AK$1)),\"\")","v":""},{"$f":"IFERROR(INDEX(Empresas!$B$6:$AS$46,SMALL(IF(Empresas!$B$6:$B$46=Dados!$H$37,ROW(Empresas!$B$6:$B$46)-5),ROW($A32)),COLUMN(AL$1)),\"\")","v":""},{"$f":"IFERROR(INDEX(Empresas!$B$6:$AS$46,SMALL(IF(Empresas!$B$6:$B$46=Dados!$H$37,ROW(Empresas!$B$6:$B$46)-5),ROW($A32)),COLUMN(AM$1)),\"\")","v":""},{"$f":"IFERROR(INDEX(Empresas!$B$6:$AS$46,SMALL(IF(Empresas!$B$6:$B$46=Dados!$H$37,ROW(Empresas!$B$6:$B$46)-5),ROW($A32)),COLUMN(AN$1)),\"\")","v":""},{"$f":"IFERROR(INDEX(Empresas!$B$6:$AS$46,SMALL(IF(Empresas!$B$6:$B$46=Dados!$H$37,ROW(Empresas!$B$6:$B$46)-5),ROW($A32)),COLUMN(AO$1)),\"\")","v":""},{"$f":"IFERROR(INDEX(Empresas!$B$6:$AS$46,SMALL(IF(Empresas!$B$6:$B$46=Dados!$H$37,ROW(Empresas!$B$6:$B$46)-5),ROW($A32)),COLUMN(AP$1)),\"\")","v":""},{"$f":"IFERROR(INDEX(Empresas!$B$6:$AS$46,SMALL(IF(Empresas!$B$6:$B$46=Dados!$H$37,ROW(Empresas!$B$6:$B$46)-5),ROW($A32)),COLUMN(AQ$1)),\"\")","v":""},{"$f":"IFERROR(INDEX(Empresas!$B$6:$AS$46,SMALL(IF(Empresas!$B$6:$B$46=Dados!$H$37,ROW(Empresas!$B$6:$B$46)-5),ROW($A32)),COLUMN(AR$1)),\"\")","v":""}]
[null,{"$f":"IFERROR(INDEX(Empresas!$B$6:$AS$46,SMALL(IF(Empresas!$B$6:$B$46=Dados!$H$37,ROW(Empresas!$B$6:$B$46)-5),ROW($A33)),COLUMN(B$1)),\"\")","v":""},{"$f":"IFERROR(INDEX(Empresas!$B$6:$AS$46,SMALL(IF(Empresas!$B$6:$B$46=Dados!$H$37,ROW(Empresas!$B$6:$B$46)-5),ROW($A33)),COLUMN(C$1)),\"\")","v":""},{"$f":"IF(C56=\"\",\"\",IF(OFFSET(INDIRECT($D$23,TRUE),ROW(C56)-23,2)>OFFSET(INDIRECT($D$23),ROW(C56)-23,-1),1,IF(OFFSET(INDIRECT($D$23,TRUE),ROW(C56)-23,2)=OFFSET(INDIRECT($D$23),ROW(C56)-23,-1),2,3)))","v":""},{"$f":"IFERROR(INDEX(Empresas!$B$6:$AS$46,SMALL(IF(Empresas!$B$6:$B$46=Dados!$H$37,ROW(Empresas!$B$6:$B$46)-5),ROW($A33)),COLUMN(F$1)),\"\")","v":""},{"$f":"IFERROR(INDEX(Empresas!$B$6:$AS$46,SMALL(IF(Empresas!$B$6:$B$46=Dados!$H$37,ROW(Empresas!$B$6:$B$46)-5),ROW($A33)),COLUMN(G$1)),\"\")","v":""},{"$f":"IFERROR(INDEX(Empresas!$B$6:$AS$46,SMALL(IF(Empresas!$B$6:$B$46=Dados!$H$37,ROW(Empresas!$B$6:$B$46)-5),ROW($A33)),COLUMN(H$1)),\"\")","v":""},{"$f":"IFERROR(INDEX(Empresas!$B$6:$AS$46,SMALL(IF(Empresas!$B$6:$B$46=Dados!$H$37,ROW(Empresas!$B$6:$B$46)-5),ROW($A33)),COLUMN(I$1)),\"\")","v":""},{"$f":"IFERROR(INDEX(Empresas!$B$6:$AS$46,SMALL(IF(Empresas!$B$6:$B$46=Dados!$H$37,ROW(Empresas!$B$6:$B$46)-5),ROW($A33)),COLUMN(J$1)),\"\")","v":""},{"$f":"IFERROR(INDEX(Empresas!$B$6:$AS$46,SMALL(IF(Empresas!$B$6:$B$46=Dados!$H$37,ROW(Empresas!$B$6:$B$46)-5),ROW($A33)),COLUMN(K$1)),\"\")","v":""},{"$f":"IFERROR(INDEX(Empresas!$B$6:$AS$46,SMALL(IF(Empresas!$B$6:$B$46=Dados!$H$37,ROW(Empresas!$B$6:$B$46)-5),ROW($A33)),COLUMN(L$1)),\"\")","v":""},{"$f":"IFERROR(INDEX(Empresas!$B$6:$AS$46,SMALL(IF(Empresas!$B$6:$B$46=Dados!$H$37,ROW(Empresas!$B$6:$B$46)-5),ROW($A33)),COLUMN(M$1)),\"\")","v":""},{"$f":"IFERROR(INDEX(Empresas!$B$6:$AS$46,SMALL(IF(Empresas!$B$6:$B$46=Dados!$H$37,ROW(Empresas!$B$6:$B$46)-5),ROW($A33)),COLUMN(N$1)),\"\")","v":""},{"$f":"IFERROR(INDEX(Empresas!$B$6:$AS$46,SMALL(IF(Empresas!$B$6:$B$46=Dados!$H$37,ROW(Empresas!$B$6:$B$46)-5),ROW($A33)),COLUMN(O$1)),\"\")","v":""},{"$f":"IFERROR(INDEX(Empresas!$B$6:$AS$46,SMALL(IF(Empresas!$B$6:$B$46=Dados!$H$37,ROW(Empresas!$B$6:$B$46)-5),ROW($A33)),COLUMN(P$1)),\"\")","v":""},{"$f":"IFERROR(INDEX(Empresas!$B$6:$AS$46,SMALL(IF(Empresas!$B$6:$B$46=Dados!$H$37,ROW(Empresas!$B$6:$B$46)-5),ROW($A33)),COLUMN(Q$1)),\"\")","v":""},{"$f":"IFERROR(INDEX(Empresas!$B$6:$AS$46,SMALL(IF(Empresas!$B$6:$B$46=Dados!$H$37,ROW(Empresas!$B$6:$B$46)-5),ROW($A33)),COLUMN(R$1)),\"\")","v":""},{"$f":"IFERROR(INDEX(Empresas!$B$6:$AS$46,SMALL(IF(Empresas!$B$6:$B$46=Dados!$H$37,ROW(Empresas!$B$6:$B$46)-5),ROW($A33)),COLUMN(S$1)),\"\")","v":""},{"$f":"IFERROR(INDEX(Empresas!$B$6:$AS$46,SMALL(IF(Empresas!$B$6:$B$46=Dados!$H$37,ROW(Empresas!$B$6:$B$46)-5),ROW($A33)),COLUMN(T$1)),\"\")","v":""},{"$f":"IFERROR(INDEX(Empresas!$B$6:$AS$46,SMALL(IF(Empresas!$B$6:$B$46=Dados!$H$37,ROW(Empresas!$B$6:$B$46)-5),ROW($A33)),COLUMN(U$1)),\"\")","v":""},{"$f":"IFERROR(INDEX(Empresas!$B$6:$AS$46,SMALL(IF(Empresas!$B$6:$B$46=Dados!$H$37,ROW(Empresas!$B$6:$B$46)-5),ROW($A33)),COLUMN(V$1)),\"\")","v":""},{"$f":"IFERROR(INDEX(Empresas!$B$6:$AS$46,SMALL(IF(Empresas!$B$6:$B$46=Dados!$H$37,ROW(Empresas!$B$6:$B$46)-5),ROW($A33)),COLUMN(W$1)),\"\")","v":""},{"$f":"IFERROR(INDEX(Empresas!$B$6:$AS$46,SMALL(IF(Empresas!$B$6:$B$46=Dados!$H$37,ROW(Empresas!$B$6:$B$46)-5),ROW($A33)),COLUMN(X$1)),\"\")","v":""},{"$f":"IFERROR(INDEX(Empresas!$B$6:$AS$46,SMALL(IF(Empresas!$B$6:$B$46=Dados!$H$37,ROW(Empresas!$B$6:$B$46)-5),ROW($A33)),COLUMN(Y$1)),\"\")","v":""},{"$f":"IFERROR(INDEX(Empresas!$B$6:$AS$46,SMALL(IF(Empresas!$B$6:$B$46=Dados!$H$37,ROW(Empresas!$B$6:$B$46)-5),ROW($A33)),COLUMN(Z$1)),\"\")","v":""},{"$f":"IFERROR(INDEX(Empresas!$B$6:$AS$46,SMALL(IF(Empresas!$B$6:$B$46=Dados!$H$37,ROW(Empresas!$B$6:$B$46)-5),ROW($A33)),COLUMN(AA$1)),\"\")","v":""},{"$f":"IFERROR(INDEX(Empresas!$B$6:$AS$46,SMALL(IF(Empresas!$B$6:$B$46=Dados!$H$37,ROW(Empresas!$B$6:$B$46)-5),ROW($A33)),COLUMN(AB$1)),\"\")","v":""},{"$f":"IFERROR(INDEX(Empresas!$B$6:$AS$46,SMALL(IF(Empresas!$B$6:$B$46=Dados!$H$37,ROW(Empresas!$B$6:$B$46)-5),ROW($A33)),COLUMN(AC$1)),\"\")","v":""},{"$f":"IFERROR(INDEX(Empresas!$B$6:$AS$46,SMALL(IF(Empresas!$B$6:$B$46=Dados!$H$37,ROW(Empresas!$B$6:$B$46)-5),ROW($A33)),COLUMN(AD$1)),\"\")","v":""},{"$f":"IFERROR(INDEX(Empresas!$B$6:$AS$46,SMALL(IF(Empresas!$B$6:$B$46=Dados!$H$37,ROW(Empresas!$B$6:$B$46)-5),ROW($A33)),COLUMN(AE$1)),\"\")","v":""},{"$f":"IFERROR(INDEX(Empresas!$B$6:$AS$46,SMALL(IF(Empresas!$B$6:$B$46=Dados!$H$37,ROW(Empresas!$B$6:$B$46)-5),ROW($A33)),COLUMN(AF$1)),\"\")","v":""},{"$f":"IFERROR(INDEX(Empresas!$B$6:$AS$46,SMALL(IF(Empresas!$B$6:$B$46=Dados!$H$37,ROW(Empresas!$B$6:$B$46)-5),ROW($A33)),COLUMN(AG$1)),\"\")","v":""},{"$f":"IFERROR(INDEX(Empresas!$B$6:$AS$46,SMALL(IF(Empresas!$B$6:$B$46=Dados!$H$37,ROW(Empresas!$B$6:$B$46)-5),ROW($A33)),COLUMN(AH$1)),\"\")","v":""},{"$f":"IFERROR(INDEX(Empresas!$B$6:$AS$46,SMALL(IF(Empresas!$B$6:$B$46=Dados!$H$37,ROW(Empresas!$B$6:$B$46)-5),ROW($A33)),COLUMN(AI$1)),\"\")","v":""},{"$f":"IFERROR(INDEX(Empresas!$B$6:$AS$46,SMALL(IF(Empresas!$B$6:$B$46=Dados!$H$37,ROW(Empresas!$B$6:$B$46)-5),ROW($A33)),COLUMN(AJ$1)),\"\")","v":""},{"$f":"IFERROR(INDEX(Empresas!$B$6:$AS$46,SMALL(IF(Empresas!$B$6:$B$46=Dados!$H$37,ROW(Empresas!$B$6:$B$46)-5),ROW($A33)),COLUMN(AK$1)),\"\")","v":""},{"$f":"IFERROR(INDEX(Empresas!$B$6:$AS$46,SMALL(IF(Empresas!$B$6:$B$46=Dados!$H$37,ROW(Empresas!$B$6:$B$46)-5),ROW($A33)),COLUMN(AL$1)),\"\")","v":""},{"$f":"IFERROR(INDEX(Empresas!$B$6:$AS$46,SMALL(IF(Empresas!$B$6:$B$46=Dados!$H$37,ROW(Empresas!$B$6:$B$46)-5),ROW($A33)),COLUMN(AM$1)),\"\")","v":""},{"$f":"IFERROR(INDEX(Empresas!$B$6:$AS$46,SMALL(IF(Empresas!$B$6:$B$46=Dados!$H$37,ROW(Empresas!$B$6:$B$46)-5),ROW($A33)),COLUMN(AN$1)),\"\")","v":""},{"$f":"IFERROR(INDEX(Empresas!$B$6:$AS$46,SMALL(IF(Empresas!$B$6:$B$46=Dados!$H$37,ROW(Empresas!$B$6:$B$46)-5),ROW($A33)),COLUMN(AO$1)),\"\")","v":""},{"$f":"IFERROR(INDEX(Empresas!$B$6:$AS$46,SMALL(IF(Empresas!$B$6:$B$46=Dados!$H$37,ROW(Empresas!$B$6:$B$46)-5),ROW($A33)),COLUMN(AP$1)),\"\")","v":""},{"$f":"IFERROR(INDEX(Empresas!$B$6:$AS$46,SMALL(IF(Empresas!$B$6:$B$46=Dados!$H$37,ROW(Empresas!$B$6:$B$46)-5),ROW($A33)),COLUMN(AQ$1)),\"\")","v":""},{"$f":"IFERROR(INDEX(Empresas!$B$6:$AS$46,SMALL(IF(Empresas!$B$6:$B$46=Dados!$H$37,ROW(Empresas!$B$6:$B$46)-5),ROW($A33)),COLUMN(AR$1)),\"\")","v":""}]
[null,{"$f":"IFERROR(INDEX(Empresas!$B$6:$AS$46,SMALL(IF(Empresas!$B$6:$B$46=Dados!$H$37,ROW(Empresas!$B$6:$B$46)-5),ROW($A34)),COLUMN(B$1)),\"\")","v":""},{"$f":"IFERROR(INDEX(Empresas!$B$6:$AS$46,SMALL(IF(Empresas!$B$6:$B$46=Dados!$H$37,ROW(Empresas!$B$6:$B$46)-5),ROW($A34)),COLUMN(C$1)),\"\")","v":""},"",{"$f":"IFERROR(INDEX(Empresas!$B$6:$AS$46,SMALL(IF(Empresas!$B$6:$B$46=Dados!$H$37,ROW(Empresas!$B$6:$B$46)-5),ROW($A34)),COLUMN(F$1)),\"\")","v":""},{"$f":"IFERROR(INDEX(Empresas!$B$6:$AS$46,SMALL(IF(Empresas!$B$6:$B$46=Dados!$H$37,ROW(Empresas!$B$6:$B$46)-5),ROW($A34)),COLUMN(G$1)),\"\")","v":""},{"$f":"IFERROR(INDEX(Empresas!$B$6:$AS$46,SMALL(IF(Empresas!$B$6:$B$46=Dados!$H$37,ROW(Empresas!$B$6:$B$46)-5),ROW($A34)),COLUMN(H$1)),\"\")","v":""},{"$f":"IFERROR(INDEX(Empresas!$B$6:$AS$46,SMALL(IF(Empresas!$B$6:$B$46=Dados!$H$37,ROW(Empresas!$B$6:$B$46)-5),ROW($A34)),COLUMN(I$1)),\"\")","v":""},{"$f":"IFERROR(INDEX(Empresas!$B$6:$AS$46,SMALL(IF(Empresas!$B$6:$B$46=Dados!$H$37,ROW(Empresas!$B$6:$B$46)-5),ROW($A34)),COLUMN(J$1)),\"\")","v":""},{"$f":"IFERROR(INDEX(Empresas!$B$6:$AS$46,SMALL(IF(Empresas!$B$6:$B$46=Dados!$H$37,ROW(Empresas!$B$6:$B$46)-5),ROW($A34)),COLUMN(K$1)),\"\")","v":""},{"$f":"IFERROR(INDEX(Empresas!$B$6:$AS$46,SMALL(IF(Empresas!$B$6:$B$46=Dados!$H$37,ROW(Empresas!$B$6:$B$46)-5),ROW($A34)),COLUMN(L$1)),\"\")","v":""},{"$f":"IFERROR(INDEX(Empresas!$B$6:$AS$46,SMALL(IF(Empresas!$B$6:$B$46=Dados!$H$37,ROW(Empresas!$B$6:$B$46)-5),ROW($A34)),COLUMN(M$1)),\"\")","v":""},{"$f":"IFERROR(INDEX(Empresas!$B$6:$AS$46,SMALL(IF(Empresas!$B$6:$B$46=Dados!$H$37,ROW(Empresas!$B$6:$B$46)-5),ROW($A34)),COLUMN(N$1)),\"\")","v":""},{"$f":"IFERROR(INDEX(Empresas!$B$6:$AS$46,SMALL(IF(Empresas!$B$6:$B$46=Dados!$H$37,ROW(Empresas!$B$6:$B$46)-5),ROW($A34)),COLUMN(O$1)),\"\")","v":""},{"$f":"IFERROR(INDEX(Empresas!$B$6:$AS$46,SMALL(IF(Empresas!$B$6:$B$46=Dados!$H$37,ROW(Empresas!$B$6:$B$46)-5),ROW($A34)),COLUMN(P$1)),\"\")","v":""},{"$f":"IFERROR(INDEX(Empresas!$B$6:$AS$46,SMALL(IF(Empresas!$B$6:$B$46=Dados!$H$37,ROW(Empresas!$B$6:$B$46)-5),ROW($A34)),COLUMN(Q$1)),\"\")","v":""},{"$f":"IFERROR(INDEX(Empresas!$B$6:$AS$46,SMALL(IF(Empresas!$B$6:$B$46=Dados!$H$37,ROW(Empresas!$B$6:$B$46)-5),ROW($A34)),COLUMN(R$1)),\"\")","v":""},{"$f":"IFERROR(INDEX(Empresas!$B$6:$AS$46,SMALL(IF(Empresas!$B$6:$B$46=Dados!$H$37,ROW(Empresas!$B$6:$B$46)-5),ROW($A34)),COLUMN(S$1)),\"\")","v":""},{"$f":"IFERROR(INDEX(Empresas!$B$6:$AS$46,SMALL(IF(Empresas!$B$6:$B$46=Dados!$H$37,ROW(Empresas!$B$6:$B$46)-5),ROW($A34)),COLUMN(T$1)),\"\")","v":""},{"$f":"IFERROR(INDEX(Empresas!$B$6:$AS$46,SMALL(IF(Empresas!$B$6:$B$46=Dados!$H$37,ROW(Empresas!$B$6:$B$46)-5),ROW($A34)),COLUMN(U$1)),\"\")","v":""},{"$f":"IFERROR(INDEX(Empresas!$B$6:$AS$46,SMALL(IF(Empresas!$B$6:$B$46=Dados!$H$37,ROW(Empresas!$B$6:$B$46)-5),ROW($A34)),COLUMN(V$1)),\"\")","v":""},{"$f":"IFERROR(INDEX(Empresas!$B$6:$AS$46,SMALL(IF(Empresas!$B$6:$B$46=Dados!$H$37,ROW(Empresas!$B$6:$B$46)-5),ROW($A34)),COLUMN(W$1)),\"\")","v":""},{"$f":"IFERROR(INDEX(Empresas!$B$6:$AS$46,SMALL(IF(Empresas!$B$6:$B$46=Dados!$H$37,ROW(Empresas!$B$6:$B$46)-5),ROW($A34)),COLUMN(X$1)),\"\")","v":""},{"$f":"IFERROR(INDEX(Empresas!$B$6:$AS$46,SMALL(IF(Empresas!$B$6:$B$46=Dados!$H$37,ROW(Empresas!$B$6:$B$46)-5),ROW($A34)),COLUMN(Y$1)),\"\")","v":""},{"$f":"IFERROR(INDEX(Empresas!$B$6:$AS$46,SMALL(IF(Empresas!$B$6:$B$46=Dados!$H$37,ROW(Empresas!$B$6:$B$46)-5),ROW($A34)),COLUMN(Z$1)),\"\")","v":""},{"$f":"IFERROR(INDEX(Empresas!$B$6:$AS$46,SMALL(IF(Empresas!$B$6:$B$46=Dados!$H$37,ROW(Empresas!$B$6:$B$46)-5),ROW($A34)),COLUMN(AA$1)),\"\")","v":""},{"$f":"IFERROR(INDEX(Empresas!$B$6:$AS$46,SMALL(IF(Empresas!$B$6:$B$46=Dados!$H$37,ROW(Empresas!$B$6:$B$46)-5),ROW($A34)),COLUMN(AB$1)),\"\")","v":""},{"$f":"IFERROR(INDEX(Empresas!$B$6:$AS$46,SMALL(IF(Empresas!$B$6:$B$46=Dados!$H$37,ROW(Empresas!$B$6:$B$46)-5),ROW($A34)),COLUMN(AC$1)),\"\")","v":""},{"$f":"IFERROR(INDEX(Empresas!$B$6:$AS$46,SMALL(IF(Empresas!$B$6:$B$46=Dados!$H$37,ROW(Empresas!$B$6:$B$46)-5),ROW($A34)),COLUMN(AD$1)),\"\")","v":""},{"$f":"IFERROR(INDEX(Empresas!$B$6:$AS$46,SMALL(IF(Empresas!$B$6:$B$46=Dados!$H$37,ROW(Empresas!$B$6:$B$46)-5),ROW($A34)),COLUMN(AE$1)),\"\")","v":""},{"$f":"IFERROR(INDEX(Empresas!$B$6:$AS$46,SMALL(IF(Empresas!$B$6:$B$46=Dados!$H$37,ROW(Empresas!$B$6:$B$46)-5),ROW($A34)),COLUMN(AF$1)),\"\")","v":""},{"$f":"IFERROR(INDEX(Empresas!$B$6:$AS$46,SMALL(IF(Empresas!$B$6:$B$46=Dados!$H$37,ROW(Empresas!$B$6:$B$46)-5),ROW($A34)),COLUMN(AG$1)),\"\")","v":""},{"$f":"IFERROR(INDEX(Empresas!$B$6:$AS$46,SMALL(IF(Empresas!$B$6:$B$46=Dados!$H$37,ROW(Empresas!$B$6:$B$46)-5),ROW($A34)),COLUMN(AH$1)),\"\")","v":""},{"$f":"IFERROR(INDEX(Empresas!$B$6:$AS$46,SMALL(IF(Empresas!$B$6:$B$46=Dados!$H$37,ROW(Empresas!$B$6:$B$46)-5),ROW($A34)),COLUMN(AI$1)),\"\")","v":""},{"$f":"IFERROR(INDEX(Empresas!$B$6:$AS$46,SMALL(IF(Empresas!$B$6:$B$46=Dados!$H$37,ROW(Empresas!$B$6:$B$46)-5),ROW($A34)),COLUMN(AJ$1)),\"\")","v":""},{"$f":"IFERROR(INDEX(Empresas!$B$6:$AS$46,SMALL(IF(Empresas!$B$6:$B$46=Dados!$H$37,ROW(Empresas!$B$6:$B$46)-5),ROW($A34)),COLUMN(AK$1)),\"\")","v":""},{"$f":"IFERROR(INDEX(Empresas!$B$6:$AS$46,SMALL(IF(Empresas!$B$6:$B$46=Dados!$H$37,ROW(Empresas!$B$6:$B$46)-5),ROW($A34)),COLUMN(AL$1)),\"\")","v":""},{"$f":"IFERROR(INDEX(Empresas!$B$6:$AS$46,SMALL(IF(Empresas!$B$6:$B$46=Dados!$H$37,ROW(Empresas!$B$6:$B$46)-5),ROW($A34)),COLUMN(AM$1)),\"\")","v":""},{"$f":"IFERROR(INDEX(Empresas!$B$6:$AS$46,SMALL(IF(Empresas!$B$6:$B$46=Dados!$H$37,ROW(Empresas!$B$6:$B$46)-5),ROW($A34)),COLUMN(AN$1)),\"\")","v":""},{"$f":"IFERROR(INDEX(Empresas!$B$6:$AS$46,SMALL(IF(Empresas!$B$6:$B$46=Dados!$H$37,ROW(Empresas!$B$6:$B$46)-5),ROW($A34)),COLUMN(AO$1)),\"\")","v":""},{"$f":"IFERROR(INDEX(Empresas!$B$6:$AS$46,SMALL(IF(Empresas!$B$6:$B$46=Dados!$H$37,ROW(Empresas!$B$6:$B$46)-5),ROW($A34)),COLUMN(AP$1)),\"\")","v":""},{"$f":"IFERROR(INDEX(Empresas!$B$6:$AS$46,SMALL(IF(Empresas!$B$6:$B$46=Dados!$H$37,ROW(Empresas!$B$6:$B$46)-5),ROW($A34)),COLUMN(AQ$1)),\"\")","v":""},{"$f":"IFERROR(INDEX(Empresas!$B$6:$AS$46,SMALL(IF(Empresas!$B$6:$B$46=Dados!$H$37,ROW(Empresas!$B$6:$B$46)-5),ROW($A34)),COLUMN(AR$1)),\"\")","v":""}]
[null,{"$f":"IFERROR(INDEX(Empresas!$B$6:$AS$46,SMALL(IF(Empresas!$B$6:$B$46=Dados!$H$37,ROW(Empresas!$B$6:$B$46)-5),ROW($A35)),COLUMN(B$1)),\"\")","v":""},{"$f":"IFERROR(INDEX(Empresas!$B$6:$AS$46,SMALL(IF(Empresas!$B$6:$B$46=Dados!$H$37,ROW(Empresas!$B$6:$B$46)-5),ROW($A35)),COLUMN(C$1)),\"\")","v":""},"",{"$f":"IFERROR(INDEX(Empresas!$B$6:$AS$46,SMALL(IF(Empresas!$B$6:$B$46=Dados!$H$37,ROW(Empresas!$B$6:$B$46)-5),ROW($A35)),COLUMN(F$1)),\"\")","v":""},{"$f":"IFERROR(INDEX(Empresas!$B$6:$AS$46,SMALL(IF(Empresas!$B$6:$B$46=Dados!$H$37,ROW(Empresas!$B$6:$B$46)-5),ROW($A35)),COLUMN(G$1)),\"\")","v":""},{"$f":"IFERROR(INDEX(Empresas!$B$6:$AS$46,SMALL(IF(Empresas!$B$6:$B$46=Dados!$H$37,ROW(Empresas!$B$6:$B$46)-5),ROW($A35)),COLUMN(H$1)),\"\")","v":""},{"$f":"IFERROR(INDEX(Empresas!$B$6:$AS$46,SMALL(IF(Empresas!$B$6:$B$46=Dados!$H$37,ROW(Empresas!$B$6:$B$46)-5),ROW($A35)),COLUMN(I$1)),\"\")","v":""},{"$f":"IFERROR(INDEX(Empresas!$B$6:$AS$46,SMALL(IF(Empresas!$B$6:$B$46=Dados!$H$37,ROW(Empresas!$B$6:$B$46)-5),ROW($A35)),COLUMN(J$1)),\"\")","v":""},{"$f":"IFERROR(INDEX(Empresas!$B$6:$AS$46,SMALL(IF(Empresas!$B$6:$B$46=Dados!$H$37,ROW(Empresas!$B$6:$B$46)-5),ROW($A35)),COLUMN(K$1)),\"\")","v":""},{"$f":"IFERROR(INDEX(Empresas!$B$6:$AS$46,SMALL(IF(Empresas!$B$6:$B$46=Dados!$H$37,ROW(Empresas!$B$6:$B$46)-5),ROW($A35)),COLUMN(L$1)),\"\")","v":""},{"$f":"IFERROR(INDEX(Empresas!$B$6:$AS$46,SMALL(IF(Empresas!$B$6:$B$46=Dados!$H$37,ROW(Empresas!$B$6:$B$46)-5),ROW($A35)),COLUMN(M$1)),\"\")","v":""},{"$f":"IFERROR(INDEX(Empresas!$B$6:$AS$46,SMALL(IF(Empresas!$B$6:$B$46=Dados!$H$37,ROW(Empresas!$B$6:$B$46)-5),ROW($A35)),COLUMN(N$1)),\"\")","v":""},{"$f":"IFERROR(INDEX(Empresas!$B$6:$AS$46,SMALL(IF(Empresas!$B$6:$B$46=Dados!$H$37,ROW(Empresas!$B$6:$B$46)-5),ROW($A35)),COLUMN(O$1)),\"\")","v":""},{"$f":"IFERROR(INDEX(Empresas!$B$6:$AS$46,SMALL(IF(Empresas!$B$6:$B$46=Dados!$H$37,ROW(Empresas!$B$6:$B$46)-5),ROW($A35)),COLUMN(P$1)),\"\")","v":""},{"$f":"IFERROR(INDEX(Empresas!$B$6:$AS$46,SMALL(IF(Empresas!$B$6:$B$46=Dados!$H$37,ROW(Empresas!$B$6:$B$46)-5),ROW($A35)),COLUMN(Q$1)),\"\")","v":""},{"$f":"IFERROR(INDEX(Empresas!$B$6:$AS$46,SMALL(IF(Empresas!$B$6:$B$46=Dados!$H$37,ROW(Empresas!$B$6:$B$46)-5),ROW($A35)),COLUMN(R$1)),\"\")","v":""},{"$f":"IFERROR(INDEX(Empresas!$B$6:$AS$46,SMALL(IF(Empresas!$B$6:$B$46=Dados!$H$37,ROW(Empresas!$B$6:$B$46)-5),ROW($A35)),COLUMN(S$1)),\"\")","v":""},{"$f":"IFERROR(INDEX(Empresas!$B$6:$AS$46,SMALL(IF(Empresas!$B$6:$B$46=Dados!$H$37,ROW(Empresas!$B$6:$B$46)-5),ROW($A35)),COLUMN(T$1)),\"\")","v":""},{"$f":"IFERROR(INDEX(Empresas!$B$6:$AS$46,SMALL(IF(Empresas!$B$6:$B$46=Dados!$H$37,ROW(Empresas!$B$6:$B$46)-5),ROW($A35)),COLUMN(U$1)),\"\")","v":""},{"$f":"IFERROR(INDEX(Empresas!$B$6:$AS$46,SMALL(IF(Empresas!$B$6:$B$46=Dados!$H$37,ROW(Empresas!$B$6:$B$46)-5),ROW($A35)),COLUMN(V$1)),\"\")","v":""},{"$f":"IFERROR(INDEX(Empresas!$B$6:$AS$46,SMALL(IF(Empresas!$B$6:$B$46=Dados!$H$37,ROW(Empresas!$B$6:$B$46)-5),ROW($A35)),COLUMN(W$1)),\"\")","v":""},{"$f":"IFERROR(INDEX(Empresas!$B$6:$AS$46,SMALL(IF(Empresas!$B$6:$B$46=Dados!$H$37,ROW(Empresas!$B$6:$B$46)-5),ROW($A35)),COLUMN(X$1)),\"\")","v":""},{"$f":"IFERROR(INDEX(Empresas!$B$6:$AS$46,SMALL(IF(Empresas!$B$6:$B$46=Dados!$H$37,ROW(Empresas!$B$6:$B$46)-5),ROW($A35)),COLUMN(Y$1)),\"\")","v":""},{"$f":"IFERROR(INDEX(Empresas!$B$6:$AS$46,SMALL(IF(Empresas!$B$6:$B$46=Dados!$H$37,ROW(Empresas!$B$6:$B$46)-5),ROW($A35)),COLUMN(Z$1)),\"\")","v":""},{"$f":"IFERROR(INDEX(Empresas!$B$6:$AS$46,SMALL(IF(Empresas!$B$6:$B$46=Dados!$H$37,ROW(Empresas!$B$6:$B$46)-5),ROW($A35)),COLUMN(AA$1)),\"\")","v":""},{"$f":"IFERROR(INDEX(Empresas!$B$6:$AS$46,SMALL(IF(Empresas!$B$6:$B$46=Dados!$H$37,ROW(Empresas!$B$6:$B$46)-5),ROW($A35)),COLUMN(AB$1)),\"\")","v":""},{"$f":"IFERROR(INDEX(Empresas!$B$6:$AS$46,SMALL(IF(Empresas!$B$6:$B$46=Dados!$H$37,ROW(Empresas!$B$6:$B$46)-5),ROW($A35)),COLUMN(AC$1)),\"\")","v":""},{"$f":"IFERROR(INDEX(Empresas!$B$6:$AS$46,SMALL(IF(Empresas!$B$6:$B$46=Dados!$H$37,ROW(Empresas!$B$6:$B$46)-5),ROW($A35)),COLUMN(AD$1)),\"\")","v":""},{"$f":"IFERROR(INDEX(Empresas!$B$6:$AS$46,SMALL(IF(Empresas!$B$6:$B$46=Dados!$H$37,ROW(Empresas!$B$6:$B$46)-5),ROW($A35)),COLUMN(AE$1)),\"\")","v":""},{"$f":"IFERROR(INDEX(Empresas!$B$6:$AS$46,SMALL(IF(Empresas!$B$6:$B$46=Dados!$H$37,ROW(Empresas!$B$6:$B$46)-5),ROW($A35)),COLUMN(AF$1)),\"\")","v":""},{"$f":"IFERROR(INDEX(Empresas!$B$6:$AS$46,SMALL(IF(Empresas!$B$6:$B$46=Dados!$H$37,ROW(Empresas!$B$6:$B$46)-5),ROW($A35)),COLUMN(AG$1)),\"\")","v":""},{"$f":"IFERROR(INDEX(Empresas!$B$6:$AS$46,SMALL(IF(Empresas!$B$6:$B$46=Dados!$H$37,ROW(Empresas!$B$6:$B$46)-5),ROW($A35)),COLUMN(AH$1)),\"\")","v":""},{"$f":"IFERROR(INDEX(Empresas!$B$6:$AS$46,SMALL(IF(Empresas!$B$6:$B$46=Dados!$H$37,ROW(Empresas!$B$6:$B$46)-5),ROW($A35)),COLUMN(AI$1)),\"\")","v":""},{"$f":"IFERROR(INDEX(Empresas!$B$6:$AS$46,SMALL(IF(Empresas!$B$6:$B$46=Dados!$H$37,ROW(Empresas!$B$6:$B$46)-5),ROW($A35)),COLUMN(AJ$1)),\"\")","v":""},{"$f":"IFERROR(INDEX(Empresas!$B$6:$AS$46,SMALL(IF(Empresas!$B$6:$B$46=Dados!$H$37,ROW(Empresas!$B$6:$B$46)-5),ROW($A35)),COLUMN(AK$1)),\"\")","v":""},{"$f":"IFERROR(INDEX(Empresas!$B$6:$AS$46,SMALL(IF(Empresas!$B$6:$B$46=Dados!$H$37,ROW(Empresas!$B$6:$B$46)-5),ROW($A35)),COLUMN(AL$1)),\"\")","v":""},{"$f":"IFERROR(INDEX(Empresas!$B$6:$AS$46,SMALL(IF(Empresas!$B$6:$B$46=Dados!$H$37,ROW(Empresas!$B$6:$B$46)-5),ROW($A35)),COLUMN(AM$1)),\"\")","v":""},{"$f":"IFERROR(INDEX(Empresas!$B$6:$AS$46,SMALL(IF(Empresas!$B$6:$B$46=Dados!$H$37,ROW(Empresas!$B$6:$B$46)-5),ROW($A35)),COLUMN(AN$1)),\"\")","v":""},{"$f":"IFERROR(INDEX(Empresas!$B$6:$AS$46,SMALL(IF(Empresas!$B$6:$B$46=Dados!$H$37,ROW(Empresas!$B$6:$B$46)-5),ROW($A35)),COLUMN(AO$1)),\"\")","v":""},{"$f":"IFERROR(INDEX(Empresas!$B$6:$AS$46,SMALL(IF(Empresas!$B$6:$B$46=Dados!$H$37,ROW(Empresas!$B$6:$B$46)-5),ROW($A35)),COLUMN(AP$1)),\"\")","v":""},{"$f":"IFERROR(INDEX(Empresas!$B$6:$AS$46,SMALL(IF(Empresas!$B$6:$B$46=Dados!$H$37,ROW(Empresas!$B$6:$B$46)-5),ROW($A35)),COLUMN(AQ$1)),\"\")","v":""},{"$f":"IFERROR(INDEX(Empresas!$B$6:$AS$46,SMALL(IF(Empresas!$B$6:$B$46=Dados!$H$37,ROW(Empresas!$B$6:$B$46)-5),ROW($A35)),COLUMN(AR$1)),\"\")","v":""}]
[null,{"$f":"IFERROR(INDEX(Empresas!$B$6:$AS$46,SMALL(IF(Empresas!$B$6:$B$46=Dados!$H$37,ROW(Empresas!$B$6:$B$46)-5),ROW($A36)),COLUMN(B$1)),\"\")","v":""},{"$f":"IFERROR(INDEX(Empresas!$B$6:$AS$46,SMALL(IF(Empresas!$B$6:$B$46=Dados!$H$37,ROW(Empresas!$B$6:$B$46)-5),ROW($A36)),COLUMN(C$1)),\"\")","v":""},"",{"$f":"IFERROR(INDEX(Empresas!$B$6:$AS$46,SMALL(IF(Empresas!$B$6:$B$46=Dados!$H$37,ROW(Empresas!$B$6:$B$46)-5),ROW($A36)),COLUMN(F$1)),\"\")","v":""},{"$f":"IFERROR(INDEX(Empresas!$B$6:$AS$46,SMALL(IF(Empresas!$B$6:$B$46=Dados!$H$37,ROW(Empresas!$B$6:$B$46)-5),ROW($A36)),COLUMN(G$1)),\"\")","v":""},{"$f":"IFERROR(INDEX(Empresas!$B$6:$AS$46,SMALL(IF(Empresas!$B$6:$B$46=Dados!$H$37,ROW(Empresas!$B$6:$B$46)-5),ROW($A36)),COLUMN(H$1)),\"\")","v":""},{"$f":"IFERROR(INDEX(Empresas!$B$6:$AS$46,SMALL(IF(Empresas!$B$6:$B$46=Dados!$H$37,ROW(Empresas!$B$6:$B$46)-5),ROW($A36)),COLUMN(I$1)),\"\")","v":""},{"$f":"IFERROR(INDEX(Empresas!$B$6:$AS$46,SMALL(IF(Empresas!$B$6:$B$46=Dados!$H$37,ROW(Empresas!$B$6:$B$46)-5),ROW($A36)),COLUMN(J$1)),\"\")","v":""},{"$f":"IFERROR(INDEX(Empresas!$B$6:$AS$46,SMALL(IF(Empresas!$B$6:$B$46=Dados!$H$37,ROW(Empresas!$B$6:$B$46)-5),ROW($A36)),COLUMN(K$1)),\"\")","v":""},{"$f":"IFERROR(INDEX(Empresas!$B$6:$AS$46,SMALL(IF(Empresas!$B$6:$B$46=Dados!$H$37,ROW(Empresas!$B$6:$B$46)-5),ROW($A36)),COLUMN(L$1)),\"\")","v":""},{"$f":"IFERROR(INDEX(Empresas!$B$6:$AS$46,SMALL(IF(Empresas!$B$6:$B$46=Dados!$H$37,ROW(Empresas!$B$6:$B$46)-5),ROW($A36)),COLUMN(M$1)),\"\")","v":""},{"$f":"IFERROR(INDEX(Empresas!$B$6:$AS$46,SMALL(IF(Empresas!$B$6:$B$46=Dados!$H$37,ROW(Empresas!$B$6:$B$46)-5),ROW($A36)),COLUMN(N$1)),\"\")","v":""},{"$f":"IFERROR(INDEX(Empresas!$B$6:$AS$46,SMALL(IF(Empresas!$B$6:$B$46=Dados!$H$37,ROW(Empresas!$B$6:$B$46)-5),ROW($A36)),COLUMN(O$1)),\"\")","v":""},{"$f":"IFERROR(INDEX(Empresas!$B$6:$AS$46,SMALL(IF(Empresas!$B$6:$B$46=Dados!$H$37,ROW(Empresas!$B$6:$B$46)-5),ROW($A36)),COLUMN(P$1)),\"\")","v":""},{"$f":"IFERROR(INDEX(Empresas!$B$6:$AS$46,SMALL(IF(Empresas!$B$6:$B$46=Dados!$H$37,ROW(Empresas!$B$6:$B$46)-5),ROW($A36)),COLUMN(Q$1)),\"\")","v":""},{"$f":"IFERROR(INDEX(Empresas!$B$6:$AS$46,SMALL(IF(Empresas!$B$6:$B$46=Dados!$H$37,ROW(Empresas!$B$6:$B$46)-5),ROW($A36)),COLUMN(R$1)),\"\")","v":""},{"$f":"IFERROR(INDEX(Empresas!$B$6:$AS$46,SMALL(IF(Empresas!$B$6:$B$46=Dados!$H$37,ROW(Empresas!$B$6:$B$46)-5),ROW($A36)),COLUMN(S$1)),\"\")","v":""},{"$f":"IFERROR(INDEX(Empresas!$B$6:$AS$46,SMALL(IF(Empresas!$B$6:$B$46=Dados!$H$37,ROW(Empresas!$B$6:$B$46)-5),ROW($A36)),COLUMN(T$1)),\"\")","v":""},{"$f":"IFERROR(INDEX(Empresas!$B$6:$AS$46,SMALL(IF(Empresas!$B$6:$B$46=Dados!$H$37,ROW(Empresas!$B$6:$B$46)-5),ROW($A36)),COLUMN(U$1)),\"\")","v":""},{"$f":"IFERROR(INDEX(Empresas!$B$6:$AS$46,SMALL(IF(Empresas!$B$6:$B$46=Dados!$H$37,ROW(Empresas!$B$6:$B$46)-5),ROW($A36)),COLUMN(V$1)),\"\")","v":""},{"$f":"IFERROR(INDEX(Empresas!$B$6:$AS$46,SMALL(IF(Empresas!$B$6:$B$46=Dados!$H$37,ROW(Empresas!$B$6:$B$46)-5),ROW($A36)),COLUMN(W$1)),\"\")","v":""},{"$f":"IFERROR(INDEX(Empresas!$B$6:$AS$46,SMALL(IF(Empresas!$B$6:$B$46=Dados!$H$37,ROW(Empresas!$B$6:$B$46)-5),ROW($A36)),COLUMN(X$1)),\"\")","v":""},{"$f":"IFERROR(INDEX(Empresas!$B$6:$AS$46,SMALL(IF(Empresas!$B$6:$B$46=Dados!$H$37,ROW(Empresas!$B$6:$B$46)-5),ROW($A36)),COLUMN(Y$1)),\"\")","v":""},{"$f":"IFERROR(INDEX(Empresas!$B$6:$AS$46,SMALL(IF(Empresas!$B$6:$B$46=Dados!$H$37,ROW(Empresas!$B$6:$B$46)-5),ROW($A36)),COLUMN(Z$1)),\"\")","v":""},{"$f":"IFERROR(INDEX(Empresas!$B$6:$AS$46,SMALL(IF(Empresas!$B$6:$B$46=Dados!$H$37,ROW(Empresas!$B$6:$B$46)-5),ROW($A36)),COLUMN(AA$1)),\"\")","v":""},{"$f":"IFERROR(INDEX(Empresas!$B$6:$AS$46,SMALL(IF(Empresas!$B$6:$B$46=Dados!$H$37,ROW(Empresas!$B$6:$B$46)-5),ROW($A36)),COLUMN(AB$1)),\"\")","v":""},{"$f":"IFERROR(INDEX(Empresas!$B$6:$AS$46,SMALL(IF(Empresas!$B$6:$B$46=Dados!$H$37,ROW(Empresas!$B$6:$B$46)-5),ROW($A36)),COLUMN(AC$1)),\"\")","v":""},{"$f":"IFERROR(INDEX(Empresas!$B$6:$AS$46,SMALL(IF(Empresas!$B$6:$B$46=Dados!$H$37,ROW(Empresas!$B$6:$B$46)-5),ROW($A36)),COLUMN(AD$1)),\"\")","v":""},{"$f":"IFERROR(INDEX(Empresas!$B$6:$AS$46,SMALL(IF(Empresas!$B$6:$B$46=Dados!$H$37,ROW(Empresas!$B$6:$B$46)-5),ROW($A36)),COLUMN(AE$1)),\"\")","v":""},{"$f":"IFERROR(INDEX(Empresas!$B$6:$AS$46,SMALL(IF(Empresas!$B$6:$B$46=Dados!$H$37,ROW(Empresas!$B$6:$B$46)-5),ROW($A36)),COLUMN(AF$1)),\"\")","v":""},{"$f":"IFERROR(INDEX(Empresas!$B$6:$AS$46,SMALL(IF(Empresas!$B$6:$B$46=Dados!$H$37,ROW(Empresas!$B$6:$B$46)-5),ROW($A36)),COLUMN(AG$1)),\"\")","v":""},{"$f":"IFERROR(INDEX(Empresas!$B$6:$AS$46,SMALL(IF(Empresas!$B$6:$B$46=Dados!$H$37,ROW(Empresas!$B$6:$B$46)-5),ROW($A36)),COLUMN(AH$1)),\"\")","v":""},{"$f":"IFERROR(INDEX(Empresas!$B$6:$AS$46,SMALL(IF(Empresas!$B$6:$B$46=Dados!$H$37,ROW(Empresas!$B$6:$B$46)-5),ROW($A36)),COLUMN(AI$1)),\"\")","v":""},{"$f":"IFERROR(INDEX(Empresas!$B$6:$AS$46,SMALL(IF(Empresas!$B$6:$B$46=Dados!$H$37,ROW(Empresas!$B$6:$B$46)-5),ROW($A36)),COLUMN(AJ$1)),\"\")","v":""},{"$f":"IFERROR(INDEX(Empresas!$B$6:$AS$46,SMALL(IF(Empresas!$B$6:$B$46=Dados!$H$37,ROW(Empresas!$B$6:$B$46)-5),ROW($A36)),COLUMN(AK$1)),\"\")","v":""},{"$f":"IFERROR(INDEX(Empresas!$B$6:$AS$46,SMALL(IF(Empresas!$B$6:$B$46=Dados!$H$37,ROW(Empresas!$B$6:$B$46)-5),ROW($A36)),COLUMN(AL$1)),\"\")","v":""},{"$f":"IFERROR(INDEX(Empresas!$B$6:$AS$46,SMALL(IF(Empresas!$B$6:$B$46=Dados!$H$37,ROW(Empresas!$B$6:$B$46)-5),ROW($A36)),COLUMN(AM$1)),\"\")","v":""},{"$f":"IFERROR(INDEX(Empresas!$B$6:$AS$46,SMALL(IF(Empresas!$B$6:$B$46=Dados!$H$37,ROW(Empresas!$B$6:$B$46)-5),ROW($A36)),COLUMN(AN$1)),\"\")","v":""},{"$f":"IFERROR(INDEX(Empresas!$B$6:$AS$46,SMALL(IF(Empresas!$B$6:$B$46=Dados!$H$37,ROW(Empresas!$B$6:$B$46)-5),ROW($A36)),COLUMN(AO$1)),\"\")","v":""},{"$f":"IFERROR(INDEX(Empresas!$B$6:$AS$46,SMALL(IF(Empresas!$B$6:$B$46=Dados!$H$37,ROW(Empresas!$B$6:$B$46)-5),ROW($A36)),COLUMN(AP$1)),\"\")","v":""},{"$f":"IFERROR(INDEX(Empresas!$B$6:$AS$46,SMALL(IF(Empresas!$B$6:$B$46=Dados!$H$37,ROW(Empresas!$B$6:$B$46)-5),ROW($A36)),COLUMN(AQ$1)),\"\")","v":""},{"$f":"IFERROR(INDEX(Empresas!$B$6:$AS$46,SMALL(IF(Empresas!$B$6:$B$46=Dados!$H$37,ROW(Empresas!$B$6:$B$46)-5),ROW($A36)),COLUMN(AR$1)),\"\")","v":""}]
[null,{"$f":"IFERROR(INDEX(Empresas!$B$6:$AS$46,SMALL(IF(Empresas!$B$6:$B$46=Dados!$H$37,ROW(Empresas!$B$6:$B$46)-5),ROW($A37)),COLUMN(B$1)),\"\")","v":""},{"$f":"IFERROR(INDEX(Empresas!$B$6:$AS$46,SMALL(IF(Empresas!$B$6:$B$46=Dados!$H$37,ROW(Empresas!$B$6:$B$46)-5),ROW($A37)),COLUMN(C$1)),\"\")","v":""},"",{"$f":"IFERROR(INDEX(Empresas!$B$6:$AS$46,SMALL(IF(Empresas!$B$6:$B$46=Dados!$H$37,ROW(Empresas!$B$6:$B$46)-5),ROW($A37)),COLUMN(F$1)),\"\")","v":""},{"$f":"IFERROR(INDEX(Empresas!$B$6:$AS$46,SMALL(IF(Empresas!$B$6:$B$46=Dados!$H$37,ROW(Empresas!$B$6:$B$46)-5),ROW($A37)),COLUMN(G$1)),\"\")","v":""},{"$f":"IFERROR(INDEX(Empresas!$B$6:$AS$46,SMALL(IF(Empresas!$B$6:$B$46=Dados!$H$37,ROW(Empresas!$B$6:$B$46)-5),ROW($A37)),COLUMN(H$1)),\"\")","v":""},{"$f":"IFERROR(INDEX(Empresas!$B$6:$AS$46,SMALL(IF(Empresas!$B$6:$B$46=Dados!$H$37,ROW(Empresas!$B$6:$B$46)-5),ROW($A37)),COLUMN(I$1)),\"\")","v":""},{"$f":"IFERROR(INDEX(Empresas!$B$6:$AS$46,SMALL(IF(Empresas!$B$6:$B$46=Dados!$H$37,ROW(Empresas!$B$6:$B$46)-5),ROW($A37)),COLUMN(J$1)),\"\")","v":""},{"$f":"IFERROR(INDEX(Empresas!$B$6:$AS$46,SMALL(IF(Empresas!$B$6:$B$46=Dados!$H$37,ROW(Empresas!$B$6:$B$46)-5),ROW($A37)),COLUMN(K$1)),\"\")","v":""},{"$f":"IFERROR(INDEX(Empresas!$B$6:$AS$46,SMALL(IF(Empresas!$B$6:$B$46=Dados!$H$37,ROW(Empresas!$B$6:$B$46)-5),ROW($A37)),COLUMN(L$1)),\"\")","v":""},{"$f":"IFERROR(INDEX(Empresas!$B$6:$AS$46,SMALL(IF(Empresas!$B$6:$B$46=Dados!$H$37,ROW(Empresas!$B$6:$B$46)-5),ROW($A37)),COLUMN(M$1)),\"\")","v":""},{"$f":"IFERROR(INDEX(Empresas!$B$6:$AS$46,SMALL(IF(Empresas!$B$6:$B$46=Dados!$H$37,ROW(Empresas!$B$6:$B$46)-5),ROW($A37)),COLUMN(N$1)),\"\")","v":""},{"$f":"IFERROR(INDEX(Empresas!$B$6:$AS$46,SMALL(IF(Empresas!$B$6:$B$46=Dados!$H$37,ROW(Empresas!$B$6:$B$46)-5),ROW($A37)),COLUMN(O$1)),\"\")","v":""},{"$f":"IFERROR(INDEX(Empresas!$B$6:$AS$46,SMALL(IF(Empresas!$B$6:$B$46=Dados!$H$37,ROW(Empresas!$B$6:$B$46)-5),ROW($A37)),COLUMN(P$1)),\"\")","v":""},{"$f":"IFERROR(INDEX(Empresas!$B$6:$AS$46,SMALL(IF(Empresas!$B$6:$B$46=Dados!$H$37,ROW(Empresas!$B$6:$B$46)-5),ROW($A37)),COLUMN(Q$1)),\"\")","v":""},{"$f":"IFERROR(INDEX(Empresas!$B$6:$AS$46,SMALL(IF(Empresas!$B$6:$B$46=Dados!$H$37,ROW(Empresas!$B$6:$B$46)-5),ROW($A37)),COLUMN(R$1)),\"\")","v":""},{"$f":"IFERROR(INDEX(Empresas!$B$6:$AS$46,SMALL(IF(Empresas!$B$6:$B$46=Dados!$H$37,ROW(Empresas!$B$6:$B$46)-5),ROW($A37)),COLUMN(S$1)),\"\")","v":""},{"$f":"IFERROR(INDEX(Empresas!$B$6:$AS$46,SMALL(IF(Empresas!$B$6:$B$46=Dados!$H$37,ROW(Empresas!$B$6:$B$46)-5),ROW($A37)),COLUMN(T$1)),\"\")","v":""},{"$f":"IFERROR(INDEX(Empresas!$B$6:$AS$46,SMALL(IF(Empresas!$B$6:$B$46=Dados!$H$37,ROW(Empresas!$B$6:$B$46)-5),ROW($A37)),COLUMN(U$1)),\"\")","v":""},{"$f":"IFERROR(INDEX(Empresas!$B$6:$AS$46,SMALL(IF(Empresas!$B$6:$B$46=Dados!$H$37,ROW(Empresas!$B$6:$B$46)-5),ROW($A37)),COLUMN(V$1)),\"\")","v":""},{"$f":"IFERROR(INDEX(Empresas!$B$6:$AS$46,SMALL(IF(Empresas!$B$6:$B$46=Dados!$H$37,ROW(Empresas!$B$6:$B$46)-5),ROW($A37)),COLUMN(W$1)),\"\")","v":""},{"$f":"IFERROR(INDEX(Empresas!$B$6:$AS$46,SMALL(IF(Empresas!$B$6:$B$46=Dados!$H$37,ROW(Empresas!$B$6:$B$46)-5),ROW($A37)),COLUMN(X$1)),\"\")","v":""},{"$f":"IFERROR(INDEX(Empresas!$B$6:$AS$46,SMALL(IF(Empresas!$B$6:$B$46=Dados!$H$37,ROW(Empresas!$B$6:$B$46)-5),ROW($A37)),COLUMN(Y$1)),\"\")","v":""},{"$f":"IFERROR(INDEX(Empresas!$B$6:$AS$46,SMALL(IF(Empresas!$B$6:$B$46=Dados!$H$37,ROW(Empresas!$B$6:$B$46)-5),ROW($A37)),COLUMN(Z$1)),\"\")","v":""},{"$f":"IFERROR(INDEX(Empresas!$B$6:$AS$46,SMALL(IF(Empresas!$B$6:$B$46=Dados!$H$37,ROW(Empresas!$B$6:$B$46)-5),ROW($A37)),COLUMN(AA$1)),\"\")","v":""},{"$f":"IFERROR(INDEX(Empresas!$B$6:$AS$46,SMALL(IF(Empresas!$B$6:$B$46=Dados!$H$37,ROW(Empresas!$B$6:$B$46)-5),ROW($A37)),COLUMN(AB$1)),\"\")","v":""},{"$f":"IFERROR(INDEX(Empresas!$B$6:$AS$46,SMALL(IF(Empresas!$B$6:$B$46=Dados!$H$37,ROW(Empresas!$B$6:$B$46)-5),ROW($A37)),COLUMN(AC$1)),\"\")","v":""},{"$f":"IFERROR(INDEX(Empresas!$B$6:$AS$46,SMALL(IF(Empresas!$B$6:$B$46=Dados!$H$37,ROW(Empresas!$B$6:$B$46)-5),ROW($A37)),COLUMN(AD$1)),\"\")","v":""},{"$f":"IFERROR(INDEX(Empresas!$B$6:$AS$46,SMALL(IF(Empresas!$B$6:$B$46=Dados!$H$37,ROW(Empresas!$B$6:$B$46)-5),ROW($A37)),COLUMN(AE$1)),\"\")","v":""},{"$f":"IFERROR(INDEX(Empresas!$B$6:$AS$46,SMALL(IF(Empresas!$B$6:$B$46=Dados!$H$37,ROW(Empresas!$B$6:$B$46)-5),ROW($A37)),COLUMN(AF$1)),\"\")","v":""},{"$f":"IFERROR(INDEX(Empresas!$B$6:$AS$46,SMALL(IF(Empresas!$B$6:$B$46=Dados!$H$37,ROW(Empresas!$B$6:$B$46)-5),ROW($A37)),COLUMN(AG$1)),\"\")","v":""},{"$f":"IFERROR(INDEX(Empresas!$B$6:$AS$46,SMALL(IF(Empresas!$B$6:$B$46=Dados!$H$37,ROW(Empresas!$B$6:$B$46)-5),ROW($A37)),COLUMN(AH$1)),\"\")","v":""},{"$f":"IFERROR(INDEX(Empresas!$B$6:$AS$46,SMALL(IF(Empresas!$B$6:$B$46=Dados!$H$37,ROW(Empresas!$B$6:$B$46)-5),ROW($A37)),COLUMN(AI$1)),\"\")","v":""},{"$f":"IFERROR(INDEX(Empresas!$B$6:$AS$46,SMALL(IF(Empresas!$B$6:$B$46=Dados!$H$37,ROW(Empresas!$B$6:$B$46)-5),ROW($A37)),COLUMN(AJ$1)),\"\")","v":""},{"$f":"IFERROR(INDEX(Empresas!$B$6:$AS$46,SMALL(IF(Empresas!$B$6:$B$46=Dados!$H$37,ROW(Empresas!$B$6:$B$46)-5),ROW($A37)),COLUMN(AK$1)),\"\")","v":""},{"$f":"IFERROR(INDEX(Empresas!$B$6:$AS$46,SMALL(IF(Empresas!$B$6:$B$46=Dados!$H$37,ROW(Empresas!$B$6:$B$46)-5),ROW($A37)),COLUMN(AL$1)),\"\")","v":""},{"$f":"IFERROR(INDEX(Empresas!$B$6:$AS$46,SMALL(IF(Empresas!$B$6:$B$46=Dados!$H$37,ROW(Empresas!$B$6:$B$46)-5),ROW($A37)),COLUMN(AM$1)),\"\")","v":""},{"$f":"IFERROR(INDEX(Empresas!$B$6:$AS$46,SMALL(IF(Empresas!$B$6:$B$46=Dados!$H$37,ROW(Empresas!$B$6:$B$46)-5),ROW($A37)),COLUMN(AN$1)),\"\")","v":""},{"$f":"IFERROR(INDEX(Empresas!$B$6:$AS$46,SMALL(IF(Empresas!$B$6:$B$46=Dados!$H$37,ROW(Empresas!$B$6:$B$46)-5),ROW($A37)),COLUMN(AO$1)),\"\")","v":""},{"$f":"IFERROR(INDEX(Empresas!$B$6:$AS$46,SMALL(IF(Empresas!$B$6:$B$46=Dados!$H$37,ROW(Empresas!$B$6:$B$46)-5),ROW($A37)),COLUMN(AP$1)),\"\")","v":""},{"$f":"IFERROR(INDEX(Empresas!$B$6:$AS$46,SMALL(IF(Empresas!$B$6:$B$46=Dados!$H$37,ROW(Empresas!$B$6:$B$46)-5),ROW($A37)),COLUMN(AQ$1)),\"\")","v":""},{"$f":"IFERROR(INDEX(Empresas!$B$6:$AS$46,SMALL(IF(Empresas!$B$6:$B$46=Dados!$H$37,ROW(Empresas!$B$6:$B$46)-5),ROW($A37)),COLUMN(AR$1)),\"\")","v":""}]
[null,{"$f":"IFERROR(INDEX(Empresas!$B$6:$AS$46,SMALL(IF(Empresas!$B$6:$B$46=Dados!$H$37,ROW(Empresas!$B$6:$B$46)-5),ROW($A38)),COLUMN(B$1)),\"\")","v":""},{"$f":"IFERROR(INDEX(Empresas!$B$6:$AS$46,SMALL(IF(Empresas!$B$6:$B$46=Dados!$H$37,ROW(Empresas!$B$6:$B$46)-5),ROW($A38)),COLUMN(C$1)),\"\")","v":""},"",{"$f":"IFERROR(INDEX(Empresas!$B$6:$AS$46,SMALL(IF(Empresas!$B$6:$B$46=Dados!$H$37,ROW(Empresas!$B$6:$B$46)-5),ROW($A38)),COLUMN(F$1)),\"\")","v":""},{"$f":"IFERROR(INDEX(Empresas!$B$6:$AS$46,SMALL(IF(Empresas!$B$6:$B$46=Dados!$H$37,ROW(Empresas!$B$6:$B$46)-5),ROW($A38)),COLUMN(G$1)),\"\")","v":""},{"$f":"IFERROR(INDEX(Empresas!$B$6:$AS$46,SMALL(IF(Empresas!$B$6:$B$46=Dados!$H$37,ROW(Empresas!$B$6:$B$46)-5),ROW($A38)),COLUMN(H$1)),\"\")","v":""},{"$f":"IFERROR(INDEX(Empresas!$B$6:$AS$46,SMALL(IF(Empresas!$B$6:$B$46=Dados!$H$37,ROW(Empresas!$B$6:$B$46)-5),ROW($A38)),COLUMN(I$1)),\"\")","v":""},{"$f":"IFERROR(INDEX(Empresas!$B$6:$AS$46,SMALL(IF(Empresas!$B$6:$B$46=Dados!$H$37,ROW(Empresas!$B$6:$B$46)-5),ROW($A38)),COLUMN(J$1)),\"\")","v":""},{"$f":"IFERROR(INDEX(Empresas!$B$6:$AS$46,SMALL(IF(Empresas!$B$6:$B$46=Dados!$H$37,ROW(Empresas!$B$6:$B$46)-5),ROW($A38)),COLUMN(K$1)),\"\")","v":""},{"$f":"IFERROR(INDEX(Empresas!$B$6:$AS$46,SMALL(IF(Empresas!$B$6:$B$46=Dados!$H$37,ROW(Empresas!$B$6:$B$46)-5),ROW($A38)),COLUMN(L$1)),\"\")","v":""},{"$f":"IFERROR(INDEX(Empresas!$B$6:$AS$46,SMALL(IF(Empresas!$B$6:$B$46=Dados!$H$37,ROW(Empresas!$B$6:$B$46)-5),ROW($A38)),COLUMN(M$1)),\"\")","v":""},{"$f":"IFERROR(INDEX(Empresas!$B$6:$AS$46,SMALL(IF(Empresas!$B$6:$B$46=Dados!$H$37,ROW(Empresas!$B$6:$B$46)-5),ROW($A38)),COLUMN(N$1)),\"\")","v":""},{"$f":"IFERROR(INDEX(Empresas!$B$6:$AS$46,SMALL(IF(Empresas!$B$6:$B$46=Dados!$H$37,ROW(Empresas!$B$6:$B$46)-5),ROW($A38)),COLUMN(O$1)),\"\")","v":""},{"$f":"IFERROR(INDEX(Empresas!$B$6:$AS$46,SMALL(IF(Empresas!$B$6:$B$46=Dados!$H$37,ROW(Empresas!$B$6:$B$46)-5),ROW($A38)),COLUMN(P$1)),\"\")","v":""},{"$f":"IFERROR(INDEX(Empresas!$B$6:$AS$46,SMALL(IF(Empresas!$B$6:$B$46=Dados!$H$37,ROW(Empresas!$B$6:$B$46)-5),ROW($A38)),COLUMN(Q$1)),\"\")","v":""},{"$f":"IFERROR(INDEX(Empresas!$B$6:$AS$46,SMALL(IF(Empresas!$B$6:$B$46=Dados!$H$37,ROW(Empresas!$B$6:$B$46)-5),ROW($A38)),COLUMN(R$1)),\"\")","v":""},{"$f":"IFERROR(INDEX(Empresas!$B$6:$AS$46,SMALL(IF(Empresas!$B$6:$B$46=Dados!$H$37,ROW(Empresas!$B$6:$B$46)-5),ROW($A38)),COLUMN(S$1)),\"\")","v":""},{"$f":"IFERROR(INDEX(Empresas!$B$6:$AS$46,SMALL(IF(Empresas!$B$6:$B$46=Dados!$H$37,ROW(Empresas!$B$6:$B$46)-5),ROW($A38)),COLUMN(T$1)),\"\")","v":""},{"$f":"IFERROR(INDEX(Empresas!$B$6:$AS$46,SMALL(IF(Empresas!$B$6:$B$46=Dados!$H$37,ROW(Empresas!$B$6:$B$46)-5),ROW($A38)),COLUMN(U$1)),\"\")","v":""},{"$f":"IFERROR(INDEX(Empresas!$B$6:$AS$46,SMALL(IF(Empresas!$B$6:$B$46=Dados!$H$37,ROW(Empresas!$B$6:$B$46)-5),ROW($A38)),COLUMN(V$1)),\"\")","v":""},{"$f":"IFERROR(INDEX(Empresas!$B$6:$AS$46,SMALL(IF(Empresas!$B$6:$B$46=Dados!$H$37,ROW(Empresas!$B$6:$B$46)-5),ROW($A38)),COLUMN(W$1)),\"\")","v":""},{"$f":"IFERROR(INDEX(Empresas!$B$6:$AS$46,SMALL(IF(Empresas!$B$6:$B$46=Dados!$H$37,ROW(Empresas!$B$6:$B$46)-5),ROW($A38)),COLUMN(X$1)),\"\")","v":""},{"$f":"IFERROR(INDEX(Empresas!$B$6:$AS$46,SMALL(IF(Empresas!$B$6:$B$46=Dados!$H$37,ROW(Empresas!$B$6:$B$46)-5),ROW($A38)),COLUMN(Y$1)),\"\")","v":""},{"$f":"IFERROR(INDEX(Empresas!$B$6:$AS$46,SMALL(IF(Empresas!$B$6:$B$46=Dados!$H$37,ROW(Empresas!$B$6:$B$46)-5),ROW($A38)),COLUMN(Z$1)),\"\")","v":""},{"$f":"IFERROR(INDEX(Empresas!$B$6:$AS$46,SMALL(IF(Empresas!$B$6:$B$46=Dados!$H$37,ROW(Empresas!$B$6:$B$46)-5),ROW($A38)),COLUMN(AA$1)),\"\")","v":""},{"$f":"IFERROR(INDEX(Empresas!$B$6:$AS$46,SMALL(IF(Empresas!$B$6:$B$46=Dados!$H$37,ROW(Empresas!$B$6:$B$46)-5),ROW($A38)),COLUMN(AB$1)),\"\")","v":""},{"$f":"IFERROR(INDEX(Empresas!$B$6:$AS$46,SMALL(IF(Empresas!$B$6:$B$46=Dados!$H$37,ROW(Empresas!$B$6:$B$46)-5),ROW($A38)),COLUMN(AC$1)),\"\")","v":""},{"$f":"IFERROR(INDEX(Empresas!$B$6:$AS$46,SMALL(IF(Empresas!$B$6:$B$46=Dados!$H$37,ROW(Empresas!$B$6:$B$46)-5),ROW($A38)),COLUMN(AD$1)),\"\")","v":""},{"$f":"IFERROR(INDEX(Empresas!$B$6:$AS$46,SMALL(IF(Empresas!$B$6:$B$46=Dados!$H$37,ROW(Empresas!$B$6:$B$46)-5),ROW($A38)),COLUMN(AE$1)),\"\")","v":""},{"$f":"IFERROR(INDEX(Empresas!$B$6:$AS$46,SMALL(IF(Empresas!$B$6:$B$46=Dados!$H$37,ROW(Empresas!$B$6:$B$46)-5),ROW($A38)),COLUMN(AF$1)),\"\")","v":""},{"$f":"IFERROR(INDEX(Empresas!$B$6:$AS$46,SMALL(IF(Empresas!$B$6:$B$46=Dados!$H$37,ROW(Empresas!$B$6:$B$46)-5),ROW($A38)),COLUMN(AG$1)),\"\")","v":""},{"$f":"IFERROR(INDEX(Empresas!$B$6:$AS$46,SMALL(IF(Empresas!$B$6:$B$46=Dados!$H$37,ROW(Empresas!$B$6:$B$46)-5),ROW($A38)),COLUMN(AH$1)),\"\")","v":""},{"$f":"IFERROR(INDEX(Empresas!$B$6:$AS$46,SMALL(IF(Empresas!$B$6:$B$46=Dados!$H$37,ROW(Empresas!$B$6:$B$46)-5),ROW($A38)),COLUMN(AI$1)),\"\")","v":""},{"$f":"IFERROR(INDEX(Empresas!$B$6:$AS$46,SMALL(IF(Empresas!$B$6:$B$46=Dados!$H$37,ROW(Empresas!$B$6:$B$46)-5),ROW($A38)),COLUMN(AJ$1)),\"\")","v":""},{"$f":"IFERROR(INDEX(Empresas!$B$6:$AS$46,SMALL(IF(Empresas!$B$6:$B$46=Dados!$H$37,ROW(Empresas!$B$6:$B$46)-5),ROW($A38)),COLUMN(AK$1)),\"\")","v":""},{"$f":"IFERROR(INDEX(Empresas!$B$6:$AS$46,SMALL(IF(Empresas!$B$6:$B$46=Dados!$H$37,ROW(Empresas!$B$6:$B$46)-5),ROW($A38)),COLUMN(AL$1)),\"\")","v":""},{"$f":"IFERROR(INDEX(Empresas!$B$6:$AS$46,SMALL(IF(Empresas!$B$6:$B$46=Dados!$H$37,ROW(Empresas!$B$6:$B$46)-5),ROW($A38)),COLUMN(AM$1)),\"\")","v":""},{"$f":"IFERROR(INDEX(Empresas!$B$6:$AS$46,SMALL(IF(Empresas!$B$6:$B$46=Dados!$H$37,ROW(Empresas!$B$6:$B$46)-5),ROW($A38)),COLUMN(AN$1)),\"\")","v":""},{"$f":"IFERROR(INDEX(Empresas!$B$6:$AS$46,SMALL(IF(Empresas!$B$6:$B$46=Dados!$H$37,ROW(Empresas!$B$6:$B$46)-5),ROW($A38)),COLUMN(AO$1)),\"\")","v":""},{"$f":"IFERROR(INDEX(Empresas!$B$6:$AS$46,SMALL(IF(Empresas!$B$6:$B$46=Dados!$H$37,ROW(Empresas!$B$6:$B$46)-5),ROW($A38)),COLUMN(AP$1)),\"\")","v":""},{"$f":"IFERROR(INDEX(Empresas!$B$6:$AS$46,SMALL(IF(Empresas!$B$6:$B$46=Dados!$H$37,ROW(Empresas!$B$6:$B$46)-5),ROW($A38)),COLUMN(AQ$1)),\"\")","v":""},{"$f":"IFERROR(INDEX(Empresas!$B$6:$AS$46,SMALL(IF(Empresas!$B$6:$B$46=Dados!$H$37,ROW(Empresas!$B$6:$B$46)-5),ROW($A38)),COLUMN(AR$1)),\"\")","v":""}]
[null,{"$f":"IFERROR(INDEX(Empresas!$B$6:$AS$46,SMALL(IF(Empresas!$B$6:$B$46=Dados!$H$37,ROW(Empresas!$B$6:$B$46)-5),ROW($A39)),COLUMN(B$1)),\"\")","v":""},{"$f":"IFERROR(INDEX(Empresas!$B$6:$AS$46,SMALL(IF(Empresas!$B$6:$B$46=Dados!$H$37,ROW(Empresas!$B$6:$B$46)-5),ROW($A39)),COLUMN(C$1)),\"\")","v":""},"",{"$f":"IFERROR(INDEX(Empresas!$B$6:$AS$46,SMALL(IF(Empresas!$B$6:$B$46=Dados!$H$37,ROW(Empresas!$B$6:$B$46)-5),ROW($A39)),COLUMN(F$1)),\"\")","v":""},{"$f":"IFERROR(INDEX(Empresas!$B$6:$AS$46,SMALL(IF(Empresas!$B$6:$B$46=Dados!$H$37,ROW(Empresas!$B$6:$B$46)-5),ROW($A39)),COLUMN(G$1)),\"\")","v":""},{"$f":"IFERROR(INDEX(Empresas!$B$6:$AS$46,SMALL(IF(Empresas!$B$6:$B$46=Dados!$H$37,ROW(Empresas!$B$6:$B$46)-5),ROW($A39)),COLUMN(H$1)),\"\")","v":""},{"$f":"IFERROR(INDEX(Empresas!$B$6:$AS$46,SMALL(IF(Empresas!$B$6:$B$46=Dados!$H$37,ROW(Empresas!$B$6:$B$46)-5),ROW($A39)),COLUMN(I$1)),\"\")","v":""},{"$f":"IFERROR(INDEX(Empresas!$B$6:$AS$46,SMALL(IF(Empresas!$B$6:$B$46=Dados!$H$37,ROW(Empresas!$B$6:$B$46)-5),ROW($A39)),COLUMN(J$1)),\"\")","v":""},{"$f":"IFERROR(INDEX(Empresas!$B$6:$AS$46,SMALL(IF(Empresas!$B$6:$B$46=Dados!$H$37,ROW(Empresas!$B$6:$B$46)-5),ROW($A39)),COLUMN(K$1)),\"\")","v":""},{"$f":"IFERROR(INDEX(Empresas!$B$6:$AS$46,SMALL(IF(Empresas!$B$6:$B$46=Dados!$H$37,ROW(Empresas!$B$6:$B$46)-5),ROW($A39)),COLUMN(L$1)),\"\")","v":""},{"$f":"IFERROR(INDEX(Empresas!$B$6:$AS$46,SMALL(IF(Empresas!$B$6:$B$46=Dados!$H$37,ROW(Empresas!$B$6:$B$46)-5),ROW($A39)),COLUMN(M$1)),\"\")","v":""},{"$f":"IFERROR(INDEX(Empresas!$B$6:$AS$46,SMALL(IF(Empresas!$B$6:$B$46=Dados!$H$37,ROW(Empresas!$B$6:$B$46)-5),ROW($A39)),COLUMN(N$1)),\"\")","v":""},{"$f":"IFERROR(INDEX(Empresas!$B$6:$AS$46,SMALL(IF(Empresas!$B$6:$B$46=Dados!$H$37,ROW(Empresas!$B$6:$B$46)-5),ROW($A39)),COLUMN(O$1)),\"\")","v":""},{"$f":"IFERROR(INDEX(Empresas!$B$6:$AS$46,SMALL(IF(Empresas!$B$6:$B$46=Dados!$H$37,ROW(Empresas!$B$6:$B$46)-5),ROW($A39)),COLUMN(P$1)),\"\")","v":""},{"$f":"IFERROR(INDEX(Empresas!$B$6:$AS$46,SMALL(IF(Empresas!$B$6:$B$46=Dados!$H$37,ROW(Empresas!$B$6:$B$46)-5),ROW($A39)),COLUMN(Q$1)),\"\")","v":""},{"$f":"IFERROR(INDEX(Empresas!$B$6:$AS$46,SMALL(IF(Empresas!$B$6:$B$46=Dados!$H$37,ROW(Empresas!$B$6:$B$46)-5),ROW($A39)),COLUMN(R$1)),\"\")","v":""},{"$f":"IFERROR(INDEX(Empresas!$B$6:$AS$46,SMALL(IF(Empresas!$B$6:$B$46=Dados!$H$37,ROW(Empresas!$B$6:$B$46)-5),ROW($A39)),COLUMN(S$1)),\"\")","v":""},{"$f":"IFERROR(INDEX(Empresas!$B$6:$AS$46,SMALL(IF(Empresas!$B$6:$B$46=Dados!$H$37,ROW(Empresas!$B$6:$B$46)-5),ROW($A39)),COLUMN(T$1)),\"\")","v":""},{"$f":"IFERROR(INDEX(Empresas!$B$6:$AS$46,SMALL(IF(Empresas!$B$6:$B$46=Dados!$H$37,ROW(Empresas!$B$6:$B$46)-5),ROW($A39)),COLUMN(U$1)),\"\")","v":""},{"$f":"IFERROR(INDEX(Empresas!$B$6:$AS$46,SMALL(IF(Empresas!$B$6:$B$46=Dados!$H$37,ROW(Empresas!$B$6:$B$46)-5),ROW($A39)),COLUMN(V$1)),\"\")","v":""},{"$f":"IFERROR(INDEX(Empresas!$B$6:$AS$46,SMALL(IF(Empresas!$B$6:$B$46=Dados!$H$37,ROW(Empresas!$B$6:$B$46)-5),ROW($A39)),COLUMN(W$1)),\"\")","v":""},{"$f":"IFERROR(INDEX(Empresas!$B$6:$AS$46,SMALL(IF(Empresas!$B$6:$B$46=Dados!$H$37,ROW(Empresas!$B$6:$B$46)-5),ROW($A39)),COLUMN(X$1)),\"\")","v":""},{"$f":"IFERROR(INDEX(Empresas!$B$6:$AS$46,SMALL(IF(Empresas!$B$6:$B$46=Dados!$H$37,ROW(Empresas!$B$6:$B$46)-5),ROW($A39)),COLUMN(Y$1)),\"\")","v":""},{"$f":"IFERROR(INDEX(Empresas!$B$6:$AS$46,SMALL(IF(Empresas!$B$6:$B$46=Dados!$H$37,ROW(Empresas!$B$6:$B$46)-5),ROW($A39)),COLUMN(Z$1)),\"\")","v":""},{"$f":"IFERROR(INDEX(Empresas!$B$6:$AS$46,SMALL(IF(Empresas!$B$6:$B$46=Dados!$H$37,ROW(Empresas!$B$6:$B$46)-5),ROW($A39)),COLUMN(AA$1)),\"\")","v":""},{"$f":"IFERROR(INDEX(Empresas!$B$6:$AS$46,SMALL(IF(Empresas!$B$6:$B$46=Dados!$H$37,ROW(Empresas!$B$6:$B$46)-5),ROW($A39)),COLUMN(AB$1)),\"\")","v":""},{"$f":"IFERROR(INDEX(Empresas!$B$6:$AS$46,SMALL(IF(Empresas!$B$6:$B$46=Dados!$H$37,ROW(Empresas!$B$6:$B$46)-5),ROW($A39)),COLUMN(AC$1)),\"\")","v":""},{"$f":"IFERROR(INDEX(Empresas!$B$6:$AS$46,SMALL(IF(Empresas!$B$6:$B$46=Dados!$H$37,ROW(Empresas!$B$6:$B$46)-5),ROW($A39)),COLUMN(AD$1)),\"\")","v":""},{"$f":"IFERROR(INDEX(Empresas!$B$6:$AS$46,SMALL(IF(Empresas!$B$6:$B$46=Dados!$H$37,ROW(Empresas!$B$6:$B$46)-5),ROW($A39)),COLUMN(AE$1)),\"\")","v":""},{"$f":"IFERROR(INDEX(Empresas!$B$6:$AS$46,SMALL(IF(Empresas!$B$6:$B$46=Dados!$H$37,ROW(Empresas!$B$6:$B$46)-5),ROW($A39)),COLUMN(AF$1)),\"\")","v":""},{"$f":"IFERROR(INDEX(Empresas!$B$6:$AS$46,SMALL(IF(Empresas!$B$6:$B$46=Dados!$H$37,ROW(Empresas!$B$6:$B$46)-5),ROW($A39)),COLUMN(AG$1)),\"\")","v":""},{"$f":"IFERROR(INDEX(Empresas!$B$6:$AS$46,SMALL(IF(Empresas!$B$6:$B$46=Dados!$H$37,ROW(Empresas!$B$6:$B$46)-5),ROW($A39)),COLUMN(AH$1)),\"\")","v":""},{"$f":"IFERROR(INDEX(Empresas!$B$6:$AS$46,SMALL(IF(Empresas!$B$6:$B$46=Dados!$H$37,ROW(Empresas!$B$6:$B$46)-5),ROW($A39)),COLUMN(AI$1)),\"\")","v":""},{"$f":"IFERROR(INDEX(Empresas!$B$6:$AS$46,SMALL(IF(Empresas!$B$6:$B$46=Dados!$H$37,ROW(Empresas!$B$6:$B$46)-5),ROW($A39)),COLUMN(AJ$1)),\"\")","v":""},{"$f":"IFERROR(INDEX(Empresas!$B$6:$AS$46,SMALL(IF(Empresas!$B$6:$B$46=Dados!$H$37,ROW(Empresas!$B$6:$B$46)-5),ROW($A39)),COLUMN(AK$1)),\"\")","v":""},{"$f":"IFERROR(INDEX(Empresas!$B$6:$AS$46,SMALL(IF(Empresas!$B$6:$B$46=Dados!$H$37,ROW(Empresas!$B$6:$B$46)-5),ROW($A39)),COLUMN(AL$1)),\"\")","v":""},{"$f":"IFERROR(INDEX(Empresas!$B$6:$AS$46,SMALL(IF(Empresas!$B$6:$B$46=Dados!$H$37,ROW(Empresas!$B$6:$B$46)-5),ROW($A39)),COLUMN(AM$1)),\"\")","v":""},{"$f":"IFERROR(INDEX(Empresas!$B$6:$AS$46,SMALL(IF(Empresas!$B$6:$B$46=Dados!$H$37,ROW(Empresas!$B$6:$B$46)-5),ROW($A39)),COLUMN(AN$1)),\"\")","v":""},{"$f":"IFERROR(INDEX(Empresas!$B$6:$AS$46,SMALL(IF(Empresas!$B$6:$B$46=Dados!$H$37,ROW(Empresas!$B$6:$B$46)-5),ROW($A39)),COLUMN(AO$1)),\"\")","v":""},{"$f":"IFERROR(INDEX(Empresas!$B$6:$AS$46,SMALL(IF(Empresas!$B$6:$B$46=Dados!$H$37,ROW(Empresas!$B$6:$B$46)-5),ROW($A39)),COLUMN(AP$1)),\"\")","v":""},{"$f":"IFERROR(INDEX(Empresas!$B$6:$AS$46,SMALL(IF(Empresas!$B$6:$B$46=Dados!$H$37,ROW(Empresas!$B$6:$B$46)-5),ROW($A39)),COLUMN(AQ$1)),\"\")","v":""},{"$f":"IFERROR(INDEX(Empresas!$B$6:$AS$46,SMALL(IF(Empresas!$B$6:$B$46=Dados!$H$37,ROW(Empresas!$B$6:$B$46)-5),ROW($A39)),COLUMN(AR$1)),\"\")","v":""}]
[null,{"$f":"IFERROR(INDEX(Empresas!$B$6:$AS$46,SMALL(IF(Empresas!$B$6:$B$46=Dados!$H$37,ROW(Empresas!$B$6:$B$46)-5),ROW($A40)),COLUMN(B$1)),\"\")","v":""},{"$f":"IFERROR(INDEX(Empresas!$B$6:$AS$46,SMALL(IF(Empresas!$B$6:$B$46=Dados!$H$37,ROW(Empresas!$B$6:$B$46)-5),ROW($A40)),COLUMN(C$1)),\"\")","v":""},"",{"$f":"IFERROR(INDEX(Empresas!$B$6:$AS$46,SMALL(IF(Empresas!$B$6:$B$46=Dados!$H$37,ROW(Empresas!$B$6:$B$46)-5),ROW($A40)),COLUMN(F$1)),\"\")","v":""},{"$f":"IFERROR(INDEX(Empresas!$B$6:$AS$46,SMALL(IF(Empresas!$B$6:$B$46=Dados!$H$37,ROW(Empresas!$B$6:$B$46)-5),ROW($A40)),COLUMN(G$1)),\"\")","v":""},{"$f":"IFERROR(INDEX(Empresas!$B$6:$AS$46,SMALL(IF(Empresas!$B$6:$B$46=Dados!$H$37,ROW(Empresas!$B$6:$B$46)-5),ROW($A40)),COLUMN(H$1)),\"\")","v":""},{"$f":"IFERROR(INDEX(Empresas!$B$6:$AS$46,SMALL(IF(Empresas!$B$6:$B$46=Dados!$H$37,ROW(Empresas!$B$6:$B$46)-5),ROW($A40)),COLUMN(I$1)),\"\")","v":""},{"$f":"IFERROR(INDEX(Empresas!$B$6:$AS$46,SMALL(IF(Empresas!$B$6:$B$46=Dados!$H$37,ROW(Empresas!$B$6:$B$46)-5),ROW($A40)),COLUMN(J$1)),\"\")","v":""},{"$f":"IFERROR(INDEX(Empresas!$B$6:$AS$46,SMALL(IF(Empresas!$B$6:$B$46=Dados!$H$37,ROW(Empresas!$B$6:$B$46)-5),ROW($A40)),COLUMN(K$1)),\"\")","v":""},{"$f":"IFERROR(INDEX(Empresas!$B$6:$AS$46,SMALL(IF(Empresas!$B$6:$B$46=Dados!$H$37,ROW(Empresas!$B$6:$B$46)-5),ROW($A40)),COLUMN(L$1)),\"\")","v":""},{"$f":"IFERROR(INDEX(Empresas!$B$6:$AS$46,SMALL(IF(Empresas!$B$6:$B$46=Dados!$H$37,ROW(Empresas!$B$6:$B$46)-5),ROW($A40)),COLUMN(M$1)),\"\")","v":""},{"$f":"IFERROR(INDEX(Empresas!$B$6:$AS$46,SMALL(IF(Empresas!$B$6:$B$46=Dados!$H$37,ROW(Empresas!$B$6:$B$46)-5),ROW($A40)),COLUMN(N$1)),\"\")","v":""},{"$f":"IFERROR(INDEX(Empresas!$B$6:$AS$46,SMALL(IF(Empresas!$B$6:$B$46=Dados!$H$37,ROW(Empresas!$B$6:$B$46)-5),ROW($A40)),COLUMN(O$1)),\"\")","v":""},{"$f":"IFERROR(INDEX(Empresas!$B$6:$AS$46,SMALL(IF(Empresas!$B$6:$B$46=Dados!$H$37,ROW(Empresas!$B$6:$B$46)-5),ROW($A40)),COLUMN(P$1)),\"\")","v":""},{"$f":"IFERROR(INDEX(Empresas!$B$6:$AS$46,SMALL(IF(Empresas!$B$6:$B$46=Dados!$H$37,ROW(Empresas!$B$6:$B$46)-5),ROW($A40)),COLUMN(Q$1)),\"\")","v":""},{"$f":"IFERROR(INDEX(Empresas!$B$6:$AS$46,SMALL(IF(Empresas!$B$6:$B$46=Dados!$H$37,ROW(Empresas!$B$6:$B$46)-5),ROW($A40)),COLUMN(R$1)),\"\")","v":""},{"$f":"IFERROR(INDEX(Empresas!$B$6:$AS$46,SMALL(IF(Empresas!$B$6:$B$46=Dados!$H$37,ROW(Empresas!$B$6:$B$46)-5),ROW($A40)),COLUMN(S$1)),\"\")","v":""},{"$f":"IFERROR(INDEX(Empresas!$B$6:$AS$46,SMALL(IF(Empresas!$B$6:$B$46=Dados!$H$37,ROW(Empresas!$B$6:$B$46)-5),ROW($A40)),COLUMN(T$1)),\"\")","v":""},{"$f":"IFERROR(INDEX(Empresas!$B$6:$AS$46,SMALL(IF(Empresas!$B$6:$B$46=Dados!$H$37,ROW(Empresas!$B$6:$B$46)-5),ROW($A40)),COLUMN(U$1)),\"\")","v":""},{"$f":"IFERROR(INDEX(Empresas!$B$6:$AS$46,SMALL(IF(Empresas!$B$6:$B$46=Dados!$H$37,ROW(Empresas!$B$6:$B$46)-5),ROW($A40)),COLUMN(V$1)),\"\")","v":""},{"$f":"IFERROR(INDEX(Empresas!$B$6:$AS$46,SMALL(IF(Empresas!$B$6:$B$46=Dados!$H$37,ROW(Empresas!$B$6:$B$46)-5),ROW($A40)),COLUMN(W$1)),\"\")","v":""},{"$f":"IFERROR(INDEX(Empresas!$B$6:$AS$46,SMALL(IF(Empresas!$B$6:$B$46=Dados!$H$37,ROW(Empresas!$B$6:$B$46)-5),ROW($A40)),COLUMN(X$1)),\"\")","v":""},{"$f":"IFERROR(INDEX(Empresas!$B$6:$AS$46,SMALL(IF(Empresas!$B$6:$B$46=Dados!$H$37,ROW(Empresas!$B$6:$B$46)-5),ROW($A40)),COLUMN(Y$1)),\"\")","v":""},{"$f":"IFERROR(INDEX(Empresas!$B$6:$AS$46,SMALL(IF(Empresas!$B$6:$B$46=Dados!$H$37,ROW(Empresas!$B$6:$B$46)-5),ROW($A40)),COLUMN(Z$1)),\"\")","v":""},{"$f":"IFERROR(INDEX(Empresas!$B$6:$AS$46,SMALL(IF(Empresas!$B$6:$B$46=Dados!$H$37,ROW(Empresas!$B$6:$B$46)-5),ROW($A40)),COLUMN(AA$1)),\"\")","v":""},{"$f":"IFERROR(INDEX(Empresas!$B$6:$AS$46,SMALL(IF(Empresas!$B$6:$B$46=Dados!$H$37,ROW(Empresas!$B$6:$B$46)-5),ROW($A40)),COLUMN(AB$1)),\"\")","v":""},{"$f":"IFERROR(INDEX(Empresas!$B$6:$AS$46,SMALL(IF(Empresas!$B$6:$B$46=Dados!$H$37,ROW(Empresas!$B$6:$B$46)-5),ROW($A40)),COLUMN(AC$1)),\"\")","v":""},{"$f":"IFERROR(INDEX(Empresas!$B$6:$AS$46,SMALL(IF(Empresas!$B$6:$B$46=Dados!$H$37,ROW(Empresas!$B$6:$B$46)-5),ROW($A40)),COLUMN(AD$1)),\"\")","v":""},{"$f":"IFERROR(INDEX(Empresas!$B$6:$AS$46,SMALL(IF(Empresas!$B$6:$B$46=Dados!$H$37,ROW(Empresas!$B$6:$B$46)-5),ROW($A40)),COLUMN(AE$1)),\"\")","v":""},{"$f":"IFERROR(INDEX(Empresas!$B$6:$AS$46,SMALL(IF(Empresas!$B$6:$B$46=Dados!$H$37,ROW(Empresas!$B$6:$B$46)-5),ROW($A40)),COLUMN(AF$1)),\"\")","v":""},{"$f":"IFERROR(INDEX(Empresas!$B$6:$AS$46,SMALL(IF(Empresas!$B$6:$B$46=Dados!$H$37,ROW(Empresas!$B$6:$B$46)-5),ROW($A40)),COLUMN(AG$1)),\"\")","v":""},{"$f":"IFERROR(INDEX(Empresas!$B$6:$AS$46,SMALL(IF(Empresas!$B$6:$B$46=Dados!$H$37,ROW(Empresas!$B$6:$B$46)-5),ROW($A40)),COLUMN(AH$1)),\"\")","v":""},{"$f":"IFERROR(INDEX(Empresas!$B$6:$AS$46,SMALL(IF(Empresas!$B$6:$B$46=Dados!$H$37,ROW(Empresas!$B$6:$B$46)-5),ROW($A40)),COLUMN(AI$1)),\"\")","v":""},{"$f":"IFERROR(INDEX(Empresas!$B$6:$AS$46,SMALL(IF(Empresas!$B$6:$B$46=Dados!$H$37,ROW(Empresas!$B$6:$B$46)-5),ROW($A40)),COLUMN(AJ$1)),\"\")","v":""},{"$f":"IFERROR(INDEX(Empresas!$B$6:$AS$46,SMALL(IF(Empresas!$B$6:$B$46=Dados!$H$37,ROW(Empresas!$B$6:$B$46)-5),ROW($A40)),COLUMN(AK$1)),\"\")","v":""},{"$f":"IFERROR(INDEX(Empresas!$B$6:$AS$46,SMALL(IF(Empresas!$B$6:$B$46=Dados!$H$37,ROW(Empresas!$B$6:$B$46)-5),ROW($A40)),COLUMN(AL$1)),\"\")","v":""},{"$f":"IFERROR(INDEX(Empresas!$B$6:$AS$46,SMALL(IF(Empresas!$B$6:$B$46=Dados!$H$37,ROW(Empresas!$B$6:$B$46)-5),ROW($A40)),COLUMN(AM$1)),\"\")","v":""},{"$f":"IFERROR(INDEX(Empresas!$B$6:$AS$46,SMALL(IF(Empresas!$B$6:$B$46=Dados!$H$37,ROW(Empresas!$B$6:$B$46)-5),ROW($A40)),COLUMN(AN$1)),\"\")","v":""},{"$f":"IFERROR(INDEX(Empresas!$B$6:$AS$46,SMALL(IF(Empresas!$B$6:$B$46=Dados!$H$37,ROW(Empresas!$B$6:$B$46)-5),ROW($A40)),COLUMN(AO$1)),\"\")","v":""},{"$f":"IFERROR(INDEX(Empresas!$B$6:$AS$46,SMALL(IF(Empresas!$B$6:$B$46=Dados!$H$37,ROW(Empresas!$B$6:$B$46)-5),ROW($A40)),COLUMN(AP$1)),\"\")","v":""},{"$f":"IFERROR(INDEX(Empresas!$B$6:$AS$46,SMALL(IF(Empresas!$B$6:$B$46=Dados!$H$37,ROW(Empresas!$B$6:$B$46)-5),ROW($A40)),COLUMN(AQ$1)),\"\")","v":""},{"$f":"IFERROR(INDEX(Empresas!$B$6:$AS$46,SMALL(IF(Empresas!$B$6:$B$46=Dados!$H$37,ROW(Empresas!$B$6:$B$46)-5),ROW($A40)),COLUMN(AR$1)),\"\")","v":""}]
[null,{"$f":"IFERROR(INDEX(Empresas!$B$6:$AS$46,SMALL(IF(Empresas!$B$6:$B$46=Dados!$H$37,ROW(Empresas!$B$6:$B$46)-5),ROW($A41)),COLUMN(B$1)),\"\")","v":""},{"$f":"IFERROR(INDEX(Empresas!$B$6:$AS$46,SMALL(IF(Empresas!$B$6:$B$46=Dados!$H$37,ROW(Empresas!$B$6:$B$46)-5),ROW($A41)),COLUMN(C$1)),\"\")","v":""},"",{"$f":"IFERROR(INDEX(Empresas!$B$6:$AS$46,SMALL(IF(Empresas!$B$6:$B$46=Dados!$H$37,ROW(Empresas!$B$6:$B$46)-5),ROW($A41)),COLUMN(F$1)),\"\")","v":""},{"$f":"IFERROR(INDEX(Empresas!$B$6:$AS$46,SMALL(IF(Empresas!$B$6:$B$46=Dados!$H$37,ROW(Empresas!$B$6:$B$46)-5),ROW($A41)),COLUMN(G$1)),\"\")","v":""},{"$f":"IFERROR(INDEX(Empresas!$B$6:$AS$46,SMALL(IF(Empresas!$B$6:$B$46=Dados!$H$37,ROW(Empresas!$B$6:$B$46)-5),ROW($A41)),COLUMN(H$1)),\"\")","v":""},{"$f":"IFERROR(INDEX(Empresas!$B$6:$AS$46,SMALL(IF(Empresas!$B$6:$B$46=Dados!$H$37,ROW(Empresas!$B$6:$B$46)-5),ROW($A41)),COLUMN(I$1)),\"\")","v":""},{"$f":"IFERROR(INDEX(Empresas!$B$6:$AS$46,SMALL(IF(Empresas!$B$6:$B$46=Dados!$H$37,ROW(Empresas!$B$6:$B$46)-5),ROW($A41)),COLUMN(J$1)),\"\")","v":""},{"$f":"IFERROR(INDEX(Empresas!$B$6:$AS$46,SMALL(IF(Empresas!$B$6:$B$46=Dados!$H$37,ROW(Empresas!$B$6:$B$46)-5),ROW($A41)),COLUMN(K$1)),\"\")","v":""},{"$f":"IFERROR(INDEX(Empresas!$B$6:$AS$46,SMALL(IF(Empresas!$B$6:$B$46=Dados!$H$37,ROW(Empresas!$B$6:$B$46)-5),ROW($A41)),COLUMN(L$1)),\"\")","v":""},{"$f":"IFERROR(INDEX(Empresas!$B$6:$AS$46,SMALL(IF(Empresas!$B$6:$B$46=Dados!$H$37,ROW(Empresas!$B$6:$B$46)-5),ROW($A41)),COLUMN(M$1)),\"\")","v":""},{"$f":"IFERROR(INDEX(Empresas!$B$6:$AS$46,SMALL(IF(Empresas!$B$6:$B$46=Dados!$H$37,ROW(Empresas!$B$6:$B$46)-5),ROW($A41)),COLUMN(N$1)),\"\")","v":""},{"$f":"IFERROR(INDEX(Empresas!$B$6:$AS$46,SMALL(IF(Empresas!$B$6:$B$46=Dados!$H$37,ROW(Empresas!$B$6:$B$46)-5),ROW($A41)),COLUMN(O$1)),\"\")","v":""},{"$f":"IFERROR(INDEX(Empresas!$B$6:$AS$46,SMALL(IF(Empresas!$B$6:$B$46=Dados!$H$37,ROW(Empresas!$B$6:$B$46)-5),ROW($A41)),COLUMN(P$1)),\"\")","v":""},{"$f":"IFERROR(INDEX(Empresas!$B$6:$AS$46,SMALL(IF(Empresas!$B$6:$B$46=Dados!$H$37,ROW(Empresas!$B$6:$B$46)-5),ROW($A41)),COLUMN(Q$1)),\"\")","v":""},{"$f":"IFERROR(INDEX(Empresas!$B$6:$AS$46,SMALL(IF(Empresas!$B$6:$B$46=Dados!$H$37,ROW(Empresas!$B$6:$B$46)-5),ROW($A41)),COLUMN(R$1)),\"\")","v":""},{"$f":"IFERROR(INDEX(Empresas!$B$6:$AS$46,SMALL(IF(Empresas!$B$6:$B$46=Dados!$H$37,ROW(Empresas!$B$6:$B$46)-5),ROW($A41)),COLUMN(S$1)),\"\")","v":""},{"$f":"IFERROR(INDEX(Empresas!$B$6:$AS$46,SMALL(IF(Empresas!$B$6:$B$46=Dados!$H$37,ROW(Empresas!$B$6:$B$46)-5),ROW($A41)),COLUMN(T$1)),\"\")","v":""},{"$f":"IFERROR(INDEX(Empresas!$B$6:$AS$46,SMALL(IF(Empresas!$B$6:$B$46=Dados!$H$37,ROW(Empresas!$B$6:$B$46)-5),ROW($A41)),COLUMN(U$1)),\"\")","v":""},{"$f":"IFERROR(INDEX(Empresas!$B$6:$AS$46,SMALL(IF(Empresas!$B$6:$B$46=Dados!$H$37,ROW(Empresas!$B$6:$B$46)-5),ROW($A41)),COLUMN(V$1)),\"\")","v":""},{"$f":"IFERROR(INDEX(Empresas!$B$6:$AS$46,SMALL(IF(Empresas!$B$6:$B$46=Dados!$H$37,ROW(Empresas!$B$6:$B$46)-5),ROW($A41)),COLUMN(W$1)),\"\")","v":""},{"$f":"IFERROR(INDEX(Empresas!$B$6:$AS$46,SMALL(IF(Empresas!$B$6:$B$46=Dados!$H$37,ROW(Empresas!$B$6:$B$46)-5),ROW($A41)),COLUMN(X$1)),\"\")","v":""},{"$f":"IFERROR(INDEX(Empresas!$B$6:$AS$46,SMALL(IF(Empresas!$B$6:$B$46=Dados!$H$37,ROW(Empresas!$B$6:$B$46)-5),ROW($A41)),COLUMN(Y$1)),\"\")","v":""},{"$f":"IFERROR(INDEX(Empresas!$B$6:$AS$46,SMALL(IF(Empresas!$B$6:$B$46=Dados!$H$37,ROW(Empresas!$B$6:$B$46)-5),ROW($A41)),COLUMN(Z$1)),\"\")","v":""},{"$f":"IFERROR(INDEX(Empresas!$B$6:$AS$46,SMALL(IF(Empresas!$B$6:$B$46=Dados!$H$37,ROW(Empresas!$B$6:$B$46)-5),ROW($A41)),COLUMN(AA$1)),\"\")","v":""},{"$f":"IFERROR(INDEX(Empresas!$B$6:$AS$46,SMALL(IF(Empresas!$B$6:$B$46=Dados!$H$37,ROW(Empresas!$B$6:$B$46)-5),ROW($A41)),COLUMN(AB$1)),\"\")","v":""},{"$f":"IFERROR(INDEX(Empresas!$B$6:$AS$46,SMALL(IF(Empresas!$B$6:$B$46=Dados!$H$37,ROW(Empresas!$B$6:$B$46)-5),ROW($A41)),COLUMN(AC$1)),\"\")","v":""},{"$f":"IFERROR(INDEX(Empresas!$B$6:$AS$46,SMALL(IF(Empresas!$B$6:$B$46=Dados!$H$37,ROW(Empresas!$B$6:$B$46)-5),ROW($A41)),COLUMN(AD$1)),\"\")","v":""},{"$f":"IFERROR(INDEX(Empresas!$B$6:$AS$46,SMALL(IF(Empresas!$B$6:$B$46=Dados!$H$37,ROW(Empresas!$B$6:$B$46)-5),ROW($A41)),COLUMN(AE$1)),\"\")","v":""},{"$f":"IFERROR(INDEX(Empresas!$B$6:$AS$46,SMALL(IF(Empresas!$B$6:$B$46=Dados!$H$37,ROW(Empresas!$B$6:$B$46)-5),ROW($A41)),COLUMN(AF$1)),\"\")","v":""},{"$f":"IFERROR(INDEX(Empresas!$B$6:$AS$46,SMALL(IF(Empresas!$B$6:$B$46=Dados!$H$37,ROW(Empresas!$B$6:$B$46)-5),ROW($A41)),COLUMN(AG$1)),\"\")","v":""},{"$f":"IFERROR(INDEX(Empresas!$B$6:$AS$46,SMALL(IF(Empresas!$B$6:$B$46=Dados!$H$37,ROW(Empresas!$B$6:$B$46)-5),ROW($A41)),COLUMN(AH$1)),\"\")","v":""},{"$f":"IFERROR(INDEX(Empresas!$B$6:$AS$46,SMALL(IF(Empresas!$B$6:$B$46=Dados!$H$37,ROW(Empresas!$B$6:$B$46)-5),ROW($A41)),COLUMN(AI$1)),\"\")","v":""},{"$f":"IFERROR(INDEX(Empresas!$B$6:$AS$46,SMALL(IF(Empresas!$B$6:$B$46=Dados!$H$37,ROW(Empresas!$B$6:$B$46)-5),ROW($A41)),COLUMN(AJ$1)),\"\")","v":""},{"$f":"IFERROR(INDEX(Empresas!$B$6:$AS$46,SMALL(IF(Empresas!$B$6:$B$46=Dados!$H$37,ROW(Empresas!$B$6:$B$46)-5),ROW($A41)),COLUMN(AK$1)),\"\")","v":""},{"$f":"IFERROR(INDEX(Empresas!$B$6:$AS$46,SMALL(IF(Empresas!$B$6:$B$46=Dados!$H$37,ROW(Empresas!$B$6:$B$46)-5),ROW($A41)),COLUMN(AL$1)),\"\")","v":""},{"$f":"IFERROR(INDEX(Empresas!$B$6:$AS$46,SMALL(IF(Empresas!$B$6:$B$46=Dados!$H$37,ROW(Empresas!$B$6:$B$46)-5),ROW($A41)),COLUMN(AM$1)),\"\")","v":""},{"$f":"IFERROR(INDEX(Empresas!$B$6:$AS$46,SMALL(IF(Empresas!$B$6:$B$46=Dados!$H$37,ROW(Empresas!$B$6:$B$46)-5),ROW($A41)),COLUMN(AN$1)),\"\")","v":""},{"$f":"IFERROR(INDEX(Empresas!$B$6:$AS$46,SMALL(IF(Empresas!$B$6:$B$46=Dados!$H$37,ROW(Empresas!$B$6:$B$46)-5),ROW($A41)),COLUMN(AO$1)),\"\")","v":""},{"$f":"IFERROR(INDEX(Empresas!$B$6:$AS$46,SMALL(IF(Empresas!$B$6:$B$46=Dados!$H$37,ROW(Empresas!$B$6:$B$46)-5),ROW($A41)),COLUMN(AP$1)),\"\")","v":""},{"$f":"IFERROR(INDEX(Empresas!$B$6:$AS$46,SMALL(IF(Empresas!$B$6:$B$46=Dados!$H$37,ROW(Empresas!$B$6:$B$46)-5),ROW($A41)),COLUMN(AQ$1)),\"\")","v":""},{"$f":"IFERROR(INDEX(Empresas!$B$6:$AS$46,SMALL(IF(Empresas!$B$6:$B$46=Dados!$H$37,ROW(Empresas!$B$6:$B$46)-5),ROW($A41)),COLUMN(AR$1)),\"\")","v":""}]
[null,{"$f":"IFERROR(INDEX(Empresas!$B$6:$AS$46,SMALL(IF(Empresas!$B$6:$B$46=Dados!$H$37,ROW(Empresas!$B$6:$B$46)-5),ROW($A42)),COLUMN(B$1)),\"\")","v":""},{"$f":"IFERROR(INDEX(Empresas!$B$6:$AS$46,SMALL(IF(Empresas!$B$6:$B$46=Dados!$H$37,ROW(Empresas!$B$6:$B$46)-5),ROW($A42)),COLUMN(C$1)),\"\")","v":""},"",{"$f":"IFERROR(INDEX(Empresas!$B$6:$AS$46,SMALL(IF(Empresas!$B$6:$B$46=Dados!$H$37,ROW(Empresas!$B$6:$B$46)-5),ROW($A42)),COLUMN(F$1)),\"\")","v":""},{"$f":"IFERROR(INDEX(Empresas!$B$6:$AS$46,SMALL(IF(Empresas!$B$6:$B$46=Dados!$H$37,ROW(Empresas!$B$6:$B$46)-5),ROW($A42)),COLUMN(G$1)),\"\")","v":""},{"$f":"IFERROR(INDEX(Empresas!$B$6:$AS$46,SMALL(IF(Empresas!$B$6:$B$46=Dados!$H$37,ROW(Empresas!$B$6:$B$46)-5),ROW($A42)),COLUMN(H$1)),\"\")","v":""},{"$f":"IFERROR(INDEX(Empresas!$B$6:$AS$46,SMALL(IF(Empresas!$B$6:$B$46=Dados!$H$37,ROW(Empresas!$B$6:$B$46)-5),ROW($A42)),COLUMN(I$1)),\"\")","v":""},{"$f":"IFERROR(INDEX(Empresas!$B$6:$AS$46,SMALL(IF(Empresas!$B$6:$B$46=Dados!$H$37,ROW(Empresas!$B$6:$B$46)-5),ROW($A42)),COLUMN(J$1)),\"\")","v":""},{"$f":"IFERROR(INDEX(Empresas!$B$6:$AS$46,SMALL(IF(Empresas!$B$6:$B$46=Dados!$H$37,ROW(Empresas!$B$6:$B$46)-5),ROW($A42)),COLUMN(K$1)),\"\")","v":""},{"$f":"IFERROR(INDEX(Empresas!$B$6:$AS$46,SMALL(IF(Empresas!$B$6:$B$46=Dados!$H$37,ROW(Empresas!$B$6:$B$46)-5),ROW($A42)),COLUMN(L$1)),\"\")","v":""},{"$f":"IFERROR(INDEX(Empresas!$B$6:$AS$46,SMALL(IF(Empresas!$B$6:$B$46=Dados!$H$37,ROW(Empresas!$B$6:$B$46)-5),ROW($A42)),COLUMN(M$1)),\"\")","v":""},{"$f":"IFERROR(INDEX(Empresas!$B$6:$AS$46,SMALL(IF(Empresas!$B$6:$B$46=Dados!$H$37,ROW(Empresas!$B$6:$B$46)-5),ROW($A42)),COLUMN(N$1)),\"\")","v":""},{"$f":"IFERROR(INDEX(Empresas!$B$6:$AS$46,SMALL(IF(Empresas!$B$6:$B$46=Dados!$H$37,ROW(Empresas!$B$6:$B$46)-5),ROW($A42)),COLUMN(O$1)),\"\")","v":""},{"$f":"IFERROR(INDEX(Empresas!$B$6:$AS$46,SMALL(IF(Empresas!$B$6:$B$46=Dados!$H$37,ROW(Empresas!$B$6:$B$46)-5),ROW($A42)),COLUMN(P$1)),\"\")","v":""},{"$f":"IFERROR(INDEX(Empresas!$B$6:$AS$46,SMALL(IF(Empresas!$B$6:$B$46=Dados!$H$37,ROW(Empresas!$B$6:$B$46)-5),ROW($A42)),COLUMN(Q$1)),\"\")","v":""},{"$f":"IFERROR(INDEX(Empresas!$B$6:$AS$46,SMALL(IF(Empresas!$B$6:$B$46=Dados!$H$37,ROW(Empresas!$B$6:$B$46)-5),ROW($A42)),COLUMN(R$1)),\"\")","v":""},{"$f":"IFERROR(INDEX(Empresas!$B$6:$AS$46,SMALL(IF(Empresas!$B$6:$B$46=Dados!$H$37,ROW(Empresas!$B$6:$B$46)-5),ROW($A42)),COLUMN(S$1)),\"\")","v":""},{"$f":"IFERROR(INDEX(Empresas!$B$6:$AS$46,SMALL(IF(Empresas!$B$6:$B$46=Dados!$H$37,ROW(Empresas!$B$6:$B$46)-5),ROW($A42)),COLUMN(T$1)),\"\")","v":""},{"$f":"IFERROR(INDEX(Empresas!$B$6:$AS$46,SMALL(IF(Empresas!$B$6:$B$46=Dados!$H$37,ROW(Empresas!$B$6:$B$46)-5),ROW($A42)),COLUMN(U$1)),\"\")","v":""},{"$f":"IFERROR(INDEX(Empresas!$B$6:$AS$46,SMALL(IF(Empresas!$B$6:$B$46=Dados!$H$37,ROW(Empresas!$B$6:$B$46)-5),ROW($A42)),COLUMN(V$1)),\"\")","v":""},{"$f":"IFERROR(INDEX(Empresas!$B$6:$AS$46,SMALL(IF(Empresas!$B$6:$B$46=Dados!$H$37,ROW(Empresas!$B$6:$B$46)-5),ROW($A42)),COLUMN(W$1)),\"\")","v":""},{"$f":"IFERROR(INDEX(Empresas!$B$6:$AS$46,SMALL(IF(Empresas!$B$6:$B$46=Dados!$H$37,ROW(Empresas!$B$6:$B$46)-5),ROW($A42)),COLUMN(X$1)),\"\")","v":""},{"$f":"IFERROR(INDEX(Empresas!$B$6:$AS$46,SMALL(IF(Empresas!$B$6:$B$46=Dados!$H$37,ROW(Empresas!$B$6:$B$46)-5),ROW($A42)),COLUMN(Y$1)),\"\")","v":""},{"$f":"IFERROR(INDEX(Empresas!$B$6:$AS$46,SMALL(IF(Empresas!$B$6:$B$46=Dados!$H$37,ROW(Empresas!$B$6:$B$46)-5),ROW($A42)),COLUMN(Z$1)),\"\")","v":""},{"$f":"IFERROR(INDEX(Empresas!$B$6:$AS$46,SMALL(IF(Empresas!$B$6:$B$46=Dados!$H$37,ROW(Empresas!$B$6:$B$46)-5),ROW($A42)),COLUMN(AA$1)),\"\")","v":""},{"$f":"IFERROR(INDEX(Empresas!$B$6:$AS$46,SMALL(IF(Empresas!$B$6:$B$46=Dados!$H$37,ROW(Empresas!$B$6:$B$46)-5),ROW($A42)),COLUMN(AB$1)),\"\")","v":""},{"$f":"IFERROR(INDEX(Empresas!$B$6:$AS$46,SMALL(IF(Empresas!$B$6:$B$46=Dados!$H$37,ROW(Empresas!$B$6:$B$46)-5),ROW($A42)),COLUMN(AC$1)),\"\")","v":""},{"$f":"IFERROR(INDEX(Empresas!$B$6:$AS$46,SMALL(IF(Empresas!$B$6:$B$46=Dados!$H$37,ROW(Empresas!$B$6:$B$46)-5),ROW($A42)),COLUMN(AD$1)),\"\")","v":""},{"$f":"IFERROR(INDEX(Empresas!$B$6:$AS$46,SMALL(IF(Empresas!$B$6:$B$46=Dados!$H$37,ROW(Empresas!$B$6:$B$46)-5),ROW($A42)),COLUMN(AE$1)),\"\")","v":""},{"$f":"IFERROR(INDEX(Empresas!$B$6:$AS$46,SMALL(IF(Empresas!$B$6:$B$46=Dados!$H$37,ROW(Empresas!$B$6:$B$46)-5),ROW($A42)),COLUMN(AF$1)),\"\")","v":""},{"$f":"IFERROR(INDEX(Empresas!$B$6:$AS$46,SMALL(IF(Empresas!$B$6:$B$46=Dados!$H$37,ROW(Empresas!$B$6:$B$46)-5),ROW($A42)),COLUMN(AG$1)),\"\")","v":""},{"$f":"IFERROR(INDEX(Empresas!$B$6:$AS$46,SMALL(IF(Empresas!$B$6:$B$46=Dados!$H$37,ROW(Empresas!$B$6:$B$46)-5),ROW($A42)),COLUMN(AH$1)),\"\")","v":""},{"$f":"IFERROR(INDEX(Empresas!$B$6:$AS$46,SMALL(IF(Empresas!$B$6:$B$46=Dados!$H$37,ROW(Empresas!$B$6:$B$46)-5),ROW($A42)),COLUMN(AI$1)),\"\")","v":""},{"$f":"IFERROR(INDEX(Empresas!$B$6:$AS$46,SMALL(IF(Empresas!$B$6:$B$46=Dados!$H$37,ROW(Empresas!$B$6:$B$46)-5),ROW($A42)),COLUMN(AJ$1)),\"\")","v":""},{"$f":"IFERROR(INDEX(Empresas!$B$6:$AS$46,SMALL(IF(Empresas!$B$6:$B$46=Dados!$H$37,ROW(Empresas!$B$6:$B$46)-5),ROW($A42)),COLUMN(AK$1)),\"\")","v":""},{"$f":"IFERROR(INDEX(Empresas!$B$6:$AS$46,SMALL(IF(Empresas!$B$6:$B$46=Dados!$H$37,ROW(Empresas!$B$6:$B$46)-5),ROW($A42)),COLUMN(AL$1)),\"\")","v":""},{"$f":"IFERROR(INDEX(Empresas!$B$6:$AS$46,SMALL(IF(Empresas!$B$6:$B$46=Dados!$H$37,ROW(Empresas!$B$6:$B$46)-5),ROW($A42)),COLUMN(AM$1)),\"\")","v":""},{"$f":"IFERROR(INDEX(Empresas!$B$6:$AS$46,SMALL(IF(Empresas!$B$6:$B$46=Dados!$H$37,ROW(Empresas!$B$6:$B$46)-5),ROW($A42)),COLUMN(AN$1)),\"\")","v":""},{"$f":"IFERROR(INDEX(Empresas!$B$6:$AS$46,SMALL(IF(Empresas!$B$6:$B$46=Dados!$H$37,ROW(Empresas!$B$6:$B$46)-5),ROW($A42)),COLUMN(AO$1)),\"\")","v":""},{"$f":"IFERROR(INDEX(Empresas!$B$6:$AS$46,SMALL(IF(Empresas!$B$6:$B$46=Dados!$H$37,ROW(Empresas!$B$6:$B$46)-5),ROW($A42)),COLUMN(AP$1)),\"\")","v":""},{"$f":"IFERROR(INDEX(Empresas!$B$6:$AS$46,SMALL(IF(Empresas!$B$6:$B$46=Dados!$H$37,ROW(Empresas!$B$6:$B$46)-5),ROW($A42)),COLUMN(AQ$1)),\"\")","v":""},{"$f":"IFERROR(INDEX(Empresas!$B$6:$AS$46,SMALL(IF(Empresas!$B$6:$B$46=Dados!$H$37,ROW(Empresas!$B$6:$B$46)-5),ROW($A42)),COLUMN(AR$1)),\"\")","v":""}]
[null,{"$f":"IFERROR(INDEX(Empresas!$B$6:$AS$46,SMALL(IF(Empresas!$B$6:$B$46=Dados!$H$37,ROW(Empresas!$B$6:$B$46)-5),ROW($A43)),COLUMN(B$1)),\"\")","v":""},{"$f":"IFERROR(INDEX(Empresas!$B$6:$AS$46,SMALL(IF(Empresas!$B$6:$B$46=Dados!$H$37,ROW(Empresas!$B$6:$B$46)-5),ROW($A43)),COLUMN(C$1)),\"\")","v":""},"",{"$f":"IFERROR(INDEX(Empresas!$B$6:$AS$46,SMALL(IF(Empresas!$B$6:$B$46=Dados!$H$37,ROW(Empresas!$B$6:$B$46)-5),ROW($A43)),COLUMN(F$1)),\"\")","v":""},{"$f":"IFERROR(INDEX(Empresas!$B$6:$AS$46,SMALL(IF(Empresas!$B$6:$B$46=Dados!$H$37,ROW(Empresas!$B$6:$B$46)-5),ROW($A43)),COLUMN(G$1)),\"\")","v":""},{"$f":"IFERROR(INDEX(Empresas!$B$6:$AS$46,SMALL(IF(Empresas!$B$6:$B$46=Dados!$H$37,ROW(Empresas!$B$6:$B$46)-5),ROW($A43)),COLUMN(H$1)),\"\")","v":""},{"$f":"IFERROR(INDEX(Empresas!$B$6:$AS$46,SMALL(IF(Empresas!$B$6:$B$46=Dados!$H$37,ROW(Empresas!$B$6:$B$46)-5),ROW($A43)),COLUMN(I$1)),\"\")","v":""},{"$f":"IFERROR(INDEX(Empresas!$B$6:$AS$46,SMALL(IF(Empresas!$B$6:$B$46=Dados!$H$37,ROW(Empresas!$B$6:$B$46)-5),ROW($A43)),COLUMN(J$1)),\"\")","v":""},{"$f":"IFERROR(INDEX(Empresas!$B$6:$AS$46,SMALL(IF(Empresas!$B$6:$B$46=Dados!$H$37,ROW(Empresas!$B$6:$B$46)-5),ROW($A43)),COLUMN(K$1)),\"\")","v":""},{"$f":"IFERROR(INDEX(Empresas!$B$6:$AS$46,SMALL(IF(Empresas!$B$6:$B$46=Dados!$H$37,ROW(Empresas!$B$6:$B$46)-5),ROW($A43)),COLUMN(L$1)),\"\")","v":""},{"$f":"IFERROR(INDEX(Empresas!$B$6:$AS$46,SMALL(IF(Empresas!$B$6:$B$46=Dados!$H$37,ROW(Empresas!$B$6:$B$46)-5),ROW($A43)),COLUMN(M$1)),\"\")","v":""},{"$f":"IFERROR(INDEX(Empresas!$B$6:$AS$46,SMALL(IF(Empresas!$B$6:$B$46=Dados!$H$37,ROW(Empresas!$B$6:$B$46)-5),ROW($A43)),COLUMN(N$1)),\"\")","v":""},{"$f":"IFERROR(INDEX(Empresas!$B$6:$AS$46,SMALL(IF(Empresas!$B$6:$B$46=Dados!$H$37,ROW(Empresas!$B$6:$B$46)-5),ROW($A43)),COLUMN(O$1)),\"\")","v":""},{"$f":"IFERROR(INDEX(Empresas!$B$6:$AS$46,SMALL(IF(Empresas!$B$6:$B$46=Dados!$H$37,ROW(Empresas!$B$6:$B$46)-5),ROW($A43)),COLUMN(P$1)),\"\")","v":""},{"$f":"IFERROR(INDEX(Empresas!$B$6:$AS$46,SMALL(IF(Empresas!$B$6:$B$46=Dados!$H$37,ROW(Empresas!$B$6:$B$46)-5),ROW($A43)),COLUMN(Q$1)),\"\")","v":""},{"$f":"IFERROR(INDEX(Empresas!$B$6:$AS$46,SMALL(IF(Empresas!$B$6:$B$46=Dados!$H$37,ROW(Empresas!$B$6:$B$46)-5),ROW($A43)),COLUMN(R$1)),\"\")","v":""},{"$f":"IFERROR(INDEX(Empresas!$B$6:$AS$46,SMALL(IF(Empresas!$B$6:$B$46=Dados!$H$37,ROW(Empresas!$B$6:$B$46)-5),ROW($A43)),COLUMN(S$1)),\"\")","v":""},{"$f":"IFERROR(INDEX(Empresas!$B$6:$AS$46,SMALL(IF(Empresas!$B$6:$B$46=Dados!$H$37,ROW(Empresas!$B$6:$B$46)-5),ROW($A43)),COLUMN(T$1)),\"\")","v":""},{"$f":"IFERROR(INDEX(Empresas!$B$6:$AS$46,SMALL(IF(Empresas!$B$6:$B$46=Dados!$H$37,ROW(Empresas!$B$6:$B$46)-5),ROW($A43)),COLUMN(U$1)),\"\")","v":""},{"$f":"IFERROR(INDEX(Empresas!$B$6:$AS$46,SMALL(IF(Empresas!$B$6:$B$46=Dados!$H$37,ROW(Empresas!$B$6:$B$46)-5),ROW($A43)),COLUMN(V$1)),\"\")","v":""},{"$f":"IFERROR(INDEX(Empresas!$B$6:$AS$46,SMALL(IF(Empresas!$B$6:$B$46=Dados!$H$37,ROW(Empresas!$B$6:$B$46)-5),ROW($A43)),COLUMN(W$1)),\"\")","v":""},{"$f":"IFERROR(INDEX(Empresas!$B$6:$AS$46,SMALL(IF(Empresas!$B$6:$B$46=Dados!$H$37,ROW(Empresas!$B$6:$B$46)-5),ROW($A43)),COLUMN(X$1)),\"\")","v":""},{"$f":"IFERROR(INDEX(Empresas!$B$6:$AS$46,SMALL(IF(Empresas!$B$6:$B$46=Dados!$H$37,ROW(Empresas!$B$6:$B$46)-5),ROW($A43)),COLUMN(Y$1)),\"\")","v":""},{"$f":"IFERROR(INDEX(Empresas!$B$6:$AS$46,SMALL(IF(Empresas!$B$6:$B$46=Dados!$H$37,ROW(Empresas!$B$6:$B$46)-5),ROW($A43)),COLUMN(Z$1)),\"\")","v":""},{"$f":"IFERROR(INDEX(Empresas!$B$6:$AS$46,SMALL(IF(Empresas!$B$6:$B$46=Dados!$H$37,ROW(Empresas!$B$6:$B$46)-5),ROW($A43)),COLUMN(AA$1)),\"\")","v":""},{"$f":"IFERROR(INDEX(Empresas!$B$6:$AS$46,SMALL(IF(Empresas!$B$6:$B$46=Dados!$H$37,ROW(Empresas!$B$6:$B$46)-5),ROW($A43)),COLUMN(AB$1)),\"\")","v":""},{"$f":"IFERROR(INDEX(Empresas!$B$6:$AS$46,SMALL(IF(Empresas!$B$6:$B$46=Dados!$H$37,ROW(Empresas!$B$6:$B$46)-5),ROW($A43)),COLUMN(AC$1)),\"\")","v":""},{"$f":"IFERROR(INDEX(Empresas!$B$6:$AS$46,SMALL(IF(Empresas!$B$6:$B$46=Dados!$H$37,ROW(Empresas!$B$6:$B$46)-5),ROW($A43)),COLUMN(AD$1)),\"\")","v":""},{"$f":"IFERROR(INDEX(Empresas!$B$6:$AS$46,SMALL(IF(Empresas!$B$6:$B$46=Dados!$H$37,ROW(Empresas!$B$6:$B$46)-5),ROW($A43)),COLUMN(AE$1)),\"\")","v":""},{"$f":"IFERROR(INDEX(Empresas!$B$6:$AS$46,SMALL(IF(Empresas!$B$6:$B$46=Dados!$H$37,ROW(Empresas!$B$6:$B$46)-5),ROW($A43)),COLUMN(AF$1)),\"\")","v":""},{"$f":"IFERROR(INDEX(Empresas!$B$6:$AS$46,SMALL(IF(Empresas!$B$6:$B$46=Dados!$H$37,ROW(Empresas!$B$6:$B$46)-5),ROW($A43)),COLUMN(AG$1)),\"\")","v":""},{"$f":"IFERROR(INDEX(Empresas!$B$6:$AS$46,SMALL(IF(Empresas!$B$6:$B$46=Dados!$H$37,ROW(Empresas!$B$6:$B$46)-5),ROW($A43)),COLUMN(AH$1)),\"\")","v":""},{"$f":"IFERROR(INDEX(Empresas!$B$6:$AS$46,SMALL(IF(Empresas!$B$6:$B$46=Dados!$H$37,ROW(Empresas!$B$6:$B$46)-5),ROW($A43)),COLUMN(AI$1)),\"\")","v":""},{"$f":"IFERROR(INDEX(Empresas!$B$6:$AS$46,SMALL(IF(Empresas!$B$6:$B$46=Dados!$H$37,ROW(Empresas!$B$6:$B$46)-5),ROW($A43)),COLUMN(AJ$1)),\"\")","v":""},{"$f":"IFERROR(INDEX(Empresas!$B$6:$AS$46,SMALL(IF(Empresas!$B$6:$B$46=Dados!$H$37,ROW(Empresas!$B$6:$B$46)-5),ROW($A43)),COLUMN(AK$1)),\"\")","v":""},{"$f":"IFERROR(INDEX(Empresas!$B$6:$AS$46,SMALL(IF(Empresas!$B$6:$B$46=Dados!$H$37,ROW(Empresas!$B$6:$B$46)-5),ROW($A43)),COLUMN(AL$1)),\"\")","v":""},{"$f":"IFERROR(INDEX(Empresas!$B$6:$AS$46,SMALL(IF(Empresas!$B$6:$B$46=Dados!$H$37,ROW(Empresas!$B$6:$B$46)-5),ROW($A43)),COLUMN(AM$1)),\"\")","v":""},{"$f":"IFERROR(INDEX(Empresas!$B$6:$AS$46,SMALL(IF(Empresas!$B$6:$B$46=Dados!$H$37,ROW(Empresas!$B$6:$B$46)-5),ROW($A43)),COLUMN(AN$1)),\"\")","v":""},{"$f":"IFERROR(INDEX(Empresas!$B$6:$AS$46,SMALL(IF(Empresas!$B$6:$B$46=Dados!$H$37,ROW(Empresas!$B$6:$B$46)-5),ROW($A43)),COLUMN(AO$1)),\"\")","v":""},{"$f":"IFERROR(INDEX(Empresas!$B$6:$AS$46,SMALL(IF(Empresas!$B$6:$B$46=Dados!$H$37,ROW(Empresas!$B$6:$B$46)-5),ROW($A43)),COLUMN(AP$1)),\"\")","v":""},{"$f":"IFERROR(INDEX(Empresas!$B$6:$AS$46,SMALL(IF(Empresas!$B$6:$B$46=Dados!$H$37,ROW(Empresas!$B$6:$B$46)-5),ROW($A43)),COLUMN(AQ$1)),\"\")","v":""},{"$f":"IFERROR(INDEX(Empresas!$B$6:$AS$46,SMALL(IF(Empresas!$B$6:$B$46=Dados!$H$37,ROW(Empresas!$B$6:$B$46)-5),ROW($A43)),COLUMN(AR$1)),\"\")","v":""}]
[null,{"$f":"IFERROR(INDEX(Empresas!$B$6:$AS$46,SMALL(IF(Empresas!$B$6:$B$46=Dados!$H$37,ROW(Empresas!$B$6:$B$46)-5),ROW($A44)),COLUMN(B$1)),\"\")","v":""},{"$f":"IFERROR(INDEX(Empresas!$B$6:$AS$46,SMALL(IF(Empresas!$B$6:$B$46=Dados!$H$37,ROW(Empresas!$B$6:$B$46)-5),ROW($A44)),COLUMN(C$1)),\"\")","v":""},"",{"$f":"IFERROR(INDEX(Empresas!$B$6:$AS$46,SMALL(IF(Empresas!$B$6:$B$46=Dados!$H$37,ROW(Empresas!$B$6:$B$46)-5),ROW($A44)),COLUMN(F$1)),\"\")","v":""},{"$f":"IFERROR(INDEX(Empresas!$B$6:$AS$46,SMALL(IF(Empresas!$B$6:$B$46=Dados!$H$37,ROW(Empresas!$B$6:$B$46)-5),ROW($A44)),COLUMN(G$1)),\"\")","v":""},{"$f":"IFERROR(INDEX(Empresas!$B$6:$AS$46,SMALL(IF(Empresas!$B$6:$B$46=Dados!$H$37,ROW(Empresas!$B$6:$B$46)-5),ROW($A44)),COLUMN(H$1)),\"\")","v":""},{"$f":"IFERROR(INDEX(Empresas!$B$6:$AS$46,SMALL(IF(Empresas!$B$6:$B$46=Dados!$H$37,ROW(Empresas!$B$6:$B$46)-5),ROW($A44)),COLUMN(I$1)),\"\")","v":""},{"$f":"IFERROR(INDEX(Empresas!$B$6:$AS$46,SMALL(IF(Empresas!$B$6:$B$46=Dados!$H$37,ROW(Empresas!$B$6:$B$46)-5),ROW($A44)),COLUMN(J$1)),\"\")","v":""},{"$f":"IFERROR(INDEX(Empresas!$B$6:$AS$46,SMALL(IF(Empresas!$B$6:$B$46=Dados!$H$37,ROW(Empresas!$B$6:$B$46)-5),ROW($A44)),COLUMN(K$1)),\"\")","v":""},{"$f":"IFERROR(INDEX(Empresas!$B$6:$AS$46,SMALL(IF(Empresas!$B$6:$B$46=Dados!$H$37,ROW(Empresas!$B$6:$B$46)-5),ROW($A44)),COLUMN(L$1)),\"\")","v":""},{"$f":"IFERROR(INDEX(Empresas!$B$6:$AS$46,SMALL(IF(Empresas!$B$6:$B$46=Dados!$H$37,ROW(Empresas!$B$6:$B$46)-5),ROW($A44)),COLUMN(M$1)),\"\")","v":""},{"$f":"IFERROR(INDEX(Empresas!$B$6:$AS$46,SMALL(IF(Empresas!$B$6:$B$46=Dados!$H$37,ROW(Empresas!$B$6:$B$46)-5),ROW($A44)),COLUMN(N$1)),\"\")","v":""},{"$f":"IFERROR(INDEX(Empresas!$B$6:$AS$46,SMALL(IF(Empresas!$B$6:$B$46=Dados!$H$37,ROW(Empresas!$B$6:$B$46)-5),ROW($A44)),COLUMN(O$1)),\"\")","v":""},{"$f":"IFERROR(INDEX(Empresas!$B$6:$AS$46,SMALL(IF(Empresas!$B$6:$B$46=Dados!$H$37,ROW(Empresas!$B$6:$B$46)-5),ROW($A44)),COLUMN(P$1)),\"\")","v":""},{"$f":"IFERROR(INDEX(Empresas!$B$6:$AS$46,SMALL(IF(Empresas!$B$6:$B$46=Dados!$H$37,ROW(Empresas!$B$6:$B$46)-5),ROW($A44)),COLUMN(Q$1)),\"\")","v":""},{"$f":"IFERROR(INDEX(Empresas!$B$6:$AS$46,SMALL(IF(Empresas!$B$6:$B$46=Dados!$H$37,ROW(Empresas!$B$6:$B$46)-5),ROW($A44)),COLUMN(R$1)),\"\")","v":""},{"$f":"IFERROR(INDEX(Empresas!$B$6:$AS$46,SMALL(IF(Empresas!$B$6:$B$46=Dados!$H$37,ROW(Empresas!$B$6:$B$46)-5),ROW($A44)),COLUMN(S$1)),\"\")","v":""},{"$f":"IFERROR(INDEX(Empresas!$B$6:$AS$46,SMALL(IF(Empresas!$B$6:$B$46=Dados!$H$37,ROW(Empresas!$B$6:$B$46)-5),ROW($A44)),COLUMN(T$1)),\"\")","v":""},{"$f":"IFERROR(INDEX(Empresas!$B$6:$AS$46,SMALL(IF(Empresas!$B$6:$B$46=Dados!$H$37,ROW(Empresas!$B$6:$B$46)-5),ROW($A44)),COLUMN(U$1)),\"\")","v":""},{"$f":"IFERROR(INDEX(Empresas!$B$6:$AS$46,SMALL(IF(Empresas!$B$6:$B$46=Dados!$H$37,ROW(Empresas!$B$6:$B$46)-5),ROW($A44)),COLUMN(V$1)),\"\")","v":""},{"$f":"IFERROR(INDEX(Empresas!$B$6:$AS$46,SMALL(IF(Empresas!$B$6:$B$46=Dados!$H$37,ROW(Empresas!$B$6:$B$46)-5),ROW($A44)),COLUMN(W$1)),\"\")","v":""},{"$f":"IFERROR(INDEX(Empresas!$B$6:$AS$46,SMALL(IF(Empresas!$B$6:$B$46=Dados!$H$37,ROW(Empresas!$B$6:$B$46)-5),ROW($A44)),COLUMN(X$1)),\"\")","v":""},{"$f":"IFERROR(INDEX(Empresas!$B$6:$AS$46,SMALL(IF(Empresas!$B$6:$B$46=Dados!$H$37,ROW(Empresas!$B$6:$B$46)-5),ROW($A44)),COLUMN(Y$1)),\"\")","v":""},{"$f":"IFERROR(INDEX(Empresas!$B$6:$AS$46,SMALL(IF(Empresas!$B$6:$B$46=Dados!$H$37,ROW(Empresas!$B$6:$B$46)-5),ROW($A44)),COLUMN(Z$1)),\"\")","v":""},{"$f":"IFERROR(INDEX(Empresas!$B$6:$AS$46,SMALL(IF(Empresas!$B$6:$B$46=Dados!$H$37,ROW(Empresas!$B$6:$B$46)-5),ROW($A44)),COLUMN(AA$1)),\"\")","v":""},{"$f":"IFERROR(INDEX(Empresas!$B$6:$AS$46,SMALL(IF(Empresas!$B$6:$B$46=Dados!$H$37,ROW(Empresas!$B$6:$B$46)-5),ROW($A44)),COLUMN(AB$1)),\"\")","v":""},{"$f":"IFERROR(INDEX(Empresas!$B$6:$AS$46,SMALL(IF(Empresas!$B$6:$B$46=Dados!$H$37,ROW(Empresas!$B$6:$B$46)-5),ROW($A44)),COLUMN(AC$1)),\"\")","v":""},{"$f":"IFERROR(INDEX(Empresas!$B$6:$AS$46,SMALL(IF(Empresas!$B$6:$B$46=Dados!$H$37,ROW(Empresas!$B$6:$B$46)-5),ROW($A44)),COLUMN(AD$1)),\"\")","v":""},{"$f":"IFERROR(INDEX(Empresas!$B$6:$AS$46,SMALL(IF(Empresas!$B$6:$B$46=Dados!$H$37,ROW(Empresas!$B$6:$B$46)-5),ROW($A44)),COLUMN(AE$1)),\"\")","v":""},{"$f":"IFERROR(INDEX(Empresas!$B$6:$AS$46,SMALL(IF(Empresas!$B$6:$B$46=Dados!$H$37,ROW(Empresas!$B$6:$B$46)-5),ROW($A44)),COLUMN(AF$1)),\"\")","v":""},{"$f":"IFERROR(INDEX(Empresas!$B$6:$AS$46,SMALL(IF(Empresas!$B$6:$B$46=Dados!$H$37,ROW(Empresas!$B$6:$B$46)-5),ROW($A44)),COLUMN(AG$1)),\"\")","v":""},{"$f":"IFERROR(INDEX(Empresas!$B$6:$AS$46,SMALL(IF(Empresas!$B$6:$B$46=Dados!$H$37,ROW(Empresas!$B$6:$B$46)-5),ROW($A44)),COLUMN(AH$1)),\"\")","v":""},{"$f":"IFERROR(INDEX(Empresas!$B$6:$AS$46,SMALL(IF(Empresas!$B$6:$B$46=Dados!$H$37,ROW(Empresas!$B$6:$B$46)-5),ROW($A44)),COLUMN(AI$1)),\"\")","v":""},{"$f":"IFERROR(INDEX(Empresas!$B$6:$AS$46,SMALL(IF(Empresas!$B$6:$B$46=Dados!$H$37,ROW(Empresas!$B$6:$B$46)-5),ROW($A44)),COLUMN(AJ$1)),\"\")","v":""},{"$f":"IFERROR(INDEX(Empresas!$B$6:$AS$46,SMALL(IF(Empresas!$B$6:$B$46=Dados!$H$37,ROW(Empresas!$B$6:$B$46)-5),ROW($A44)),COLUMN(AK$1)),\"\")","v":""},{"$f":"IFERROR(INDEX(Empresas!$B$6:$AS$46,SMALL(IF(Empresas!$B$6:$B$46=Dados!$H$37,ROW(Empresas!$B$6:$B$46)-5),ROW($A44)),COLUMN(AL$1)),\"\")","v":""},{"$f":"IFERROR(INDEX(Empresas!$B$6:$AS$46,SMALL(IF(Empresas!$B$6:$B$46=Dados!$H$37,ROW(Empresas!$B$6:$B$46)-5),ROW($A44)),COLUMN(AM$1)),\"\")","v":""},{"$f":"IFERROR(INDEX(Empresas!$B$6:$AS$46,SMALL(IF(Empresas!$B$6:$B$46=Dados!$H$37,ROW(Empresas!$B$6:$B$46)-5),ROW($A44)),COLUMN(AN$1)),\"\")","v":""},{"$f":"IFERROR(INDEX(Empresas!$B$6:$AS$46,SMALL(IF(Empresas!$B$6:$B$46=Dados!$H$37,ROW(Empresas!$B$6:$B$46)-5),ROW($A44)),COLUMN(AO$1)),\"\")","v":""},{"$f":"IFERROR(INDEX(Empresas!$B$6:$AS$46,SMALL(IF(Empresas!$B$6:$B$46=Dados!$H$37,ROW(Empresas!$B$6:$B$46)-5),ROW($A44)),COLUMN(AP$1)),\"\")","v":""},{"$f":"IFERROR(INDEX(Empresas!$B$6:$AS$46,SMALL(IF(Empresas!$B$6:$B$46=Dados!$H$37,ROW(Empresas!$B$6:$B$46)-5),ROW($A44)),COLUMN(AQ$1)),\"\")","v":""},{"$f":"IFERROR(INDEX(Empresas!$B$6:$AS$46,SMALL(IF(Empresas!$B$6:$B$46=Dados!$H$37,ROW(Empresas!$B$6:$B$46)-5),ROW($A44)),COLUMN(AR$1)),\"\")","v":""}]
[null,{"$f":"IFERROR(INDEX(Empresas!$B$6:$AS$46,SMALL(IF(Empresas!$B$6:$B$46=Dados!$H$37,ROW(Empresas!$B$6:$B$46)-5),ROW($A45)),COLUMN(B$1)),\"\")","v":""},{"$f":"IFERROR(INDEX(Empresas!$B$6:$AS$46,SMALL(IF(Empresas!$B$6:$B$46=Dados!$H$37,ROW(Empresas!$B$6:$B$46)-5),ROW($A45)),COLUMN(C$1)),\"\")","v":""},"",{"$f":"IFERROR(INDEX(Empresas!$B$6:$AS$46,SMALL(IF(Empresas!$B$6:$B$46=Dados!$H$37,ROW(Empresas!$B$6:$B$46)-5),ROW($A45)),COLUMN(F$1)),\"\")","v":""},{"$f":"IFERROR(INDEX(Empresas!$B$6:$AS$46,SMALL(IF(Empresas!$B$6:$B$46=Dados!$H$37,ROW(Empresas!$B$6:$B$46)-5),ROW($A45)),COLUMN(G$1)),\"\")","v":""},{"$f":"IFERROR(INDEX(Empresas!$B$6:$AS$46,SMALL(IF(Empresas!$B$6:$B$46=Dados!$H$37,ROW(Empresas!$B$6:$B$46)-5),ROW($A45)),COLUMN(H$1)),\"\")","v":""},{"$f":"IFERROR(INDEX(Empresas!$B$6:$AS$46,SMALL(IF(Empresas!$B$6:$B$46=Dados!$H$37,ROW(Empresas!$B$6:$B$46)-5),ROW($A45)),COLUMN(I$1)),\"\")","v":""},{"$f":"IFERROR(INDEX(Empresas!$B$6:$AS$46,SMALL(IF(Empresas!$B$6:$B$46=Dados!$H$37,ROW(Empresas!$B$6:$B$46)-5),ROW($A45)),COLUMN(J$1)),\"\")","v":""},{"$f":"IFERROR(INDEX(Empresas!$B$6:$AS$46,SMALL(IF(Empresas!$B$6:$B$46=Dados!$H$37,ROW(Empresas!$B$6:$B$46)-5),ROW($A45)),COLUMN(K$1)),\"\")","v":""},{"$f":"IFERROR(INDEX(Empresas!$B$6:$AS$46,SMALL(IF(Empresas!$B$6:$B$46=Dados!$H$37,ROW(Empresas!$B$6:$B$46)-5),ROW($A45)),COLUMN(L$1)),\"\")","v":""},{"$f":"IFERROR(INDEX(Empresas!$B$6:$AS$46,SMALL(IF(Empresas!$B$6:$B$46=Dados!$H$37,ROW(Empresas!$B$6:$B$46)-5),ROW($A45)),COLUMN(M$1)),\"\")","v":""},{"$f":"IFERROR(INDEX(Empresas!$B$6:$AS$46,SMALL(IF(Empresas!$B$6:$B$46=Dados!$H$37,ROW(Empresas!$B$6:$B$46)-5),ROW($A45)),COLUMN(N$1)),\"\")","v":""},{"$f":"IFERROR(INDEX(Empresas!$B$6:$AS$46,SMALL(IF(Empresas!$B$6:$B$46=Dados!$H$37,ROW(Empresas!$B$6:$B$46)-5),ROW($A45)),COLUMN(O$1)),\"\")","v":""},{"$f":"IFERROR(INDEX(Empresas!$B$6:$AS$46,SMALL(IF(Empresas!$B$6:$B$46=Dados!$H$37,ROW(Empresas!$B$6:$B$46)-5),ROW($A45)),COLUMN(P$1)),\"\")","v":""},{"$f":"IFERROR(INDEX(Empresas!$B$6:$AS$46,SMALL(IF(Empresas!$B$6:$B$46=Dados!$H$37,ROW(Empresas!$B$6:$B$46)-5),ROW($A45)),COLUMN(Q$1)),\"\")","v":""},{"$f":"IFERROR(INDEX(Empresas!$B$6:$AS$46,SMALL(IF(Empresas!$B$6:$B$46=Dados!$H$37,ROW(Empresas!$B$6:$B$46)-5),ROW($A45)),COLUMN(R$1)),\"\")","v":""},{"$f":"IFERROR(INDEX(Empresas!$B$6:$AS$46,SMALL(IF(Empresas!$B$6:$B$46=Dados!$H$37,ROW(Empresas!$B$6:$B$46)-5),ROW($A45)),COLUMN(S$1)),\"\")","v":""},{"$f":"IFERROR(INDEX(Empresas!$B$6:$AS$46,SMALL(IF(Empresas!$B$6:$B$46=Dados!$H$37,ROW(Empresas!$B$6:$B$46)-5),ROW($A45)),COLUMN(T$1)),\"\")","v":""},{"$f":"IFERROR(INDEX(Empresas!$B$6:$AS$46,SMALL(IF(Empresas!$B$6:$B$46=Dados!$H$37,ROW(Empresas!$B$6:$B$46)-5),ROW($A45)),COLUMN(U$1)),\"\")","v":""},{"$f":"IFERROR(INDEX(Empresas!$B$6:$AS$46,SMALL(IF(Empresas!$B$6:$B$46=Dados!$H$37,ROW(Empresas!$B$6:$B$46)-5),ROW($A45)),COLUMN(V$1)),\"\")","v":""},{"$f":"IFERROR(INDEX(Empresas!$B$6:$AS$46,SMALL(IF(Empresas!$B$6:$B$46=Dados!$H$37,ROW(Empresas!$B$6:$B$46)-5),ROW($A45)),COLUMN(W$1)),\"\")","v":""},{"$f":"IFERROR(INDEX(Empresas!$B$6:$AS$46,SMALL(IF(Empresas!$B$6:$B$46=Dados!$H$37,ROW(Empresas!$B$6:$B$46)-5),ROW($A45)),COLUMN(X$1)),\"\")","v":""},{"$f":"IFERROR(INDEX(Empresas!$B$6:$AS$46,SMALL(IF(Empresas!$B$6:$B$46=Dados!$H$37,ROW(Empresas!$B$6:$B$46)-5),ROW($A45)),COLUMN(Y$1)),\"\")","v":""},{"$f":"IFERROR(INDEX(Empresas!$B$6:$AS$46,SMALL(IF(Empresas!$B$6:$B$46=Dados!$H$37,ROW(Empresas!$B$6:$B$46)-5),ROW($A45)),COLUMN(Z$1)),\"\")","v":""},{"$f":"IFERROR(INDEX(Empresas!$B$6:$AS$46,SMALL(IF(Empresas!$B$6:$B$46=Dados!$H$37,ROW(Empresas!$B$6:$B$46)-5),ROW($A45)),COLUMN(AA$1)),\"\")","v":""},{"$f":"IFERROR(INDEX(Empresas!$B$6:$AS$46,SMALL(IF(Empresas!$B$6:$B$46=Dados!$H$37,ROW(Empresas!$B$6:$B$46)-5),ROW($A45)),COLUMN(AB$1)),\"\")","v":""},{"$f":"IFERROR(INDEX(Empresas!$B$6:$AS$46,SMALL(IF(Empresas!$B$6:$B$46=Dados!$H$37,ROW(Empresas!$B$6:$B$46)-5),ROW($A45)),COLUMN(AC$1)),\"\")","v":""},{"$f":"IFERROR(INDEX(Empresas!$B$6:$AS$46,SMALL(IF(Empresas!$B$6:$B$46=Dados!$H$37,ROW(Empresas!$B$6:$B$46)-5),ROW($A45)),COLUMN(AD$1)),\"\")","v":""},{"$f":"IFERROR(INDEX(Empresas!$B$6:$AS$46,SMALL(IF(Empresas!$B$6:$B$46=Dados!$H$37,ROW(Empresas!$B$6:$B$46)-5),ROW($A45)),COLUMN(AE$1)),\"\")","v":""},{"$f":"IFERROR(INDEX(Empresas!$B$6:$AS$46,SMALL(IF(Empresas!$B$6:$B$46=Dados!$H$37,ROW(Empresas!$B$6:$B$46)-5),ROW($A45)),COLUMN(AF$1)),\"\")","v":""},{"$f":"IFERROR(INDEX(Empresas!$B$6:$AS$46,SMALL(IF(Empresas!$B$6:$B$46=Dados!$H$37,ROW(Empresas!$B$6:$B$46)-5),ROW($A45)),COLUMN(AG$1)),\"\")","v":""},{"$f":"IFERROR(INDEX(Empresas!$B$6:$AS$46,SMALL(IF(Empresas!$B$6:$B$46=Dados!$H$37,ROW(Empresas!$B$6:$B$46)-5),ROW($A45)),COLUMN(AH$1)),\"\")","v":""},{"$f":"IFERROR(INDEX(Empresas!$B$6:$AS$46,SMALL(IF(Empresas!$B$6:$B$46=Dados!$H$37,ROW(Empresas!$B$6:$B$46)-5),ROW($A45)),COLUMN(AI$1)),\"\")","v":""},{"$f":"IFERROR(INDEX(Empresas!$B$6:$AS$46,SMALL(IF(Empresas!$B$6:$B$46=Dados!$H$37,ROW(Empresas!$B$6:$B$46)-5),ROW($A45)),COLUMN(AJ$1)),\"\")","v":""},{"$f":"IFERROR(INDEX(Empresas!$B$6:$AS$46,SMALL(IF(Empresas!$B$6:$B$46=Dados!$H$37,ROW(Empresas!$B$6:$B$46)-5),ROW($A45)),COLUMN(AK$1)),\"\")","v":""},{"$f":"IFERROR(INDEX(Empresas!$B$6:$AS$46,SMALL(IF(Empresas!$B$6:$B$46=Dados!$H$37,ROW(Empresas!$B$6:$B$46)-5),ROW($A45)),COLUMN(AL$1)),\"\")","v":""},{"$f":"IFERROR(INDEX(Empresas!$B$6:$AS$46,SMALL(IF(Empresas!$B$6:$B$46=Dados!$H$37,ROW(Empresas!$B$6:$B$46)-5),ROW($A45)),COLUMN(AM$1)),\"\")","v":""},{"$f":"IFERROR(INDEX(Empresas!$B$6:$AS$46,SMALL(IF(Empresas!$B$6:$B$46=Dados!$H$37,ROW(Empresas!$B$6:$B$46)-5),ROW($A45)),COLUMN(AN$1)),\"\")","v":""},{"$f":"IFERROR(INDEX(Empresas!$B$6:$AS$46,SMALL(IF(Empresas!$B$6:$B$46=Dados!$H$37,ROW(Empresas!$B$6:$B$46)-5),ROW($A45)),COLUMN(AO$1)),\"\")","v":""},{"$f":"IFERROR(INDEX(Empresas!$B$6:$AS$46,SMALL(IF(Empresas!$B$6:$B$46=Dados!$H$37,ROW(Empresas!$B$6:$B$46)-5),ROW($A45)),COLUMN(AP$1)),\"\")","v":""},{"$f":"IFERROR(INDEX(Empresas!$B$6:$AS$46,SMALL(IF(Empresas!$B$6:$B$46=Dados!$H$37,ROW(Empresas!$B$6:$B$46)-5),ROW($A45)),COLUMN(AQ$1)),\"\")","v":""},{"$f":"IFERROR(INDEX(Empresas!$B$6:$AS$46,SMALL(IF(Empresas!$B$6:$B$46=Dados!$H$37,ROW(Empresas!$B$6:$B$46)-5),ROW($A45)),COLUMN(AR$1)),\"\")","v":""}]
[null,{"$f":"IFERROR(INDEX(Empresas!$B$6:$AS$46,SMALL(IF(Empresas!$B$6:$B$46=Dados!$H$37,ROW(Empresas!$B$6:$B$46)-5),ROW($A46)),COLUMN(B$1)),\"\")","v":""},{"$f":"IFERROR(INDEX(Empresas!$B$6:$AS$46,SMALL(IF(Empresas!$B$6:$B$46=Dados!$H$37,ROW(Empresas!$B$6:$B$46)-5),ROW($A46)),COLUMN(C$1)),\"\")","v":""},"",{"$f":"IFERROR(INDEX(Empresas!$B$6:$AS$46,SMALL(IF(Empresas!$B$6:$B$46=Dados!$H$37,ROW(Empresas!$B$6:$B$46)-5),ROW($A46)),COLUMN(F$1)),\"\")","v":""},{"$f":"IFERROR(INDEX(Empresas!$B$6:$AS$46,SMALL(IF(Empresas!$B$6:$B$46=Dados!$H$37,ROW(Empresas!$B$6:$B$46)-5),ROW($A46)),COLUMN(G$1)),\"\")","v":""},{"$f":"IFERROR(INDEX(Empresas!$B$6:$AS$46,SMALL(IF(Empresas!$B$6:$B$46=Dados!$H$37,ROW(Empresas!$B$6:$B$46)-5),ROW($A46)),COLUMN(H$1)),\"\")","v":""},{"$f":"IFERROR(INDEX(Empresas!$B$6:$AS$46,SMALL(IF(Empresas!$B$6:$B$46=Dados!$H$37,ROW(Empresas!$B$6:$B$46)-5),ROW($A46)),COLUMN(I$1)),\"\")","v":""},{"$f":"IFERROR(INDEX(Empresas!$B$6:$AS$46,SMALL(IF(Empresas!$B$6:$B$46=Dados!$H$37,ROW(Empresas!$B$6:$B$46)-5),ROW($A46)),COLUMN(J$1)),\"\")","v":""},{"$f":"IFERROR(INDEX(Empresas!$B$6:$AS$46,SMALL(IF(Empresas!$B$6:$B$46=Dados!$H$37,ROW(Empresas!$B$6:$B$46)-5),ROW($A46)),COLUMN(K$1)),\"\")","v":""},{"$f":"IFERROR(INDEX(Empresas!$B$6:$AS$46,SMALL(IF(Empresas!$B$6:$B$46=Dados!$H$37,ROW(Empresas!$B$6:$B$46)-5),ROW($A46)),COLUMN(L$1)),\"\")","v":""},{"$f":"IFERROR(INDEX(Empresas!$B$6:$AS$46,SMALL(IF(Empresas!$B$6:$B$46=Dados!$H$37,ROW(Empresas!$B$6:$B$46)-5),ROW($A46)),COLUMN(M$1)),\"\")","v":""},{"$f":"IFERROR(INDEX(Empresas!$B$6:$AS$46,SMALL(IF(Empresas!$B$6:$B$46=Dados!$H$37,ROW(Empresas!$B$6:$B$46)-5),ROW($A46)),COLUMN(N$1)),\"\")","v":""},{"$f":"IFERROR(INDEX(Empresas!$B$6:$AS$46,SMALL(IF(Empresas!$B$6:$B$46=Dados!$H$37,ROW(Empresas!$B$6:$B$46)-5),ROW($A46)),COLUMN(O$1)),\"\")","v":""},{"$f":"IFERROR(INDEX(Empresas!$B$6:$AS$46,SMALL(IF(Empresas!$B$6:$B$46=Dados!$H$37,ROW(Empresas!$B$6:$B$46)-5),ROW($A46)),COLUMN(P$1)),\"\")","v":""},{"$f":"IFERROR(INDEX(Empresas!$B$6:$AS$46,SMALL(IF(Empresas!$B$6:$B$46=Dados!$H$37,ROW(Empresas!$B$6:$B$46)-5),ROW($A46)),COLUMN(Q$1)),\"\")","v":""},{"$f":"IFERROR(INDEX(Empresas!$B$6:$AS$46,SMALL(IF(Empresas!$B$6:$B$46=Dados!$H$37,ROW(Empresas!$B$6:$B$46)-5),ROW($A46)),COLUMN(R$1)),\"\")","v":""},{"$f":"IFERROR(INDEX(Empresas!$B$6:$AS$46,SMALL(IF(Empresas!$B$6:$B$46=Dados!$H$37,ROW(Empresas!$B$6:$B$46)-5),ROW($A46)),COLUMN(S$1)),\"\")","v":""},{"$f":"IFERROR(INDEX(Empresas!$B$6:$AS$46,SMALL(IF(Empresas!$B$6:$B$46=Dados!$H$37,ROW(Empresas!$B$6:$B$46)-5),ROW($A46)),COLUMN(T$1)),\"\")","v":""},{"$f":"IFERROR(INDEX(Empresas!$B$6:$AS$46,SMALL(IF(Empresas!$B$6:$B$46=Dados!$H$37,ROW(Empresas!$B$6:$B$46)-5),ROW($A46)),COLUMN(U$1)),\"\")","v":""},{"$f":"IFERROR(INDEX(Empresas!$B$6:$AS$46,SMALL(IF(Empresas!$B$6:$B$46=Dados!$H$37,ROW(Empresas!$B$6:$B$46)-5),ROW($A46)),COLUMN(V$1)),\"\")","v":""},{"$f":"IFERROR(INDEX(Empresas!$B$6:$AS$46,SMALL(IF(Empresas!$B$6:$B$46=Dados!$H$37,ROW(Empresas!$B$6:$B$46)-5),ROW($A46)),COLUMN(W$1)),\"\")","v":""},{"$f":"IFERROR(INDEX(Empresas!$B$6:$AS$46,SMALL(IF(Empresas!$B$6:$B$46=Dados!$H$37,ROW(Empresas!$B$6:$B$46)-5),ROW($A46)),COLUMN(X$1)),\"\")","v":""},{"$f":"IFERROR(INDEX(Empresas!$B$6:$AS$46,SMALL(IF(Empresas!$B$6:$B$46=Dados!$H$37,ROW(Empresas!$B$6:$B$46)-5),ROW($A46)),COLUMN(Y$1)),\"\")","v":""},{"$f":"IFERROR(INDEX(Empresas!$B$6:$AS$46,SMALL(IF(Empresas!$B$6:$B$46=Dados!$H$37,ROW(Empresas!$B$6:$B$46)-5),ROW($A46)),COLUMN(Z$1)),\"\")","v":""},{"$f":"IFERROR(INDEX(Empresas!$B$6:$AS$46,SMALL(IF(Empresas!$B$6:$B$46=Dados!$H$37,ROW(Empresas!$B$6:$B$46)-5),ROW($A46)),COLUMN(AA$1)),\"\")","v":""},{"$f":"IFERROR(INDEX(Empresas!$B$6:$AS$46,SMALL(IF(Empresas!$B$6:$B$46=Dados!$H$37,ROW(Empresas!$B$6:$B$46)-5),ROW($A46)),COLUMN(AB$1)),\"\")","v":""},{"$f":"IFERROR(INDEX(Empresas!$B$6:$AS$46,SMALL(IF(Empresas!$B$6:$B$46=Dados!$H$37,ROW(Empresas!$B$6:$B$46)-5),ROW($A46)),COLUMN(AC$1)),\"\")","v":""},{"$f":"IFERROR(INDEX(Empresas!$B$6:$AS$46,SMALL(IF(Empresas!$B$6:$B$46=Dados!$H$37,ROW(Empresas!$B$6:$B$46)-5),ROW($A46)),COLUMN(AD$1)),\"\")","v":""},{"$f":"IFERROR(INDEX(Empresas!$B$6:$AS$46,SMALL(IF(Empresas!$B$6:$B$46=Dados!$H$37,ROW(Empresas!$B$6:$B$46)-5),ROW($A46)),COLUMN(AE$1)),\"\")","v":""},{"$f":"IFERROR(INDEX(Empresas!$B$6:$AS$46,SMALL(IF(Empresas!$B$6:$B$46=Dados!$H$37,ROW(Empresas!$B$6:$B$46)-5),ROW($A46)),COLUMN(AF$1)),\"\")","v":""},{"$f":"IFERROR(INDEX(Empresas!$B$6:$AS$46,SMALL(IF(Empresas!$B$6:$B$46=Dados!$H$37,ROW(Empresas!$B$6:$B$46)-5),ROW($A46)),COLUMN(AG$1)),\"\")","v":""},{"$f":"IFERROR(INDEX(Empresas!$B$6:$AS$46,SMALL(IF(Empresas!$B$6:$B$46=Dados!$H$37,ROW(Empresas!$B$6:$B$46)-5),ROW($A46)),COLUMN(AH$1)),\"\")","v":""},{"$f":"IFERROR(INDEX(Empresas!$B$6:$AS$46,SMALL(IF(Empresas!$B$6:$B$46=Dados!$H$37,ROW(Empresas!$B$6:$B$46)-5),ROW($A46)),COLUMN(AI$1)),\"\")","v":""},{"$f":"IFERROR(INDEX(Empresas!$B$6:$AS$46,SMALL(IF(Empresas!$B$6:$B$46=Dados!$H$37,ROW(Empresas!$B$6:$B$46)-5),ROW($A46)),COLUMN(AJ$1)),\"\")","v":""},{"$f":"IFERROR(INDEX(Empresas!$B$6:$AS$46,SMALL(IF(Empresas!$B$6:$B$46=Dados!$H$37,ROW(Empresas!$B$6:$B$46)-5),ROW($A46)),COLUMN(AK$1)),\"\")","v":""},{"$f":"IFERROR(INDEX(Empresas!$B$6:$AS$46,SMALL(IF(Empresas!$B$6:$B$46=Dados!$H$37,ROW(Empresas!$B$6:$B$46)-5),ROW($A46)),COLUMN(AL$1)),\"\")","v":""},{"$f":"IFERROR(INDEX(Empresas!$B$6:$AS$46,SMALL(IF(Empresas!$B$6:$B$46=Dados!$H$37,ROW(Empresas!$B$6:$B$46)-5),ROW($A46)),COLUMN(AM$1)),\"\")","v":""},{"$f":"IFERROR(INDEX(Empresas!$B$6:$AS$46,SMALL(IF(Empresas!$B$6:$B$46=Dados!$H$37,ROW(Empresas!$B$6:$B$46)-5),ROW($A46)),COLUMN(AN$1)),\"\")","v":""},{"$f":"IFERROR(INDEX(Empresas!$B$6:$AS$46,SMALL(IF(Empresas!$B$6:$B$46=Dados!$H$37,ROW(Empresas!$B$6:$B$46)-5),ROW($A46)),COLUMN(AO$1)),\"\")","v":""},{"$f":"IFERROR(INDEX(Empresas!$B$6:$AS$46,SMALL(IF(Empresas!$B$6:$B$46=Dados!$H$37,ROW(Empresas!$B$6:$B$46)-5),ROW($A46)),COLUMN(AP$1)),\"\")","v":""},{"$f":"IFERROR(INDEX(Empresas!$B$6:$AS$46,SMALL(IF(Empresas!$B$6:$B$46=Dados!$H$37,ROW(Empresas!$B$6:$B$46)-5),ROW($A46)),COLUMN(AQ$1)),\"\")","v":""},{"$f":"IFERROR(INDEX(Empresas!$B$6:$AS$46,SMALL(IF(Empresas!$B$6:$B$46=Dados!$H$37,ROW(Empresas!$B$6:$B$46)-5),ROW($A46)),COLUMN(AR$1)),\"\")","v":""}]
[null,{"$f":"IFERROR(INDEX(Empresas!$B$6:$AS$46,SMALL(IF(Empresas!$B$6:$B$46=Dados!$H$37,ROW(Empresas!$B$6:$B$46)-5),ROW($A47)),COLUMN(B$1)),\"\")","v":""},{"$f":"IFERROR(INDEX(Empresas!$B$6:$AS$46,SMALL(IF(Empresas!$B$6:$B$46=Dados!$H$37,ROW(Empresas!$B$6:$B$46)-5),ROW($A47)),COLUMN(C$1)),\"\")","v":""},"",{"$f":"IFERROR(INDEX(Empresas!$B$6:$AS$46,SMALL(IF(Empresas!$B$6:$B$46=Dados!$H$37,ROW(Empresas!$B$6:$B$46)-5),ROW($A47)),COLUMN(F$1)),\"\")","v":""},{"$f":"IFERROR(INDEX(Empresas!$B$6:$AS$46,SMALL(IF(Empresas!$B$6:$B$46=Dados!$H$37,ROW(Empresas!$B$6:$B$46)-5),ROW($A47)),COLUMN(G$1)),\"\")","v":""},{"$f":"IFERROR(INDEX(Empresas!$B$6:$AS$46,SMALL(IF(Empresas!$B$6:$B$46=Dados!$H$37,ROW(Empresas!$B$6:$B$46)-5),ROW($A47)),COLUMN(H$1)),\"\")","v":""},{"$f":"IFERROR(INDEX(Empresas!$B$6:$AS$46,SMALL(IF(Empresas!$B$6:$B$46=Dados!$H$37,ROW(Empresas!$B$6:$B$46)-5),ROW($A47)),COLUMN(I$1)),\"\")","v":""},{"$f":"IFERROR(INDEX(Empresas!$B$6:$AS$46,SMALL(IF(Empresas!$B$6:$B$46=Dados!$H$37,ROW(Empresas!$B$6:$B$46)-5),ROW($A47)),COLUMN(J$1)),\"\")","v":""},{"$f":"IFERROR(INDEX(Empresas!$B$6:$AS$46,SMALL(IF(Empresas!$B$6:$B$46=Dados!$H$37,ROW(Empresas!$B$6:$B$46)-5),ROW($A47)),COLUMN(K$1)),\"\")","v":""},{"$f":"IFERROR(INDEX(Empresas!$B$6:$AS$46,SMALL(IF(Empresas!$B$6:$B$46=Dados!$H$37,ROW(Empresas!$B$6:$B$46)-5),ROW($A47)),COLUMN(L$1)),\"\")","v":""},{"$f":"IFERROR(INDEX(Empresas!$B$6:$AS$46,SMALL(IF(Empresas!$B$6:$B$46=Dados!$H$37,ROW(Empresas!$B$6:$B$46)-5),ROW($A47)),COLUMN(M$1)),\"\")","v":""},{"$f":"IFERROR(INDEX(Empresas!$B$6:$AS$46,SMALL(IF(Empresas!$B$6:$B$46=Dados!$H$37,ROW(Empresas!$B$6:$B$46)-5),ROW($A47)),COLUMN(N$1)),\"\")","v":""},{"$f":"IFERROR(INDEX(Empresas!$B$6:$AS$46,SMALL(IF(Empresas!$B$6:$B$46=Dados!$H$37,ROW(Empresas!$B$6:$B$46)-5),ROW($A47)),COLUMN(O$1)),\"\")","v":""},{"$f":"IFERROR(INDEX(Empresas!$B$6:$AS$46,SMALL(IF(Empresas!$B$6:$B$46=Dados!$H$37,ROW(Empresas!$B$6:$B$46)-5),ROW($A47)),COLUMN(P$1)),\"\")","v":""},{"$f":"IFERROR(INDEX(Empresas!$B$6:$AS$46,SMALL(IF(Empresas!$B$6:$B$46=Dados!$H$37,ROW(Empresas!$B$6:$B$46)-5),ROW($A47)),COLUMN(Q$1)),\"\")","v":""},{"$f":"IFERROR(INDEX(Empresas!$B$6:$AS$46,SMALL(IF(Empresas!$B$6:$B$46=Dados!$H$37,ROW(Empresas!$B$6:$B$46)-5),ROW($A47)),COLUMN(R$1)),\"\")","v":""},{"$f":"IFERROR(INDEX(Empresas!$B$6:$AS$46,SMALL(IF(Empresas!$B$6:$B$46=Dados!$H$37,ROW(Empresas!$B$6:$B$46)-5),ROW($A47)),COLUMN(S$1)),\"\")","v":""},{"$f":"IFERROR(INDEX(Empresas!$B$6:$AS$46,SMALL(IF(Empresas!$B$6:$B$46=Dados!$H$37,ROW(Empresas!$B$6:$B$46)-5),ROW($A47)),COLUMN(T$1)),\"\")","v":""},{"$f":"IFERROR(INDEX(Empresas!$B$6:$AS$46,SMALL(IF(Empresas!$B$6:$B$46=Dados!$H$37,ROW(Empresas!$B$6:$B$46)-5),ROW($A47)),COLUMN(U$1)),\"\")","v":""},{"$f":"IFERROR(INDEX(Empresas!$B$6:$AS$46,SMALL(IF(Empresas!$B$6:$B$46=Dados!$H$37,ROW(Empresas!$B$6:$B$46)-5),ROW($A47)),COLUMN(V$1)),\"\")","v":""},{"$f":"IFERROR(INDEX(Empresas!$B$6:$AS$46,SMALL(IF(Empresas!$B$6:$B$46=Dados!$H$37,ROW(Empresas!$B$6:$B$46)-5),ROW($A47)),COLUMN(W$1)),\"\")","v":""},{"$f":"IFERROR(INDEX(Empresas!$B$6:$AS$46,SMALL(IF(Empresas!$B$6:$B$46=Dados!$H$37,ROW(Empresas!$B$6:$B$46)-5),ROW($A47)),COLUMN(X$1)),\"\")","v":""},{"$f":"IFERROR(INDEX(Empresas!$B$6:$AS$46,SMALL(IF(Empresas!$B$6:$B$46=Dados!$H$37,ROW(Empresas!$B$6:$B$46)-5),ROW($A47)),COLUMN(Y$1)),\"\")","v":""},{"$f":"IFERROR(INDEX(Empresas!$B$6:$AS$46,SMALL(IF(Empresas!$B$6:$B$46=Dados!$H$37,ROW(Empresas!$B$6:$B$46)-5),ROW($A47)),COLUMN(Z$1)),\"\")","v":""},{"$f":"IFERROR(INDEX(Empresas!$B$6:$AS$46,SMALL(IF(Empresas!$B$6:$B$46=Dados!$H$37,ROW(Empresas!$B$6:$B$46)-5),ROW($A47)),COLUMN(AA$1)),\"\")","v":""},{"$f":"IFERROR(INDEX(Empresas!$B$6:$AS$46,SMALL(IF(Empresas!$B$6:$B$46=Dados!$H$37,ROW(Empresas!$B$6:$B$46)-5),ROW($A47)),COLUMN(AB$1)),\"\")","v":""},{"$f":"IFERROR(INDEX(Empresas!$B$6:$AS$46,SMALL(IF(Empresas!$B$6:$B$46=Dados!$H$37,ROW(Empresas!$B$6:$B$46)-5),ROW($A47)),COLUMN(AC$1)),\"\")","v":""},{"$f":"IFERROR(INDEX(Empresas!$B$6:$AS$46,SMALL(IF(Empresas!$B$6:$B$46=Dados!$H$37,ROW(Empresas!$B$6:$B$46)-5),ROW($A47)),COLUMN(AD$1)),\"\")","v":""},{"$f":"IFERROR(INDEX(Empresas!$B$6:$AS$46,SMALL(IF(Empresas!$B$6:$B$46=Dados!$H$37,ROW(Empresas!$B$6:$B$46)-5),ROW($A47)),COLUMN(AE$1)),\"\")","v":""},{"$f":"IFERROR(INDEX(Empresas!$B$6:$AS$46,SMALL(IF(Empresas!$B$6:$B$46=Dados!$H$37,ROW(Empresas!$B$6:$B$46)-5),ROW($A47)),COLUMN(AF$1)),\"\")","v":""},{"$f":"IFERROR(INDEX(Empresas!$B$6:$AS$46,SMALL(IF(Empresas!$B$6:$B$46=Dados!$H$37,ROW(Empresas!$B$6:$B$46)-5),ROW($A47)),COLUMN(AG$1)),\"\")","v":""},{"$f":"IFERROR(INDEX(Empresas!$B$6:$AS$46,SMALL(IF(Empresas!$B$6:$B$46=Dados!$H$37,ROW(Empresas!$B$6:$B$46)-5),ROW($A47)),COLUMN(AH$1)),\"\")","v":""},{"$f":"IFERROR(INDEX(Empresas!$B$6:$AS$46,SMALL(IF(Empresas!$B$6:$B$46=Dados!$H$37,ROW(Empresas!$B$6:$B$46)-5),ROW($A47)),COLUMN(AI$1)),\"\")","v":""},{"$f":"IFERROR(INDEX(Empresas!$B$6:$AS$46,SMALL(IF(Empresas!$B$6:$B$46=Dados!$H$37,ROW(Empresas!$B$6:$B$46)-5),ROW($A47)),COLUMN(AJ$1)),\"\")","v":""},{"$f":"IFERROR(INDEX(Empresas!$B$6:$AS$46,SMALL(IF(Empresas!$B$6:$B$46=Dados!$H$37,ROW(Empresas!$B$6:$B$46)-5),ROW($A47)),COLUMN(AK$1)),\"\")","v":""},{"$f":"IFERROR(INDEX(Empresas!$B$6:$AS$46,SMALL(IF(Empresas!$B$6:$B$46=Dados!$H$37,ROW(Empresas!$B$6:$B$46)-5),ROW($A47)),COLUMN(AL$1)),\"\")","v":""},{"$f":"IFERROR(INDEX(Empresas!$B$6:$AS$46,SMALL(IF(Empresas!$B$6:$B$46=Dados!$H$37,ROW(Empresas!$B$6:$B$46)-5),ROW($A47)),COLUMN(AM$1)),\"\")","v":""},{"$f":"IFERROR(INDEX(Empresas!$B$6:$AS$46,SMALL(IF(Empresas!$B$6:$B$46=Dados!$H$37,ROW(Empresas!$B$6:$B$46)-5),ROW($A47)),COLUMN(AN$1)),\"\")","v":""},{"$f":"IFERROR(INDEX(Empresas!$B$6:$AS$46,SMALL(IF(Empresas!$B$6:$B$46=Dados!$H$37,ROW(Empresas!$B$6:$B$46)-5),ROW($A47)),COLUMN(AO$1)),\"\")","v":""},{"$f":"IFERROR(INDEX(Empresas!$B$6:$AS$46,SMALL(IF(Empresas!$B$6:$B$46=Dados!$H$37,ROW(Empresas!$B$6:$B$46)-5),ROW($A47)),COLUMN(AP$1)),\"\")","v":""},{"$f":"IFERROR(INDEX(Empresas!$B$6:$AS$46,SMALL(IF(Empresas!$B$6:$B$46=Dados!$H$37,ROW(Empresas!$B$6:$B$46)-5),ROW($A47)),COLUMN(AQ$1)),\"\")","v":""},{"$f":"IFERROR(INDEX(Empresas!$B$6:$AS$46,SMALL(IF(Empresas!$B$6:$B$46=Dados!$H$37,ROW(Empresas!$B$6:$B$46)-5),ROW($A47)),COLUMN(AR$1)),\"\")","v":""}]
[null,{"$f":"IFERROR(INDEX(Empresas!$B$6:$AS$46,SMALL(IF(Empresas!$B$6:$B$46=Dados!$H$37,ROW(Empresas!$B$6:$B$46)-5),ROW($A48)),COLUMN(B$1)),\"\")","v":""},{"$f":"IFERROR(INDEX(Empresas!$B$6:$AS$46,SMALL(IF(Empresas!$B$6:$B$46=Dados!$H$37,ROW(Empresas!$B$6:$B$46)-5),ROW($A48)),COLUMN(C$1)),\"\")","v":""},"",{"$f":"IFERROR(INDEX(Empresas!$B$6:$AS$46,SMALL(IF(Empresas!$B$6:$B$46=Dados!$H$37,ROW(Empresas!$B$6:$B$46)-5),ROW($A48)),COLUMN(F$1)),\"\")","v":""},{"$f":"IFERROR(INDEX(Empresas!$B$6:$AS$46,SMALL(IF(Empresas!$B$6:$B$46=Dados!$H$37,ROW(Empresas!$B$6:$B$46)-5),ROW($A48)),COLUMN(G$1)),\"\")","v":""},{"$f":"IFERROR(INDEX(Empresas!$B$6:$AS$46,SMALL(IF(Empresas!$B$6:$B$46=Dados!$H$37,ROW(Empresas!$B$6:$B$46)-5),ROW($A48)),COLUMN(H$1)),\"\")","v":""},{"$f":"IFERROR(INDEX(Empresas!$B$6:$AS$46,SMALL(IF(Empresas!$B$6:$B$46=Dados!$H$37,ROW(Empresas!$B$6:$B$46)-5),ROW($A48)),COLUMN(I$1)),\"\")","v":""},{"$f":"IFERROR(INDEX(Empresas!$B$6:$AS$46,SMALL(IF(Empresas!$B$6:$B$46=Dados!$H$37,ROW(Empresas!$B$6:$B$46)-5),ROW($A48)),COLUMN(J$1)),\"\")","v":""},{"$f":"IFERROR(INDEX(Empresas!$B$6:$AS$46,SMALL(IF(Empresas!$B$6:$B$46=Dados!$H$37,ROW(Empresas!$B$6:$B$46)-5),ROW($A48)),COLUMN(K$1)),\"\")","v":""},{"$f":"IFERROR(INDEX(Empresas!$B$6:$AS$46,SMALL(IF(Empresas!$B$6:$B$46=Dados!$H$37,ROW(Empresas!$B$6:$B$46)-5),ROW($A48)),COLUMN(L$1)),\"\")","v":""},{"$f":"IFERROR(INDEX(Empresas!$B$6:$AS$46,SMALL(IF(Empresas!$B$6:$B$46=Dados!$H$37,ROW(Empresas!$B$6:$B$46)-5),ROW($A48)),COLUMN(M$1)),\"\")","v":""},{"$f":"IFERROR(INDEX(Empresas!$B$6:$AS$46,SMALL(IF(Empresas!$B$6:$B$46=Dados!$H$37,ROW(Empresas!$B$6:$B$46)-5),ROW($A48)),COLUMN(N$1)),\"\")","v":""},{"$f":"IFERROR(INDEX(Empresas!$B$6:$AS$46,SMALL(IF(Empresas!$B$6:$B$46=Dados!$H$37,ROW(Empresas!$B$6:$B$46)-5),ROW($A48)),COLUMN(O$1)),\"\")","v":""},{"$f":"IFERROR(INDEX(Empresas!$B$6:$AS$46,SMALL(IF(Empresas!$B$6:$B$46=Dados!$H$37,ROW(Empresas!$B$6:$B$46)-5),ROW($A48)),COLUMN(P$1)),\"\")","v":""},{"$f":"IFERROR(INDEX(Empresas!$B$6:$AS$46,SMALL(IF(Empresas!$B$6:$B$46=Dados!$H$37,ROW(Empresas!$B$6:$B$46)-5),ROW($A48)),COLUMN(Q$1)),\"\")","v":""},{"$f":"IFERROR(INDEX(Empresas!$B$6:$AS$46,SMALL(IF(Empresas!$B$6:$B$46=Dados!$H$37,ROW(Empresas!$B$6:$B$46)-5),ROW($A48)),COLUMN(R$1)),\"\")","v":""},{"$f":"IFERROR(INDEX(Empresas!$B$6:$AS$46,SMALL(IF(Empresas!$B$6:$B$46=Dados!$H$37,ROW(Empresas!$B$6:$B$46)-5),ROW($A48)),COLUMN(S$1)),\"\")","v":""},{"$f":"IFERROR(INDEX(Empresas!$B$6:$AS$46,SMALL(IF(Empresas!$B$6:$B$46=Dados!$H$37,ROW(Empresas!$B$6:$B$46)-5),ROW($A48)),COLUMN(T$1)),\"\")","v":""},{"$f":"IFERROR(INDEX(Empresas!$B$6:$AS$46,SMALL(IF(Empresas!$B$6:$B$46=Dados!$H$37,ROW(Empresas!$B$6:$B$46)-5),ROW($A48)),COLUMN(U$1)),\"\")","v":""},{"$f":"IFERROR(INDEX(Empresas!$B$6:$AS$46,SMALL(IF(Empresas!$B$6:$B$46=Dados!$H$37,ROW(Empresas!$B$6:$B$46)-5),ROW($A48)),COLUMN(V$1)),\"\")","v":""},{"$f":"IFERROR(INDEX(Empresas!$B$6:$AS$46,SMALL(IF(Empresas!$B$6:$B$46=Dados!$H$37,ROW(Empresas!$B$6:$B$46)-5),ROW($A48)),COLUMN(W$1)),\"\")","v":""},{"$f":"IFERROR(INDEX(Empresas!$B$6:$AS$46,SMALL(IF(Empresas!$B$6:$B$46=Dados!$H$37,ROW(Empresas!$B$6:$B$46)-5),ROW($A48)),COLUMN(X$1)),\"\")","v":""},{"$f":"IFERROR(INDEX(Empresas!$B$6:$AS$46,SMALL(IF(Empresas!$B$6:$B$46=Dados!$H$37,ROW(Empresas!$B$6:$B$46)-5),ROW($A48)),COLUMN(Y$1)),\"\")","v":""},{"$f":"IFERROR(INDEX(Empresas!$B$6:$AS$46,SMALL(IF(Empresas!$B$6:$B$46=Dados!$H$37,ROW(Empresas!$B$6:$B$46)-5),ROW($A48)),COLUMN(Z$1)),\"\")","v":""},{"$f":"IFERROR(INDEX(Empresas!$B$6:$AS$46,SMALL(IF(Empresas!$B$6:$B$46=Dados!$H$37,ROW(Empresas!$B$6:$B$46)-5),ROW($A48)),COLUMN(AA$1)),\"\")","v":""},{"$f":"IFERROR(INDEX(Empresas!$B$6:$AS$46,SMALL(IF(Empresas!$B$6:$B$46=Dados!$H$37,ROW(Empresas!$B$6:$B$46)-5),ROW($A48)),COLUMN(AB$1)),\"\")","v":""},{"$f":"IFERROR(INDEX(Empresas!$B$6:$AS$46,SMALL(IF(Empresas!$B$6:$B$46=Dados!$H$37,ROW(Empresas!$B$6:$B$46)-5),ROW($A48)),COLUMN(AC$1)),\"\")","v":""},{"$f":"IFERROR(INDEX(Empresas!$B$6:$AS$46,SMALL(IF(Empresas!$B$6:$B$46=Dados!$H$37,ROW(Empresas!$B$6:$B$46)-5),ROW($A48)),COLUMN(AD$1)),\"\")","v":""},{"$f":"IFERROR(INDEX(Empresas!$B$6:$AS$46,SMALL(IF(Empresas!$B$6:$B$46=Dados!$H$37,ROW(Empresas!$B$6:$B$46)-5),ROW($A48)),COLUMN(AE$1)),\"\")","v":""},{"$f":"IFERROR(INDEX(Empresas!$B$6:$AS$46,SMALL(IF(Empresas!$B$6:$B$46=Dados!$H$37,ROW(Empresas!$B$6:$B$46)-5),ROW($A48)),COLUMN(AF$1)),\"\")","v":""},{"$f":"IFERROR(INDEX(Empresas!$B$6:$AS$46,SMALL(IF(Empresas!$B$6:$B$46=Dados!$H$37,ROW(Empresas!$B$6:$B$46)-5),ROW($A48)),COLUMN(AG$1)),\"\")","v":""},{"$f":"IFERROR(INDEX(Empresas!$B$6:$AS$46,SMALL(IF(Empresas!$B$6:$B$46=Dados!$H$37,ROW(Empresas!$B$6:$B$46)-5),ROW($A48)),COLUMN(AH$1)),\"\")","v":""},{"$f":"IFERROR(INDEX(Empresas!$B$6:$AS$46,SMALL(IF(Empresas!$B$6:$B$46=Dados!$H$37,ROW(Empresas!$B$6:$B$46)-5),ROW($A48)),COLUMN(AI$1)),\"\")","v":""},{"$f":"IFERROR(INDEX(Empresas!$B$6:$AS$46,SMALL(IF(Empresas!$B$6:$B$46=Dados!$H$37,ROW(Empresas!$B$6:$B$46)-5),ROW($A48)),COLUMN(AJ$1)),\"\")","v":""},{"$f":"IFERROR(INDEX(Empresas!$B$6:$AS$46,SMALL(IF(Empresas!$B$6:$B$46=Dados!$H$37,ROW(Empresas!$B$6:$B$46)-5),ROW($A48)),COLUMN(AK$1)),\"\")","v":""},{"$f":"IFERROR(INDEX(Empresas!$B$6:$AS$46,SMALL(IF(Empresas!$B$6:$B$46=Dados!$H$37,ROW(Empresas!$B$6:$B$46)-5),ROW($A48)),COLUMN(AL$1)),\"\")","v":""},{"$f":"IFERROR(INDEX(Empresas!$B$6:$AS$46,SMALL(IF(Empresas!$B$6:$B$46=Dados!$H$37,ROW(Empresas!$B$6:$B$46)-5),ROW($A48)),COLUMN(AM$1)),\"\")","v":""},{"$f":"IFERROR(INDEX(Empresas!$B$6:$AS$46,SMALL(IF(Empresas!$B$6:$B$46=Dados!$H$37,ROW(Empresas!$B$6:$B$46)-5),ROW($A48)),COLUMN(AN$1)),\"\")","v":""},{"$f":"IFERROR(INDEX(Empresas!$B$6:$AS$46,SMALL(IF(Empresas!$B$6:$B$46=Dados!$H$37,ROW(Empresas!$B$6:$B$46)-5),ROW($A48)),COLUMN(AO$1)),\"\")","v":""},{"$f":"IFERROR(INDEX(Empresas!$B$6:$AS$46,SMALL(IF(Empresas!$B$6:$B$46=Dados!$H$37,ROW(Empresas!$B$6:$B$46)-5),ROW($A48)),COLUMN(AP$1)),\"\")","v":""},{"$f":"IFERROR(INDEX(Empresas!$B$6:$AS$46,SMALL(IF(Empresas!$B$6:$B$46=Dados!$H$37,ROW(Empresas!$B$6:$B$46)-5),ROW($A48)),COLUMN(AQ$1)),\"\")","v":""},{"$f":"IFERROR(INDEX(Empresas!$B$6:$AS$46,SMALL(IF(Empresas!$B$6:$B$46=Dados!$H$37,ROW(Empresas!$B$6:$B$46)-5),ROW($A48)),COLUMN(AR$1)),\"\")","v":""}]
[null,{"$f":"IFERROR(INDEX(Empresas!$B$6:$AS$46,SMALL(IF(Empresas!$B$6:$B$46=Dados!$H$37,ROW(Empresas!$B$6:$B$46)-5),ROW($A49)),COLUMN(B$1)),\"\")","v":""},{"$f":"IFERROR(INDEX(Empresas!$B$6:$AS$46,SMALL(IF(Empresas!$B$6:$B$46=Dados!$H$37,ROW(Empresas!$B$6:$B$46)-5),ROW($A49)),COLUMN(C$1)),\"\")","v":""},"",{"$f":"IFERROR(INDEX(Empresas!$B$6:$AS$46,SMALL(IF(Empresas!$B$6:$B$46=Dados!$H$37,ROW(Empresas!$B$6:$B$46)-5),ROW($A49)),COLUMN(F$1)),\"\")","v":""},{"$f":"IFERROR(INDEX(Empresas!$B$6:$AS$46,SMALL(IF(Empresas!$B$6:$B$46=Dados!$H$37,ROW(Empresas!$B$6:$B$46)-5),ROW($A49)),COLUMN(G$1)),\"\")","v":""},{"$f":"IFERROR(INDEX(Empresas!$B$6:$AS$46,SMALL(IF(Empresas!$B$6:$B$46=Dados!$H$37,ROW(Empresas!$B$6:$B$46)-5),ROW($A49)),COLUMN(H$1)),\"\")","v":""},{"$f":"IFERROR(INDEX(Empresas!$B$6:$AS$46,SMALL(IF(Empresas!$B$6:$B$46=Dados!$H$37,ROW(Empresas!$B$6:$B$46)-5),ROW($A49)),COLUMN(I$1)),\"\")","v":""},{"$f":"IFERROR(INDEX(Empresas!$B$6:$AS$46,SMALL(IF(Empresas!$B$6:$B$46=Dados!$H$37,ROW(Empresas!$B$6:$B$46)-5),ROW($A49)),COLUMN(J$1)),\"\")","v":""},{"$f":"IFERROR(INDEX(Empresas!$B$6:$AS$46,SMALL(IF(Empresas!$B$6:$B$46=Dados!$H$37,ROW(Empresas!$B$6:$B$46)-5),ROW($A49)),COLUMN(K$1)),\"\")","v":""},{"$f":"IFERROR(INDEX(Empresas!$B$6:$AS$46,SMALL(IF(Empresas!$B$6:$B$46=Dados!$H$37,ROW(Empresas!$B$6:$B$46)-5),ROW($A49)),COLUMN(L$1)),\"\")","v":""},{"$f":"IFERROR(INDEX(Empresas!$B$6:$AS$46,SMALL(IF(Empresas!$B$6:$B$46=Dados!$H$37,ROW(Empresas!$B$6:$B$46)-5),ROW($A49)),COLUMN(M$1)),\"\")","v":""},{"$f":"IFERROR(INDEX(Empresas!$B$6:$AS$46,SMALL(IF(Empresas!$B$6:$B$46=Dados!$H$37,ROW(Empresas!$B$6:$B$46)-5),ROW($A49)),COLUMN(N$1)),\"\")","v":""},{"$f":"IFERROR(INDEX(Empresas!$B$6:$AS$46,SMALL(IF(Empresas!$B$6:$B$46=Dados!$H$37,ROW(Empresas!$B$6:$B$46)-5),ROW($A49)),COLUMN(O$1)),\"\")","v":""},{"$f":"IFERROR(INDEX(Empresas!$B$6:$AS$46,SMALL(IF(Empresas!$B$6:$B$46=Dados!$H$37,ROW(Empresas!$B$6:$B$46)-5),ROW($A49)),COLUMN(P$1)),\"\")","v":""},{"$f":"IFERROR(INDEX(Empresas!$B$6:$AS$46,SMALL(IF(Empresas!$B$6:$B$46=Dados!$H$37,ROW(Empresas!$B$6:$B$46)-5),ROW($A49)),COLUMN(Q$1)),\"\")","v":""},{"$f":"IFERROR(INDEX(Empresas!$B$6:$AS$46,SMALL(IF(Empresas!$B$6:$B$46=Dados!$H$37,ROW(Empresas!$B$6:$B$46)-5),ROW($A49)),COLUMN(R$1)),\"\")","v":""},{"$f":"IFERROR(INDEX(Empresas!$B$6:$AS$46,SMALL(IF(Empresas!$B$6:$B$46=Dados!$H$37,ROW(Empresas!$B$6:$B$46)-5),ROW($A49)),COLUMN(S$1)),\"\")","v":""},{"$f":"IFERROR(INDEX(Empresas!$B$6:$AS$46,SMALL(IF(Empresas!$B$6:$B$46=Dados!$H$37,ROW(Empresas!$B$6:$B$46)-5),ROW($A49)),COLUMN(T$1)),\"\")","v":""},{"$f":"IFERROR(INDEX(Empresas!$B$6:$AS$46,SMALL(IF(Empresas!$B$6:$B$46=Dados!$H$37,ROW(Empresas!$B$6:$B$46)-5),ROW($A49)),COLUMN(U$1)),\"\")","v":""},{"$f":"IFERROR(INDEX(Empresas!$B$6:$AS$46,SMALL(IF(Empresas!$B$6:$B$46=Dados!$H$37,ROW(Empresas!$B$6:$B$46)-5),ROW($A49)),COLUMN(V$1)),\"\")","v":""},{"$f":"IFERROR(INDEX(Empresas!$B$6:$AS$46,SMALL(IF(Empresas!$B$6:$B$46=Dados!$H$37,ROW(Empresas!$B$6:$B$46)-5),ROW($A49)),COLUMN(W$1)),\"\")","v":""},{"$f":"IFERROR(INDEX(Empresas!$B$6:$AS$46,SMALL(IF(Empresas!$B$6:$B$46=Dados!$H$37,ROW(Empresas!$B$6:$B$46)-5),ROW($A49)),COLUMN(X$1)),\"\")","v":""},{"$f":"IFERROR(INDEX(Empresas!$B$6:$AS$46,SMALL(IF(Empresas!$B$6:$B$46=Dados!$H$37,ROW(Empresas!$B$6:$B$46)-5),ROW($A49)),COLUMN(Y$1)),\"\")","v":""},{"$f":"IFERROR(INDEX(Empresas!$B$6:$AS$46,SMALL(IF(Empresas!$B$6:$B$46=Dados!$H$37,ROW(Empresas!$B$6:$B$46)-5),ROW($A49)),COLUMN(Z$1)),\"\")","v":""},{"$f":"IFERROR(INDEX(Empresas!$B$6:$AS$46,SMALL(IF(Empresas!$B$6:$B$46=Dados!$H$37,ROW(Empresas!$B$6:$B$46)-5),ROW($A49)),COLUMN(AA$1)),\"\")","v":""},{"$f":"IFERROR(INDEX(Empresas!$B$6:$AS$46,SMALL(IF(Empresas!$B$6:$B$46=Dados!$H$37,ROW(Empresas!$B$6:$B$46)-5),ROW($A49)),COLUMN(AB$1)),\"\")","v":""},{"$f":"IFERROR(INDEX(Empresas!$B$6:$AS$46,SMALL(IF(Empresas!$B$6:$B$46=Dados!$H$37,ROW(Empresas!$B$6:$B$46)-5),ROW($A49)),COLUMN(AC$1)),\"\")","v":""},{"$f":"IFERROR(INDEX(Empresas!$B$6:$AS$46,SMALL(IF(Empresas!$B$6:$B$46=Dados!$H$37,ROW(Empresas!$B$6:$B$46)-5),ROW($A49)),COLUMN(AD$1)),\"\")","v":""},{"$f":"IFERROR(INDEX(Empresas!$B$6:$AS$46,SMALL(IF(Empresas!$B$6:$B$46=Dados!$H$37,ROW(Empresas!$B$6:$B$46)-5),ROW($A49)),COLUMN(AE$1)),\"\")","v":""},{"$f":"IFERROR(INDEX(Empresas!$B$6:$AS$46,SMALL(IF(Empresas!$B$6:$B$46=Dados!$H$37,ROW(Empresas!$B$6:$B$46)-5),ROW($A49)),COLUMN(AF$1)),\"\")","v":""},{"$f":"IFERROR(INDEX(Empresas!$B$6:$AS$46,SMALL(IF(Empresas!$B$6:$B$46=Dados!$H$37,ROW(Empresas!$B$6:$B$46)-5),ROW($A49)),COLUMN(AG$1)),\"\")","v":""},{"$f":"IFERROR(INDEX(Empresas!$B$6:$AS$46,SMALL(IF(Empresas!$B$6:$B$46=Dados!$H$37,ROW(Empresas!$B$6:$B$46)-5),ROW($A49)),COLUMN(AH$1)),\"\")","v":""},{"$f":"IFERROR(INDEX(Empresas!$B$6:$AS$46,SMALL(IF(Empresas!$B$6:$B$46=Dados!$H$37,ROW(Empresas!$B$6:$B$46)-5),ROW($A49)),COLUMN(AI$1)),\"\")","v":""},{"$f":"IFERROR(INDEX(Empresas!$B$6:$AS$46,SMALL(IF(Empresas!$B$6:$B$46=Dados!$H$37,ROW(Empresas!$B$6:$B$46)-5),ROW($A49)),COLUMN(AJ$1)),\"\")","v":""},{"$f":"IFERROR(INDEX(Empresas!$B$6:$AS$46,SMALL(IF(Empresas!$B$6:$B$46=Dados!$H$37,ROW(Empresas!$B$6:$B$46)-5),ROW($A49)),COLUMN(AK$1)),\"\")","v":""},{"$f":"IFERROR(INDEX(Empresas!$B$6:$AS$46,SMALL(IF(Empresas!$B$6:$B$46=Dados!$H$37,ROW(Empresas!$B$6:$B$46)-5),ROW($A49)),COLUMN(AL$1)),\"\")","v":""},{"$f":"IFERROR(INDEX(Empresas!$B$6:$AS$46,SMALL(IF(Empresas!$B$6:$B$46=Dados!$H$37,ROW(Empresas!$B$6:$B$46)-5),ROW($A49)),COLUMN(AM$1)),\"\")","v":""},{"$f":"IFERROR(INDEX(Empresas!$B$6:$AS$46,SMALL(IF(Empresas!$B$6:$B$46=Dados!$H$37,ROW(Empresas!$B$6:$B$46)-5),ROW($A49)),COLUMN(AN$1)),\"\")","v":""},{"$f":"IFERROR(INDEX(Empresas!$B$6:$AS$46,SMALL(IF(Empresas!$B$6:$B$46=Dados!$H$37,ROW(Empresas!$B$6:$B$46)-5),ROW($A49)),COLUMN(AO$1)),\"\")","v":""},{"$f":"IFERROR(INDEX(Empresas!$B$6:$AS$46,SMALL(IF(Empresas!$B$6:$B$46=Dados!$H$37,ROW(Empresas!$B$6:$B$46)-5),ROW($A49)),COLUMN(AP$1)),\"\")","v":""},{"$f":"IFERROR(INDEX(Empresas!$B$6:$AS$46,SMALL(IF(Empresas!$B$6:$B$46=Dados!$H$37,ROW(Empresas!$B$6:$B$46)-5),ROW($A49)),COLUMN(AQ$1)),\"\")","v":""},{"$f":"IFERROR(INDEX(Empresas!$B$6:$AS$46,SMALL(IF(Empresas!$B$6:$B$46=Dados!$H$37,ROW(Empresas!$B$6:$B$46)-5),ROW($A49)),COLUMN(AR$1)),\"\")","v":""}]
[null,{"$f":"IFERROR(INDEX(Empresas!$B$6:$AS$46,SMALL(IF(Empresas!$B$6:$B$46=Dados!$H$37,ROW(Empresas!$B$6:$B$46)-5),ROW($A50)),COLUMN(B$1)),\"\")","v":""},{"$f":"IFERROR(INDEX(Empresas!$B$6:$AS$46,SMALL(IF(Empresas!$B$6:$B$46=Dados!$H$37,ROW(Empresas!$B$6:$B$46)-5),ROW($A50)),COLUMN(C$1)),\"\")","v":""},"",{"$f":"IFERROR(INDEX(Empresas!$B$6:$AS$46,SMALL(IF(Empresas!$B$6:$B$46=Dados!$H$37,ROW(Empresas!$B$6:$B$46)-5),ROW($A50)),COLUMN(F$1)),\"\")","v":""},{"$f":"IFERROR(INDEX(Empresas!$B$6:$AS$46,SMALL(IF(Empresas!$B$6:$B$46=Dados!$H$37,ROW(Empresas!$B$6:$B$46)-5),ROW($A50)),COLUMN(G$1)),\"\")","v":""},{"$f":"IFERROR(INDEX(Empresas!$B$6:$AS$46,SMALL(IF(Empresas!$B$6:$B$46=Dados!$H$37,ROW(Empresas!$B$6:$B$46)-5),ROW($A50)),COLUMN(H$1)),\"\")","v":""},{"$f":"IFERROR(INDEX(Empresas!$B$6:$AS$46,SMALL(IF(Empresas!$B$6:$B$46=Dados!$H$37,ROW(Empresas!$B$6:$B$46)-5),ROW($A50)),COLUMN(I$1)),\"\")","v":""},{"$f":"IFERROR(INDEX(Empresas!$B$6:$AS$46,SMALL(IF(Empresas!$B$6:$B$46=Dados!$H$37,ROW(Empresas!$B$6:$B$46)-5),ROW($A50)),COLUMN(J$1)),\"\")","v":""},{"$f":"IFERROR(INDEX(Empresas!$B$6:$AS$46,SMALL(IF(Empresas!$B$6:$B$46=Dados!$H$37,ROW(Empresas!$B$6:$B$46)-5),ROW($A50)),COLUMN(K$1)),\"\")","v":""},{"$f":"IFERROR(INDEX(Empresas!$B$6:$AS$46,SMALL(IF(Empresas!$B$6:$B$46=Dados!$H$37,ROW(Empresas!$B$6:$B$46)-5),ROW($A50)),COLUMN(L$1)),\"\")","v":""},{"$f":"IFERROR(INDEX(Empresas!$B$6:$AS$46,SMALL(IF(Empresas!$B$6:$B$46=Dados!$H$37,ROW(Empresas!$B$6:$B$46)-5),ROW($A50)),COLUMN(M$1)),\"\")","v":""},{"$f":"IFERROR(INDEX(Empresas!$B$6:$AS$46,SMALL(IF(Empresas!$B$6:$B$46=Dados!$H$37,ROW(Empresas!$B$6:$B$46)-5),ROW($A50)),COLUMN(N$1)),\"\")","v":""},{"$f":"IFERROR(INDEX(Empresas!$B$6:$AS$46,SMALL(IF(Empresas!$B$6:$B$46=Dados!$H$37,ROW(Empresas!$B$6:$B$46)-5),ROW($A50)),COLUMN(O$1)),\"\")","v":""},{"$f":"IFERROR(INDEX(Empresas!$B$6:$AS$46,SMALL(IF(Empresas!$B$6:$B$46=Dados!$H$37,ROW(Empresas!$B$6:$B$46)-5),ROW($A50)),COLUMN(P$1)),\"\")","v":""},{"$f":"IFERROR(INDEX(Empresas!$B$6:$AS$46,SMALL(IF(Empresas!$B$6:$B$46=Dados!$H$37,ROW(Empresas!$B$6:$B$46)-5),ROW($A50)),COLUMN(Q$1)),\"\")","v":""},{"$f":"IFERROR(INDEX(Empresas!$B$6:$AS$46,SMALL(IF(Empresas!$B$6:$B$46=Dados!$H$37,ROW(Empresas!$B$6:$B$46)-5),ROW($A50)),COLUMN(R$1)),\"\")","v":""},{"$f":"IFERROR(INDEX(Empresas!$B$6:$AS$46,SMALL(IF(Empresas!$B$6:$B$46=Dados!$H$37,ROW(Empresas!$B$6:$B$46)-5),ROW($A50)),COLUMN(S$1)),\"\")","v":""},{"$f":"IFERROR(INDEX(Empresas!$B$6:$AS$46,SMALL(IF(Empresas!$B$6:$B$46=Dados!$H$37,ROW(Empresas!$B$6:$B$46)-5),ROW($A50)),COLUMN(T$1)),\"\")","v":""},{"$f":"IFERROR(INDEX(Empresas!$B$6:$AS$46,SMALL(IF(Empresas!$B$6:$B$46=Dados!$H$37,ROW(Empresas!$B$6:$B$46)-5),ROW($A50)),COLUMN(U$1)),\"\")","v":""},{"$f":"IFERROR(INDEX(Empresas!$B$6:$AS$46,SMALL(IF(Empresas!$B$6:$B$46=Dados!$H$37,ROW(Empresas!$B$6:$B$46)-5),ROW($A50)),COLUMN(V$1)),\"\")","v":""},{"$f":"IFERROR(INDEX(Empresas!$B$6:$AS$46,SMALL(IF(Empresas!$B$6:$B$46=Dados!$H$37,ROW(Empresas!$B$6:$B$46)-5),ROW($A50)),COLUMN(W$1)),\"\")","v":""},{"$f":"IFERROR(INDEX(Empresas!$B$6:$AS$46,SMALL(IF(Empresas!$B$6:$B$46=Dados!$H$37,ROW(Empresas!$B$6:$B$46)-5),ROW($A50)),COLUMN(X$1)),\"\")","v":""},{"$f":"IFERROR(INDEX(Empresas!$B$6:$AS$46,SMALL(IF(Empresas!$B$6:$B$46=Dados!$H$37,ROW(Empresas!$B$6:$B$46)-5),ROW($A50)),COLUMN(Y$1)),\"\")","v":""},{"$f":"IFERROR(INDEX(Empresas!$B$6:$AS$46,SMALL(IF(Empresas!$B$6:$B$46=Dados!$H$37,ROW(Empresas!$B$6:$B$46)-5),ROW($A50)),COLUMN(Z$1)),\"\")","v":""},{"$f":"IFERROR(INDEX(Empresas!$B$6:$AS$46,SMALL(IF(Empresas!$B$6:$B$46=Dados!$H$37,ROW(Empresas!$B$6:$B$46)-5),ROW($A50)),COLUMN(AA$1)),\"\")","v":""},{"$f":"IFERROR(INDEX(Empresas!$B$6:$AS$46,SMALL(IF(Empresas!$B$6:$B$46=Dados!$H$37,ROW(Empresas!$B$6:$B$46)-5),ROW($A50)),COLUMN(AB$1)),\"\")","v":""},{"$f":"IFERROR(INDEX(Empresas!$B$6:$AS$46,SMALL(IF(Empresas!$B$6:$B$46=Dados!$H$37,ROW(Empresas!$B$6:$B$46)-5),ROW($A50)),COLUMN(AC$1)),\"\")","v":""},{"$f":"IFERROR(INDEX(Empresas!$B$6:$AS$46,SMALL(IF(Empresas!$B$6:$B$46=Dados!$H$37,ROW(Empresas!$B$6:$B$46)-5),ROW($A50)),COLUMN(AD$1)),\"\")","v":""},{"$f":"IFERROR(INDEX(Empresas!$B$6:$AS$46,SMALL(IF(Empresas!$B$6:$B$46=Dados!$H$37,ROW(Empresas!$B$6:$B$46)-5),ROW($A50)),COLUMN(AE$1)),\"\")","v":""},{"$f":"IFERROR(INDEX(Empresas!$B$6:$AS$46,SMALL(IF(Empresas!$B$6:$B$46=Dados!$H$37,ROW(Empresas!$B$6:$B$46)-5),ROW($A50)),COLUMN(AF$1)),\"\")","v":""},{"$f":"IFERROR(INDEX(Empresas!$B$6:$AS$46,SMALL(IF(Empresas!$B$6:$B$46=Dados!$H$37,ROW(Empresas!$B$6:$B$46)-5),ROW($A50)),COLUMN(AG$1)),\"\")","v":""},{"$f":"IFERROR(INDEX(Empresas!$B$6:$AS$46,SMALL(IF(Empresas!$B$6:$B$46=Dados!$H$37,ROW(Empresas!$B$6:$B$46)-5),ROW($A50)),COLUMN(AH$1)),\"\")","v":""},{"$f":"IFERROR(INDEX(Empresas!$B$6:$AS$46,SMALL(IF(Empresas!$B$6:$B$46=Dados!$H$37,ROW(Empresas!$B$6:$B$46)-5),ROW($A50)),COLUMN(AI$1)),\"\")","v":""},{"$f":"IFERROR(INDEX(Empresas!$B$6:$AS$46,SMALL(IF(Empresas!$B$6:$B$46=Dados!$H$37,ROW(Empresas!$B$6:$B$46)-5),ROW($A50)),COLUMN(AJ$1)),\"\")","v":""},{"$f":"IFERROR(INDEX(Empresas!$B$6:$AS$46,SMALL(IF(Empresas!$B$6:$B$46=Dados!$H$37,ROW(Empresas!$B$6:$B$46)-5),ROW($A50)),COLUMN(AK$1)),\"\")","v":""},{"$f":"IFERROR(INDEX(Empresas!$B$6:$AS$46,SMALL(IF(Empresas!$B$6:$B$46=Dados!$H$37,ROW(Empresas!$B$6:$B$46)-5),ROW($A50)),COLUMN(AL$1)),\"\")","v":""},{"$f":"IFERROR(INDEX(Empresas!$B$6:$AS$46,SMALL(IF(Empresas!$B$6:$B$46=Dados!$H$37,ROW(Empresas!$B$6:$B$46)-5),ROW($A50)),COLUMN(AM$1)),\"\")","v":""},{"$f":"IFERROR(INDEX(Empresas!$B$6:$AS$46,SMALL(IF(Empresas!$B$6:$B$46=Dados!$H$37,ROW(Empresas!$B$6:$B$46)-5),ROW($A50)),COLUMN(AN$1)),\"\")","v":""},{"$f":"IFERROR(INDEX(Empresas!$B$6:$AS$46,SMALL(IF(Empresas!$B$6:$B$46=Dados!$H$37,ROW(Empresas!$B$6:$B$46)-5),ROW($A50)),COLUMN(AO$1)),\"\")","v":""},{"$f":"IFERROR(INDEX(Empresas!$B$6:$AS$46,SMALL(IF(Empresas!$B$6:$B$46=Dados!$H$37,ROW(Empresas!$B$6:$B$46)-5),ROW($A50)),COLUMN(AP$1)),\"\")","v":""},{"$f":"IFERROR(INDEX(Empresas!$B$6:$AS$46,SMALL(IF(Empresas!$B$6:$B$46=Dados!$H$37,ROW(Empresas!$B$6:$B$46)-5),ROW($A50)),COLUMN(AQ$1)),\"\")","v":""},{"$f":"IFERROR(INDEX(Empresas!$B$6:$AS$46,SMALL(IF(Empresas!$B$6:$B$46=Dados!$H$37,ROW(Empresas!$B$6:$B$46)-5),ROW($A50)),COLUMN(AR$1)),\"\")","v":""}]
[null,{"$f":"IFERROR(INDEX(Empresas!$B$6:$AS$46,SMALL(IF(Empresas!$B$6:$B$46=Dados!$H$37,ROW(Empresas!$B$6:$B$46)-5),ROW($A51)),COLUMN(B$1)),\"\")","v":""},{"$f":"IFERROR(INDEX(Empresas!$B$6:$AS$46,SMALL(IF(Empresas!$B$6:$B$46=Dados!$H$37,ROW(Empresas!$B$6:$B$46)-5),ROW($A51)),COLUMN(C$1)),\"\")","v":""},"",{"$f":"IFERROR(INDEX(Empresas!$B$6:$AS$46,SMALL(IF(Empresas!$B$6:$B$46=Dados!$H$37,ROW(Empresas!$B$6:$B$46)-5),ROW($A51)),COLUMN(F$1)),\"\")","v":""},{"$f":"IFERROR(INDEX(Empresas!$B$6:$AS$46,SMALL(IF(Empresas!$B$6:$B$46=Dados!$H$37,ROW(Empresas!$B$6:$B$46)-5),ROW($A51)),COLUMN(G$1)),\"\")","v":""},{"$f":"IFERROR(INDEX(Empresas!$B$6:$AS$46,SMALL(IF(Empresas!$B$6:$B$46=Dados!$H$37,ROW(Empresas!$B$6:$B$46)-5),ROW($A51)),COLUMN(H$1)),\"\")","v":""},{"$f":"IFERROR(INDEX(Empresas!$B$6:$AS$46,SMALL(IF(Empresas!$B$6:$B$46=Dados!$H$37,ROW(Empresas!$B$6:$B$46)-5),ROW($A51)),COLUMN(I$1)),\"\")","v":""},{"$f":"IFERROR(INDEX(Empresas!$B$6:$AS$46,SMALL(IF(Empresas!$B$6:$B$46=Dados!$H$37,ROW(Empresas!$B$6:$B$46)-5),ROW($A51)),COLUMN(J$1)),\"\")","v":""},{"$f":"IFERROR(INDEX(Empresas!$B$6:$AS$46,SMALL(IF(Empresas!$B$6:$B$46=Dados!$H$37,ROW(Empresas!$B$6:$B$46)-5),ROW($A51)),COLUMN(K$1)),\"\")","v":""},{"$f":"IFERROR(INDEX(Empresas!$B$6:$AS$46,SMALL(IF(Empresas!$B$6:$B$46=Dados!$H$37,ROW(Empresas!$B$6:$B$46)-5),ROW($A51)),COLUMN(L$1)),\"\")","v":""},{"$f":"IFERROR(INDEX(Empresas!$B$6:$AS$46,SMALL(IF(Empresas!$B$6:$B$46=Dados!$H$37,ROW(Empresas!$B$6:$B$46)-5),ROW($A51)),COLUMN(M$1)),\"\")","v":""},{"$f":"IFERROR(INDEX(Empresas!$B$6:$AS$46,SMALL(IF(Empresas!$B$6:$B$46=Dados!$H$37,ROW(Empresas!$B$6:$B$46)-5),ROW($A51)),COLUMN(N$1)),\"\")","v":""},{"$f":"IFERROR(INDEX(Empresas!$B$6:$AS$46,SMALL(IF(Empresas!$B$6:$B$46=Dados!$H$37,ROW(Empresas!$B$6:$B$46)-5),ROW($A51)),COLUMN(O$1)),\"\")","v":""},{"$f":"IFERROR(INDEX(Empresas!$B$6:$AS$46,SMALL(IF(Empresas!$B$6:$B$46=Dados!$H$37,ROW(Empresas!$B$6:$B$46)-5),ROW($A51)),COLUMN(P$1)),\"\")","v":""},{"$f":"IFERROR(INDEX(Empresas!$B$6:$AS$46,SMALL(IF(Empresas!$B$6:$B$46=Dados!$H$37,ROW(Empresas!$B$6:$B$46)-5),ROW($A51)),COLUMN(Q$1)),\"\")","v":""},{"$f":"IFERROR(INDEX(Empresas!$B$6:$AS$46,SMALL(IF(Empresas!$B$6:$B$46=Dados!$H$37,ROW(Empresas!$B$6:$B$46)-5),ROW($A51)),COLUMN(R$1)),\"\")","v":""},{"$f":"IFERROR(INDEX(Empresas!$B$6:$AS$46,SMALL(IF(Empresas!$B$6:$B$46=Dados!$H$37,ROW(Empresas!$B$6:$B$46)-5),ROW($A51)),COLUMN(S$1)),\"\")","v":""},{"$f":"IFERROR(INDEX(Empresas!$B$6:$AS$46,SMALL(IF(Empresas!$B$6:$B$46=Dados!$H$37,ROW(Empresas!$B$6:$B$46)-5),ROW($A51)),COLUMN(T$1)),\"\")","v":""},{"$f":"IFERROR(INDEX(Empresas!$B$6:$AS$46,SMALL(IF(Empresas!$B$6:$B$46=Dados!$H$37,ROW(Empresas!$B$6:$B$46)-5),ROW($A51)),COLUMN(U$1)),\"\")","v":""},{"$f":"IFERROR(INDEX(Empresas!$B$6:$AS$46,SMALL(IF(Empresas!$B$6:$B$46=Dados!$H$37,ROW(Empresas!$B$6:$B$46)-5),ROW($A51)),COLUMN(V$1)),\"\")","v":""},{"$f":"IFERROR(INDEX(Empresas!$B$6:$AS$46,SMALL(IF(Empresas!$B$6:$B$46=Dados!$H$37,ROW(Empresas!$B$6:$B$46)-5),ROW($A51)),COLUMN(W$1)),\"\")","v":""},{"$f":"IFERROR(INDEX(Empresas!$B$6:$AS$46,SMALL(IF(Empresas!$B$6:$B$46=Dados!$H$37,ROW(Empresas!$B$6:$B$46)-5),ROW($A51)),COLUMN(X$1)),\"\")","v":""},{"$f":"IFERROR(INDEX(Empresas!$B$6:$AS$46,SMALL(IF(Empresas!$B$6:$B$46=Dados!$H$37,ROW(Empresas!$B$6:$B$46)-5),ROW($A51)),COLUMN(Y$1)),\"\")","v":""},{"$f":"IFERROR(INDEX(Empresas!$B$6:$AS$46,SMALL(IF(Empresas!$B$6:$B$46=Dados!$H$37,ROW(Empresas!$B$6:$B$46)-5),ROW($A51)),COLUMN(Z$1)),\"\")","v":""},{"$f":"IFERROR(INDEX(Empresas!$B$6:$AS$46,SMALL(IF(Empresas!$B$6:$B$46=Dados!$H$37,ROW(Empresas!$B$6:$B$46)-5),ROW($A51)),COLUMN(AA$1)),\"\")","v":""},{"$f":"IFERROR(INDEX(Empresas!$B$6:$AS$46,SMALL(IF(Empresas!$B$6:$B$46=Dados!$H$37,ROW(Empresas!$B$6:$B$46)-5),ROW($A51)),COLUMN(AB$1)),\"\")","v":""},{"$f":"IFERROR(INDEX(Empresas!$B$6:$AS$46,SMALL(IF(Empresas!$B$6:$B$46=Dados!$H$37,ROW(Empresas!$B$6:$B$46)-5),ROW($A51)),COLUMN(AC$1)),\"\")","v":""},{"$f":"IFERROR(INDEX(Empresas!$B$6:$AS$46,SMALL(IF(Empresas!$B$6:$B$46=Dados!$H$37,ROW(Empresas!$B$6:$B$46)-5),ROW($A51)),COLUMN(AD$1)),\"\")","v":""},{"$f":"IFERROR(INDEX(Empresas!$B$6:$AS$46,SMALL(IF(Empresas!$B$6:$B$46=Dados!$H$37,ROW(Empresas!$B$6:$B$46)-5),ROW($A51)),COLUMN(AE$1)),\"\")","v":""},{"$f":"IFERROR(INDEX(Empresas!$B$6:$AS$46,SMALL(IF(Empresas!$B$6:$B$46=Dados!$H$37,ROW(Empresas!$B$6:$B$46)-5),ROW($A51)),COLUMN(AF$1)),\"\")","v":""},{"$f":"IFERROR(INDEX(Empresas!$B$6:$AS$46,SMALL(IF(Empresas!$B$6:$B$46=Dados!$H$37,ROW(Empresas!$B$6:$B$46)-5),ROW($A51)),COLUMN(AG$1)),\"\")","v":""},{"$f":"IFERROR(INDEX(Empresas!$B$6:$AS$46,SMALL(IF(Empresas!$B$6:$B$46=Dados!$H$37,ROW(Empresas!$B$6:$B$46)-5),ROW($A51)),COLUMN(AH$1)),\"\")","v":""},{"$f":"IFERROR(INDEX(Empresas!$B$6:$AS$46,SMALL(IF(Empresas!$B$6:$B$46=Dados!$H$37,ROW(Empresas!$B$6:$B$46)-5),ROW($A51)),COLUMN(AI$1)),\"\")","v":""},{"$f":"IFERROR(INDEX(Empresas!$B$6:$AS$46,SMALL(IF(Empresas!$B$6:$B$46=Dados!$H$37,ROW(Empresas!$B$6:$B$46)-5),ROW($A51)),COLUMN(AJ$1)),\"\")","v":""},{"$f":"IFERROR(INDEX(Empresas!$B$6:$AS$46,SMALL(IF(Empresas!$B$6:$B$46=Dados!$H$37,ROW(Empresas!$B$6:$B$46)-5),ROW($A51)),COLUMN(AK$1)),\"\")","v":""},{"$f":"IFERROR(INDEX(Empresas!$B$6:$AS$46,SMALL(IF(Empresas!$B$6:$B$46=Dados!$H$37,ROW(Empresas!$B$6:$B$46)-5),ROW($A51)),COLUMN(AL$1)),\"\")","v":""},{"$f":"IFERROR(INDEX(Empresas!$B$6:$AS$46,SMALL(IF(Empresas!$B$6:$B$46=Dados!$H$37,ROW(Empresas!$B$6:$B$46)-5),ROW($A51)),COLUMN(AM$1)),\"\")","v":""},{"$f":"IFERROR(INDEX(Empresas!$B$6:$AS$46,SMALL(IF(Empresas!$B$6:$B$46=Dados!$H$37,ROW(Empresas!$B$6:$B$46)-5),ROW($A51)),COLUMN(AN$1)),\"\")","v":""},{"$f":"IFERROR(INDEX(Empresas!$B$6:$AS$46,SMALL(IF(Empresas!$B$6:$B$46=Dados!$H$37,ROW(Empresas!$B$6:$B$46)-5),ROW($A51)),COLUMN(AO$1)),\"\")","v":""},{"$f":"IFERROR(INDEX(Empresas!$B$6:$AS$46,SMALL(IF(Empresas!$B$6:$B$46=Dados!$H$37,ROW(Empresas!$B$6:$B$46)-5),ROW($A51)),COLUMN(AP$1)),\"\")","v":""},{"$f":"IFERROR(INDEX(Empresas!$B$6:$AS$46,SMALL(IF(Empresas!$B$6:$B$46=Dados!$H$37,ROW(Empresas!$B$6:$B$46)-5),ROW($A51)),COLUMN(AQ$1)),\"\")","v":""},{"$f":"IFERROR(INDEX(Empresas!$B$6:$AS$46,SMALL(IF(Empresas!$B$6:$B$46=Dados!$H$37,ROW(Empresas!$B$6:$B$46)-5),ROW($A51)),COLUMN(AR$1)),\"\")","v":""}]
[null,{"$f":"IFERROR(INDEX(Empresas!$B$6:$AS$46,SMALL(IF(Empresas!$B$6:$B$46=Dados!$H$37,ROW(Empresas!$B$6:$B$46)-5),ROW($A52)),COLUMN(B$1)),\"\")","v":""},{"$f":"IFERROR(INDEX(Empresas!$B$6:$AS$46,SMALL(IF(Empresas!$B$6:$B$46=Dados!$H$37,ROW(Empresas!$B$6:$B$46)-5),ROW($A52)),COLUMN(C$1)),\"\")","v":""},"",{"$f":"IFERROR(INDEX(Empresas!$B$6:$AS$46,SMALL(IF(Empresas!$B$6:$B$46=Dados!$H$37,ROW(Empresas!$B$6:$B$46)-5),ROW($A52)),COLUMN(F$1)),\"\")","v":""},{"$f":"IFERROR(INDEX(Empresas!$B$6:$AS$46,SMALL(IF(Empresas!$B$6:$B$46=Dados!$H$37,ROW(Empresas!$B$6:$B$46)-5),ROW($A52)),COLUMN(G$1)),\"\")","v":""},{"$f":"IFERROR(INDEX(Empresas!$B$6:$AS$46,SMALL(IF(Empresas!$B$6:$B$46=Dados!$H$37,ROW(Empresas!$B$6:$B$46)-5),ROW($A52)),COLUMN(H$1)),\"\")","v":""},{"$f":"IFERROR(INDEX(Empresas!$B$6:$AS$46,SMALL(IF(Empresas!$B$6:$B$46=Dados!$H$37,ROW(Empresas!$B$6:$B$46)-5),ROW($A52)),COLUMN(I$1)),\"\")","v":""},{"$f":"IFERROR(INDEX(Empresas!$B$6:$AS$46,SMALL(IF(Empresas!$B$6:$B$46=Dados!$H$37,ROW(Empresas!$B$6:$B$46)-5),ROW($A52)),COLUMN(J$1)),\"\")","v":""},{"$f":"IFERROR(INDEX(Empresas!$B$6:$AS$46,SMALL(IF(Empresas!$B$6:$B$46=Dados!$H$37,ROW(Empresas!$B$6:$B$46)-5),ROW($A52)),COLUMN(K$1)),\"\")","v":""},{"$f":"IFERROR(INDEX(Empresas!$B$6:$AS$46,SMALL(IF(Empresas!$B$6:$B$46=Dados!$H$37,ROW(Empresas!$B$6:$B$46)-5),ROW($A52)),COLUMN(L$1)),\"\")","v":""},{"$f":"IFERROR(INDEX(Empresas!$B$6:$AS$46,SMALL(IF(Empresas!$B$6:$B$46=Dados!$H$37,ROW(Empresas!$B$6:$B$46)-5),ROW($A52)),COLUMN(M$1)),\"\")","v":""},{"$f":"IFERROR(INDEX(Empresas!$B$6:$AS$46,SMALL(IF(Empresas!$B$6:$B$46=Dados!$H$37,ROW(Empresas!$B$6:$B$46)-5),ROW($A52)),COLUMN(N$1)),\"\")","v":""},{"$f":"IFERROR(INDEX(Empresas!$B$6:$AS$46,SMALL(IF(Empresas!$B$6:$B$46=Dados!$H$37,ROW(Empresas!$B$6:$B$46)-5),ROW($A52)),COLUMN(O$1)),\"\")","v":""},{"$f":"IFERROR(INDEX(Empresas!$B$6:$AS$46,SMALL(IF(Empresas!$B$6:$B$46=Dados!$H$37,ROW(Empresas!$B$6:$B$46)-5),ROW($A52)),COLUMN(P$1)),\"\")","v":""},{"$f":"IFERROR(INDEX(Empresas!$B$6:$AS$46,SMALL(IF(Empresas!$B$6:$B$46=Dados!$H$37,ROW(Empresas!$B$6:$B$46)-5),ROW($A52)),COLUMN(Q$1)),\"\")","v":""},{"$f":"IFERROR(INDEX(Empresas!$B$6:$AS$46,SMALL(IF(Empresas!$B$6:$B$46=Dados!$H$37,ROW(Empresas!$B$6:$B$46)-5),ROW($A52)),COLUMN(R$1)),\"\")","v":""},{"$f":"IFERROR(INDEX(Empresas!$B$6:$AS$46,SMALL(IF(Empresas!$B$6:$B$46=Dados!$H$37,ROW(Empresas!$B$6:$B$46)-5),ROW($A52)),COLUMN(S$1)),\"\")","v":""},{"$f":"IFERROR(INDEX(Empresas!$B$6:$AS$46,SMALL(IF(Empresas!$B$6:$B$46=Dados!$H$37,ROW(Empresas!$B$6:$B$46)-5),ROW($A52)),COLUMN(T$1)),\"\")","v":""},{"$f":"IFERROR(INDEX(Empresas!$B$6:$AS$46,SMALL(IF(Empresas!$B$6:$B$46=Dados!$H$37,ROW(Empresas!$B$6:$B$46)-5),ROW($A52)),COLUMN(U$1)),\"\")","v":""},{"$f":"IFERROR(INDEX(Empresas!$B$6:$AS$46,SMALL(IF(Empresas!$B$6:$B$46=Dados!$H$37,ROW(Empresas!$B$6:$B$46)-5),ROW($A52)),COLUMN(V$1)),\"\")","v":""},{"$f":"IFERROR(INDEX(Empresas!$B$6:$AS$46,SMALL(IF(Empresas!$B$6:$B$46=Dados!$H$37,ROW(Empresas!$B$6:$B$46)-5),ROW($A52)),COLUMN(W$1)),\"\")","v":""},{"$f":"IFERROR(INDEX(Empresas!$B$6:$AS$46,SMALL(IF(Empresas!$B$6:$B$46=Dados!$H$37,ROW(Empresas!$B$6:$B$46)-5),ROW($A52)),COLUMN(X$1)),\"\")","v":""},{"$f":"IFERROR(INDEX(Empresas!$B$6:$AS$46,SMALL(IF(Empresas!$B$6:$B$46=Dados!$H$37,ROW(Empresas!$B$6:$B$46)-5),ROW($A52)),COLUMN(Y$1)),\"\")","v":""},{"$f":"IFERROR(INDEX(Empresas!$B$6:$AS$46,SMALL(IF(Empresas!$B$6:$B$46=Dados!$H$37,ROW(Empresas!$B$6:$B$46)-5),ROW($A52)),COLUMN(Z$1)),\"\")","v":""},{"$f":"IFERROR(INDEX(Empresas!$B$6:$AS$46,SMALL(IF(Empresas!$B$6:$B$46=Dados!$H$37,ROW(Empresas!$B$6:$B$46)-5),ROW($A52)),COLUMN(AA$1)),\"\")","v":""},{"$f":"IFERROR(INDEX(Empresas!$B$6:$AS$46,SMALL(IF(Empresas!$B$6:$B$46=Dados!$H$37,ROW(Empresas!$B$6:$B$46)-5),ROW($A52)),COLUMN(AB$1)),\"\")","v":""},{"$f":"IFERROR(INDEX(Empresas!$B$6:$AS$46,SMALL(IF(Empresas!$B$6:$B$46=Dados!$H$37,ROW(Empresas!$B$6:$B$46)-5),ROW($A52)),COLUMN(AC$1)),\"\")","v":""},{"$f":"IFERROR(INDEX(Empresas!$B$6:$AS$46,SMALL(IF(Empresas!$B$6:$B$46=Dados!$H$37,ROW(Empresas!$B$6:$B$46)-5),ROW($A52)),COLUMN(AD$1)),\"\")","v":""},{"$f":"IFERROR(INDEX(Empresas!$B$6:$AS$46,SMALL(IF(Empresas!$B$6:$B$46=Dados!$H$37,ROW(Empresas!$B$6:$B$46)-5),ROW($A52)),COLUMN(AE$1)),\"\")","v":""},{"$f":"IFERROR(INDEX(Empresas!$B$6:$AS$46,SMALL(IF(Empresas!$B$6:$B$46=Dados!$H$37,ROW(Empresas!$B$6:$B$46)-5),ROW($A52)),COLUMN(AF$1)),\"\")","v":""},{"$f":"IFERROR(INDEX(Empresas!$B$6:$AS$46,SMALL(IF(Empresas!$B$6:$B$46=Dados!$H$37,ROW(Empresas!$B$6:$B$46)-5),ROW($A52)),COLUMN(AG$1)),\"\")","v":""},{"$f":"IFERROR(INDEX(Empresas!$B$6:$AS$46,SMALL(IF(Empresas!$B$6:$B$46=Dados!$H$37,ROW(Empresas!$B$6:$B$46)-5),ROW($A52)),COLUMN(AH$1)),\"\")","v":""},{"$f":"IFERROR(INDEX(Empresas!$B$6:$AS$46,SMALL(IF(Empresas!$B$6:$B$46=Dados!$H$37,ROW(Empresas!$B$6:$B$46)-5),ROW($A52)),COLUMN(AI$1)),\"\")","v":""},{"$f":"IFERROR(INDEX(Empresas!$B$6:$AS$46,SMALL(IF(Empresas!$B$6:$B$46=Dados!$H$37,ROW(Empresas!$B$6:$B$46)-5),ROW($A52)),COLUMN(AJ$1)),\"\")","v":""},{"$f":"IFERROR(INDEX(Empresas!$B$6:$AS$46,SMALL(IF(Empresas!$B$6:$B$46=Dados!$H$37,ROW(Empresas!$B$6:$B$46)-5),ROW($A52)),COLUMN(AK$1)),\"\")","v":""},{"$f":"IFERROR(INDEX(Empresas!$B$6:$AS$46,SMALL(IF(Empresas!$B$6:$B$46=Dados!$H$37,ROW(Empresas!$B$6:$B$46)-5),ROW($A52)),COLUMN(AL$1)),\"\")","v":""},{"$f":"IFERROR(INDEX(Empresas!$B$6:$AS$46,SMALL(IF(Empresas!$B$6:$B$46=Dados!$H$37,ROW(Empresas!$B$6:$B$46)-5),ROW($A52)),COLUMN(AM$1)),\"\")","v":""},{"$f":"IFERROR(INDEX(Empresas!$B$6:$AS$46,SMALL(IF(Empresas!$B$6:$B$46=Dados!$H$37,ROW(Empresas!$B$6:$B$46)-5),ROW($A52)),COLUMN(AN$1)),\"\")","v":""},{"$f":"IFERROR(INDEX(Empresas!$B$6:$AS$46,SMALL(IF(Empresas!$B$6:$B$46=Dados!$H$37,ROW(Empresas!$B$6:$B$46)-5),ROW($A52)),COLUMN(AO$1)),\"\")","v":""},{"$f":"IFERROR(INDEX(Empresas!$B$6:$AS$46,SMALL(IF(Empresas!$B$6:$B$46=Dados!$H$37,ROW(Empresas!$B$6:$B$46)-5),ROW($A52)),COLUMN(AP$1)),\"\")","v":""},{"$f":"IFERROR(INDEX(Empresas!$B$6:$AS$46,SMALL(IF(Empresas!$B$6:$B$46=Dados!$H$37,ROW(Empresas!$B$6:$B$46)-5),ROW($A52)),COLUMN(AQ$1)),\"\")","v":""},{"$f":"IFERROR(INDEX(Empresas!$B$6:$AS$46,SMALL(IF(Empresas!$B$6:$B$46=Dados!$H$37,ROW(Empresas!$B$6:$B$46)-5),ROW($A52)),COLUMN(AR$1)),\"\")","v":""}]
[null,{"$f":"IFERROR(INDEX(Empresas!$B$6:$AS$46,SMALL(IF(Empresas!$B$6:$B$46=Dados!$H$37,ROW(Empresas!$B$6:$B$46)-5),ROW($A53)),COLUMN(B$1)),\"\")","v":""},{"$f":"IFERROR(INDEX(Empresas!$B$6:$AS$46,SMALL(IF(Empresas!$B$6:$B$46=Dados!$H$37,ROW(Empresas!$B$6:$B$46)-5),ROW($A53)),COLUMN(C$1)),\"\")","v":""},"",{"$f":"IFERROR(INDEX(Empresas!$B$6:$AS$46,SMALL(IF(Empresas!$B$6:$B$46=Dados!$H$37,ROW(Empresas!$B$6:$B$46)-5),ROW($A53)),COLUMN(F$1)),\"\")","v":""},{"$f":"IFERROR(INDEX(Empresas!$B$6:$AS$46,SMALL(IF(Empresas!$B$6:$B$46=Dados!$H$37,ROW(Empresas!$B$6:$B$46)-5),ROW($A53)),COLUMN(G$1)),\"\")","v":""},{"$f":"IFERROR(INDEX(Empresas!$B$6:$AS$46,SMALL(IF(Empresas!$B$6:$B$46=Dados!$H$37,ROW(Empresas!$B$6:$B$46)-5),ROW($A53)),COLUMN(H$1)),\"\")","v":""},{"$f":"IFERROR(INDEX(Empresas!$B$6:$AS$46,SMALL(IF(Empresas!$B$6:$B$46=Dados!$H$37,ROW(Empresas!$B$6:$B$46)-5),ROW($A53)),COLUMN(I$1)),\"\")","v":""},{"$f":"IFERROR(INDEX(Empresas!$B$6:$AS$46,SMALL(IF(Empresas!$B$6:$B$46=Dados!$H$37,ROW(Empresas!$B$6:$B$46)-5),ROW($A53)),COLUMN(J$1)),\"\")","v":""},{"$f":"IFERROR(INDEX(Empresas!$B$6:$AS$46,SMALL(IF(Empresas!$B$6:$B$46=Dados!$H$37,ROW(Empresas!$B$6:$B$46)-5),ROW($A53)),COLUMN(K$1)),\"\")","v":""},{"$f":"IFERROR(INDEX(Empresas!$B$6:$AS$46,SMALL(IF(Empresas!$B$6:$B$46=Dados!$H$37,ROW(Empresas!$B$6:$B$46)-5),ROW($A53)),COLUMN(L$1)),\"\")","v":""},{"$f":"IFERROR(INDEX(Empresas!$B$6:$AS$46,SMALL(IF(Empresas!$B$6:$B$46=Dados!$H$37,ROW(Empresas!$B$6:$B$46)-5),ROW($A53)),COLUMN(M$1)),\"\")","v":""},{"$f":"IFERROR(INDEX(Empresas!$B$6:$AS$46,SMALL(IF(Empresas!$B$6:$B$46=Dados!$H$37,ROW(Empresas!$B$6:$B$46)-5),ROW($A53)),COLUMN(N$1)),\"\")","v":""},{"$f":"IFERROR(INDEX(Empresas!$B$6:$AS$46,SMALL(IF(Empresas!$B$6:$B$46=Dados!$H$37,ROW(Empresas!$B$6:$B$46)-5),ROW($A53)),COLUMN(O$1)),\"\")","v":""},{"$f":"IFERROR(INDEX(Empresas!$B$6:$AS$46,SMALL(IF(Empresas!$B$6:$B$46=Dados!$H$37,ROW(Empresas!$B$6:$B$46)-5),ROW($A53)),COLUMN(P$1)),\"\")","v":""},{"$f":"IFERROR(INDEX(Empresas!$B$6:$AS$46,SMALL(IF(Empresas!$B$6:$B$46=Dados!$H$37,ROW(Empresas!$B$6:$B$46)-5),ROW($A53)),COLUMN(Q$1)),\"\")","v":""},{"$f":"IFERROR(INDEX(Empresas!$B$6:$AS$46,SMALL(IF(Empresas!$B$6:$B$46=Dados!$H$37,ROW(Empresas!$B$6:$B$46)-5),ROW($A53)),COLUMN(R$1)),\"\")","v":""},{"$f":"IFERROR(INDEX(Empresas!$B$6:$AS$46,SMALL(IF(Empresas!$B$6:$B$46=Dados!$H$37,ROW(Empresas!$B$6:$B$46)-5),ROW($A53)),COLUMN(S$1)),\"\")","v":""},{"$f":"IFERROR(INDEX(Empresas!$B$6:$AS$46,SMALL(IF(Empresas!$B$6:$B$46=Dados!$H$37,ROW(Empresas!$B$6:$B$46)-5),ROW($A53)),COLUMN(T$1)),\"\")","v":""},{"$f":"IFERROR(INDEX(Empresas!$B$6:$AS$46,SMALL(IF(Empresas!$B$6:$B$46=Dados!$H$37,ROW(Empresas!$B$6:$B$46)-5),ROW($A53)),COLUMN(U$1)),\"\")","v":""},{"$f":"IFERROR(INDEX(Empresas!$B$6:$AS$46,SMALL(IF(Empresas!$B$6:$B$46=Dados!$H$37,ROW(Empresas!$B$6:$B$46)-5),ROW($A53)),COLUMN(V$1)),\"\")","v":""},{"$f":"IFERROR(INDEX(Empresas!$B$6:$AS$46,SMALL(IF(Empresas!$B$6:$B$46=Dados!$H$37,ROW(Empresas!$B$6:$B$46)-5),ROW($A53)),COLUMN(W$1)),\"\")","v":""},{"$f":"IFERROR(INDEX(Empresas!$B$6:$AS$46,SMALL(IF(Empresas!$B$6:$B$46=Dados!$H$37,ROW(Empresas!$B$6:$B$46)-5),ROW($A53)),COLUMN(X$1)),\"\")","v":""},{"$f":"IFERROR(INDEX(Empresas!$B$6:$AS$46,SMALL(IF(Empresas!$B$6:$B$46=Dados!$H$37,ROW(Empresas!$B$6:$B$46)-5),ROW($A53)),COLUMN(Y$1)),\"\")","v":""},{"$f":"IFERROR(INDEX(Empresas!$B$6:$AS$46,SMALL(IF(Empresas!$B$6:$B$46=Dados!$H$37,ROW(Empresas!$B$6:$B$46)-5),ROW($A53)),COLUMN(Z$1)),\"\")","v":""},{"$f":"IFERROR(INDEX(Empresas!$B$6:$AS$46,SMALL(IF(Empresas!$B$6:$B$46=Dados!$H$37,ROW(Empresas!$B$6:$B$46)-5),ROW($A53)),COLUMN(AA$1)),\"\")","v":""},{"$f":"IFERROR(INDEX(Empresas!$B$6:$AS$46,SMALL(IF(Empresas!$B$6:$B$46=Dados!$H$37,ROW(Empresas!$B$6:$B$46)-5),ROW($A53)),COLUMN(AB$1)),\"\")","v":""},{"$f":"IFERROR(INDEX(Empresas!$B$6:$AS$46,SMALL(IF(Empresas!$B$6:$B$46=Dados!$H$37,ROW(Empresas!$B$6:$B$46)-5),ROW($A53)),COLUMN(AC$1)),\"\")","v":""},{"$f":"IFERROR(INDEX(Empresas!$B$6:$AS$46,SMALL(IF(Empresas!$B$6:$B$46=Dados!$H$37,ROW(Empresas!$B$6:$B$46)-5),ROW($A53)),COLUMN(AD$1)),\"\")","v":""},{"$f":"IFERROR(INDEX(Empresas!$B$6:$AS$46,SMALL(IF(Empresas!$B$6:$B$46=Dados!$H$37,ROW(Empresas!$B$6:$B$46)-5),ROW($A53)),COLUMN(AE$1)),\"\")","v":""},{"$f":"IFERROR(INDEX(Empresas!$B$6:$AS$46,SMALL(IF(Empresas!$B$6:$B$46=Dados!$H$37,ROW(Empresas!$B$6:$B$46)-5),ROW($A53)),COLUMN(AF$1)),\"\")","v":""},{"$f":"IFERROR(INDEX(Empresas!$B$6:$AS$46,SMALL(IF(Empresas!$B$6:$B$46=Dados!$H$37,ROW(Empresas!$B$6:$B$46)-5),ROW($A53)),COLUMN(AG$1)),\"\")","v":""},{"$f":"IFERROR(INDEX(Empresas!$B$6:$AS$46,SMALL(IF(Empresas!$B$6:$B$46=Dados!$H$37,ROW(Empresas!$B$6:$B$46)-5),ROW($A53)),COLUMN(AH$1)),\"\")","v":""},{"$f":"IFERROR(INDEX(Empresas!$B$6:$AS$46,SMALL(IF(Empresas!$B$6:$B$46=Dados!$H$37,ROW(Empresas!$B$6:$B$46)-5),ROW($A53)),COLUMN(AI$1)),\"\")","v":""},{"$f":"IFERROR(INDEX(Empresas!$B$6:$AS$46,SMALL(IF(Empresas!$B$6:$B$46=Dados!$H$37,ROW(Empresas!$B$6:$B$46)-5),ROW($A53)),COLUMN(AJ$1)),\"\")","v":""},{"$f":"IFERROR(INDEX(Empresas!$B$6:$AS$46,SMALL(IF(Empresas!$B$6:$B$46=Dados!$H$37,ROW(Empresas!$B$6:$B$46)-5),ROW($A53)),COLUMN(AK$1)),\"\")","v":""},{"$f":"IFERROR(INDEX(Empresas!$B$6:$AS$46,SMALL(IF(Empresas!$B$6:$B$46=Dados!$H$37,ROW(Empresas!$B$6:$B$46)-5),ROW($A53)),COLUMN(AL$1)),\"\")","v":""},{"$f":"IFERROR(INDEX(Empresas!$B$6:$AS$46,SMALL(IF(Empresas!$B$6:$B$46=Dados!$H$37,ROW(Empresas!$B$6:$B$46)-5),ROW($A53)),COLUMN(AM$1)),\"\")","v":""},{"$f":"IFERROR(INDEX(Empresas!$B$6:$AS$46,SMALL(IF(Empresas!$B$6:$B$46=Dados!$H$37,ROW(Empresas!$B$6:$B$46)-5),ROW($A53)),COLUMN(AN$1)),\"\")","v":""},{"$f":"IFERROR(INDEX(Empresas!$B$6:$AS$46,SMALL(IF(Empresas!$B$6:$B$46=Dados!$H$37,ROW(Empresas!$B$6:$B$46)-5),ROW($A53)),COLUMN(AO$1)),\"\")","v":""},{"$f":"IFERROR(INDEX(Empresas!$B$6:$AS$46,SMALL(IF(Empresas!$B$6:$B$46=Dados!$H$37,ROW(Empresas!$B$6:$B$46)-5),ROW($A53)),COLUMN(AP$1)),\"\")","v":""},{"$f":"IFERROR(INDEX(Empresas!$B$6:$AS$46,SMALL(IF(Empresas!$B$6:$B$46=Dados!$H$37,ROW(Empresas!$B$6:$B$46)-5),ROW($A53)),COLUMN(AQ$1)),\"\")","v":""},{"$f":"IFERROR(INDEX(Empresas!$B$6:$AS$46,SMALL(IF(Empresas!$B$6:$B$46=Dados!$H$37,ROW(Empresas!$B$6:$B$46)-5),ROW($A53)),COLUMN(AR$1)),\"\")","v":""}]

{"sheet":"Planilha (B)","index":4,"n_rows":44,"n_cols":12,"rows_kept":44,"cut":false,"hidden":false,"merged":[[41,6,41,8],[1,2,1,3],[5,2,5,3],[37,6,37,8],[37,9,37,11],[3,2,3,12],[29,9,29,11],[33,3,33,5],[33,6,33,8],[33,9,33,11],[37,3,37,5],[25,3,25,5],[25,6,25,8],[25,9,25,11],[29,3,29,5],[29,6,29,8]]}
[]
[null,"REF",{"$f":"INDEX('Planilha (A)'!$B$25:$B$76,MATCH('Planilha (B)'!$C$4,'Planilha (A)'!$C$25:$C$76,0))","v":13}]
[]
[null,"Empresa","EMPRESA 13"]
[]
[null,"Sigla",{"$f":"VLOOKUP(C4,Empresas!$D$6:$E$46,2,0)","v":"EMP13"}]
[]
[]
[]
[null,null,null,null,"Federação",{"$f":"C6","v":"EMP13"},{"$f":"Dados!H37","v":"DF"}]
[null,null,null,null,{"$f":"UF!$E$2","v":2017},{"$f":"INDEX(Dados!$H$86:$U$135,MATCH('Planilha (B)'!$C$2,Dados!$H$86:$H$135,0),ROW('Planilha (B)'!E11)-9)","v":0.25},{"$f":"INDEX(Dados!$H$71:$P$83,ROW(E11)-10,periodo)","v":0.45251396648044695}]
[null,null,null,null,{"$f":"UF!$H$2","v":"JANEIRO"},{"$f":"INDEX(Dados!$H$86:$U$135,MATCH('Planilha (B)'!$C$2,Dados!$H$86:$H$135,0),ROW('Planilha (B)'!E12)-9)","v":0.40277777777777779},{"$f":"INDEX(Dados!$H$71:$P$83,ROW(E12)-10,periodo)","v":0.48044692737430167}]
[null,null,null,null,{"$f":"UF!$K$2","v":"FEVEREIRO"},{"$f":"INDEX(Dados!$H$86:$U$135,MATCH('Planilha (B)'!$C$2,Dados!$H$86:$H$135,0),ROW('Planilha (B)'!E13)-9)","v":{"$error":"#N/A"}},{"$f":"INDEX(Dados!$H$71:$P$83,ROW(E13)-10,periodo)","v":{"$error":"#N/A"}}]
[null,null,null,null,{"$f":"UF!$N$2","v":"MARÇO"},{"$f":"INDEX(Dados!$H$86:$U$135,MATCH('Planilha (B)'!$C$2,Dados!$H$86:$H$135,0),ROW('Planilha (B)'!E14)-9)","v":{"$error":"#N/A"}},{"$f":"INDEX(Dados!$H$71:$P$83,ROW(E14)-10,periodo)","v":{"$error":"#N/A"}}]
[null,null,null,null,{"$f":"UF!$Q$2","v":"ABRIL"},{"$f":"INDEX(Dados!$H$86:$U$135,MATCH('Planilha (B)'!$C$2,Dados!$H$86:$H$135,0),ROW('Planilha (B)'!E15)-9)","v":{"$error":"#N/A"}},{"$f":"INDEX(Dados!$H$71:$P$83,ROW(E15)-10,periodo)","v":{"$error":"#N/A"}}]
[null,null,null,null,{"$f":"UF!$T$2","v":"MAIO"},{"$f":"INDEX(Dados!$H$86:$U$135,MATCH('Planilha (B)'!$C$2,Dados!$H$86:$H$135,0),ROW('Planilha (B)'!E16)-9)","v":{"$error":"#N/A"}},{"$f":"INDEX(Dados!$H$71:$P$83,ROW(E16)-10,periodo)","v":{"$error":"#N/A"}}]
[null,null,null,null,{"$f":"UF!$W$2","v":"JUNHO"},{"$f":"INDEX(Dados!$H$86:$U$135,MATCH('Planilha (B)'!$C$2,Dados!$H$86:$H$135,0),ROW('Planilha (B)'!E17)-9)","v":{"$error":"#N/A"}},{"$f":"INDEX(Dados!$H$71:$P$83,ROW(E17)-10,periodo)","v":{"$error":"#N/A"}}]
[null,null,null,null,{"$f":"UF!$Z$2","v":"JULHO"},{"$f":"INDEX(Dados!$H$86:$U$135,MATCH('Planilha (B)'!$C$2,Dados!$H$86:$H$135,0),ROW('Planilha (B)'!E18)-9)","v":{"$error":"#N/A"}},{"$f":"INDEX(Dados!$H$71:$P$83,ROW(E18)-10,periodo)","v":{"$error":"#N/A"}}]
[null,null,null,null,{"$f":"UF!$AC$2","v":"AGOSTO"},{"$f":"INDEX(Dados!$H$86:$U$135,MATCH('Planilha (B)'!$C$2,Dados!$H$86:$H$135,0),ROW('Planilha (B)'!E19)-9)","v":{"$error":"#N/A"}},{"$f":"INDEX(Dados!$H$71:$P$83,ROW(E19)-10,periodo)","v":{"$error":"#N/A"}}]
[null,null,null,null,{"$f":"UF!$AF$2","v":"SETEMBRO"},{"$f":"INDEX(Dados!$H$86:$U$135,MATCH('Planilha (B)'!$C$2,Dados!$H$86:$H$135,0),ROW('Planilha (B)'!E20)-9)","v":{"$error":"#N/A"}},{"$f":"INDEX(Dados!$H$71:$P$83,ROW(E20)-10,periodo)","v":{"$error":"#N/A"}}]
[null,null,null,null,{"$f":"UF!$AI$2","v":"OUTUBRO"},{"$f":"INDEX(Dados!$H$86:$U$135,MATCH('Planilha (B)'!$C$2,Dados!$H$86:$H$135,0),ROW('Planilha (B)'!E21)-9)","v":{"$error":"#N/A"}},{"$f":"INDEX(Dados!$H$71:$P$83,ROW(E21)-10,periodo)","v":{"$error":"#N/A"}}]
[null,null,null,null,{"$f":"UF!$AL$2","v":"NOVEMBRO"},{"$f":"INDEX(Dados!$H$86:$U$135,MATCH('Planilha (B)'!$C$2,Dados!$H$86:$H$135,0),ROW('Planilha (B)'!E22)-9)","v":{"$error":"#N/A"}},{"$f":"INDEX(Dados!$H$71:$P$83,ROW(E22)-10,periodo)","v":{"$error":"#N/A"}}]
[null,null,null,null,{"$f":"UF!$AO$2","v":"DEZEMBRO"},{"$f":"INDEX(Dados!$H$86:$U$135,MATCH('Planilha (B)'!$C$2,Dados!$H$86:$H$135,0),ROW('Planilha (B)'!E23)-9)","v":{"$error":"#N/A"}},{"$f":"INDEX(Dados!$H$71:$P$83,ROW(E23)-10,periodo)","v":{"$error":"#N/A"}}]
[]
[]
[null,null,null,"JANEIRO",null,null,"FEVEREIRO",null,null,"MARÇO"]
[null,null,null,"Serviços Demandados","Serviços Atendidos","% Atendimento","Serviços Demandados","Serviços Atendidos","% Atendimento","Serviços Demandados","Serviços Atendidos","% Atendimento"]
[null,null,null,{"$f":"VLOOKUP($C$2,Empresas!$C$6:$AS$46,COLUMN(G27)+1,0)","v":72},{"$f":"VLOOKUP($C$2,Empresas!$C$6:$AS$46,COLUMN(H27)+1,0)","v":29},{"$f":"VLOOKUP($C$2,Empresas!$C$6:$AS$46,COLUMN(I27)+1,0)","v":0.40277777777777779},{"$f":"VLOOKUP($C$2,Empresas!$C$6:$AS$46,COLUMN(J27)+1,0)","v":""},{"$f":"VLOOKUP($C$2,Empresas!$C$6:$AS$46,COLUMN(K27)+1,0)","v":""},{"$f":"VLOOKUP($C$2,Empresas!$C$6:$AS$46,COLUMN(L27)+1,0)","v":""},{"$f":"VLOOKUP($C$2,Empresas!$C$6:$AS$46,COLUMN(M27)+1,0)","v":""},{"$f":"VLOOKUP($C$2,Empresas!$C$6:$AS$46,COLUMN(N27)+1,0)","v":""},{"$f":"VLOOKUP($C$2,Empresas!$C$6:$AS$46,COLUMN(O27)+1,0)","v":""}]
[]
[null,{"$f":"Empresas!F4","v":"JANEIRO"},null,"ABRIL",null,null,"MAIO",null,null,"JUNHO"]
[null,{"$f":"Empresas!F5","v":"Comparativo \n2017 / JANEIRO"},null,"Serviços Demandados","Serviços Atendidos","% Atendimento","Serviços Demandados","Serviços Atendidos","% Atendimento","Serviços Demandados","Serviços Atendidos","% Atendimento"]
[null,{"$f":"VLOOKUP($C$2,Empresas!$C$6:$AS$46,COLUMN(D31),0)","v":1},null,{"$f":"VLOOKUP($C$2,Empresas!$C$6:$AS$46,COLUMN(P27)+1,0)","v":""},{"$f":"VLOOKUP($C$2,Empresas!$C$6:$AS$46,COLUMN(Q27)+1,0)","v":""},{"$f":"VLOOKUP($C$2,Empresas!$C$6:$AS$46,COLUMN(R27)+1,0)","v":""},{"$f":"VLOOKUP($C$2,Empresas!$C$6:$AS$46,COLUMN(S27)+1,0)","v":""},{"$f":"VLOOKUP($C$2,Empresas!$C$6:$AS$46,COLUMN(T27)+1,0)","v":""},{"$f":"VLOOKUP($C$2,Empresas!$C$6:$AS$46,COLUMN(U27)+1,0)","v":""},{"$f":"VLOOKUP($C$2,Empresas!$C$6:$AS$46,COLUMN(V27)+1,0)","v":""},{"$f":"VLOOKUP($C$2,Empresas!$C$6:$AS$46,COLUMN(W27)+1,0)","v":""},{"$f":"VLOOKUP($C$2,Empresas!$C$6:$AS$46,COLUMN(X27)+1,0)","v":""}]
[]
[null,null,null,"JULHO",null,null,"AGOSTO",null,null,"SETEMBRO"]
[null,null,null,"Serviços Demandados","Serviços Atendidos","% Atendimento","Serviços Demandados","Serviços Atendidos","% Atendimento","Serviços Demandados","Serviços Atendidos","% Atendimento"]
[null,null,null,{"$f":"VLOOKUP($C$2,Empresas!$C$6:$AS$46,COLUMN(Y27)+1,0)","v":""},{"$f":"VLOOKUP($C$2,Empresas!$C$6:$AS$46,COLUMN(Z27)+1,0)","v":""},{"$f":"VLOOKUP($C$2,Empresas!$C$6:$AS$46,COLUMN(AA27)+1,0)","v":""},{"$f":"VLOOKUP($C$2,Empresas!$C$6:$AS$46,COLUMN(AB27)+1,0)","v":""},{"$f":"VLOOKUP($C$2,Empresas!$C$6:$AS$46,COLUMN(AC27)+1,0)","v":""},{"$f":"VLOOKUP($C$2,Empresas!$C$6:$AS$46,COLUMN(AD27)+1,0)","v":""},{"$f":"VLOOKUP($C$2,Empresas!$C$6:$AS$46,COLUMN(AE27)+1,0)","v":""},{"$f":"VLOOKUP($C$2,Empresas!$C$6:$AS$46,COLUMN(AF27)+1,0)","v":""},{"$f":"VLOOKUP($C$2,Empresas!$C$6:$AS$46,COLUMN(AG27)+1,0)","v":""}]
[]
[null,null,null,"OUTUBRO",null,null,"NOVEMBRO",null,null,"DEZEMBRO"]
[null,null,null,"Serviços Demandados","Serviços Atendidos","% Atendimento","Serviços Demandados","Serviços Atendidos","% Atendimento","Serviços Demandados","Serviços Atendidos","% Atendimento"]
[null,null,null,{"$f":"VLOOKUP($C$2,Empresas!$C$6:$AS$46,COLUMN(AH27)+1,0)","v":""},{"$f":"VLOOKUP($C$2,Empresas!$C$6:$AS$46,COLUMN(AI27)+1,0)","v":""},{"$f":"VLOOKUP($C$2,Empresas!$C$6:$AS$46,COLUMN(AJ27)+1,0)","v":""},{"$f":"VLOOKUP($C$2,Empresas!$C$6:$AS$46,COLUMN(AK27)+1,0)","v":""},{"$f":"VLOOKUP($C$2,Empresas!$C$6:$AS$46,COLUMN(AL27)+1,0)","v":""},{"$f":"VLOOKUP($C$2,Empresas!$C$6:$AS$46,COLUMN(AM27)+1,0)","v":""},{"$f":"VLOOKUP($C$2,Empresas!$C$6:$AS$46,COLUMN(AN27)+1,0)","v":""},{"$f":"VLOOKUP($C$2,Empresas!$C$6:$AS$46,COLUMN(AO27)+1,0)","v":""},{"$f":"VLOOKUP($C$2,Empresas!$C$6:$AS$46,COLUMN(AP27)+1,0)","v":""}]
[]
[null,null,null,null,null,null,2017]
[null,null,null,null,null,null,"Serviços Demandados","Serviços Atendidos","% Atendimento"]
[null,null,null,null,null,null,{"$f":"VLOOKUP($C$2,Empresas!$C$6:$AS$46,COLUMN(G43)+1,0)","v":72},{"$f":"VLOOKUP($C$2,Empresas!$C$6:$AS$46,COLUMN(H43)+1,0)","v":29},{"$f":"VLOOKUP($C$2,Empresas!$C$6:$AS$46,COLUMN(I43)+1,0)","v":0.40277777777777779}]